Organisation Name,NACS Code,Organisation Type,Address1,Address2,Address3,Address4,Address5,PostCode,Telephone Number,Information supplied by,Value  (Information supplied by),Banding Classification  (Information supplied by)
Infant Feeding Peer Support Groups - Support For Feeding Your Baby,,GDOS,St Johns Hall,Alverton Street,,Penzance,Cornwall,TR18 2QW,,Breastfeeding group support from trained volunteers. These are groups run by local parents in Local Family Hubs and managed by the Health Visiting In... <a href="https://www.netmums.com/local/l/infant-feeding-peer-support-groups-support-for-feeding-your-baby">Read more</a>,,
Infant Feeding Peer Support Groups - Support For Feeding Your Baby,,GDOS,Hayle Family Hub,Bodriggy Street,,Hayle,Cornwall,TR27 4ND,,Breastfeeding group support from trained volunteers. These are groups run by local parents in Local Family Hubs and managed by the Health Visiting Inf... <a href="https://www.netmums.com/local/l/infant-feeding-peer-support-groups-support-for-feeding-your-baby-13">Read more</a>,,
More Than Milk Breastfeeding Support By Louise Barnett,,GDOS,In your own home,,,Cornwall,,TR27 5DA,Tel: 07916645226,Bookable private sessions in the comfort of your own home with Louise Barnett. I am an international board certified lactation consultant covering Cor... <a href="https://www.netmums.com/local/l/more-than-milk-breastfeeding-support-by-louise-barnett">Read more</a>,,
Infant Feeding Peer Support Groups - Support For Feeding Your Baby,,GDOS,Redruth Family Hub,Drump Road,,Redruth,Cornwall,TR15 1NA,,Breastfeeding support from trained volunteers. These are groups run by local parents in Local Family Hubs and managed by the Health Visiting Infant Fe... <a href="https://www.netmums.com/local/l/infant-feeding-peer-support-groups-support-for-feeding-your-baby-1">Read more</a>,,
The Lighthouse Family Hub Falmouth,,GDOS,The Lighthouse Family Hub,Jubilee Road,Falmouth,Cornwall,,TR11 2BB,Tel: 01326-317796,"Cornwalls Family Hubs support children, young people and their families pre-birth to 25 years.We have six Family Hub areas in Cornwall each delive... <a href=https://www.netmums.com/local/l/the-lighthouse-children-s-centre-falmouth>Read more</a>",,
Infant Feeding Peer Support Groups - Support For Feeding Your Baby,,GDOS,The Lighthouse Family Hub,Jubilee Road,,Falmouth,Cornwall,TR11 2BB,,Breastfeeding group support from trained volunteers. These are groups run by local parents in Local Family Hubs and managed by the Health Visiting Inf... <a href="https://www.netmums.com/local/l/infant-feeding-peer-support-groups-support-for-feeding-your-baby-2">Read more</a>,,
Infant Feeding Peer Support Groups - Support For Feeding Your Baby,,GDOS,St Paul's Family Hub,Moresk road,,Truro,,TR1 1BP,,Breastfeeding group support from trained volunteers. These are groups run by local parents in Local Family Hubs and managed by the Health Visiting Inf... <a href="https://www.netmums.com/local/l/infant-feeding-peer-support-groups-support-for-feeding-your-baby-3">Read more</a>,,
Infant Feeding Peer Support Groups - Support For Feeding Your Baby,,GDOS,Newquay Family Hub,Trennance Road,,Newquay,Cornwall,TR7 2LU,,Breastfeeding group support from trained volunteers. These are groups run by local parents in Local Family Hubs and managed by the Health Visiting In... <a href="https://www.netmums.com/local/l/infant-feeding-peer-support-groups-support-for-feeding-your-baby-5">Read more</a>,,
