Organisation Name,NACS Code,Organisation Type,Address1,Address2,Address3,Address4,Address5,PostCode,Telephone Number,Information supplied by,Value  (Information supplied by),Banding Classification  (Information supplied by)
Breastfeeding Centre Caversham,,GDOS,Amersham Road Community Centre,Amersham Road,,Caversham,Berkshire,RG4 5BP,Tel: 0118 901 5610,Mon 09:30 - 11:30 ... <a href="https://www.netmums.com/local/l/breastfeeding-centre">Read more</a>,,
Infant Feeding Group,,GDOS,Little Play Lounge,"The Old Rectory, Rectory Road",Padworth Common,Reading,Berkshire,RG7 4JD,Tel: 07502 269789,Get breast and bottle feeding support or just come along to chat about your feeding journey with other parents.   The drop-in session is free to atten... <a href="https://www.netmums.com/local/l/infant-feeding-group">Read more</a>,,
Antenatal &Amp; Postnatal Education And Support Courses,,GDOS,Our Baby Club Studio,St Sebastians Close,,Wokingham,Berkshire,RG40 3XA,Tel: 07841195295,Welcome to Award Winning Modern Antenatal and Postnatal Courses!We believe that in order to be fully informed and prepared for anything in life it... <a href="https://www.netmums.com/local/l/antenatal-postnatal-education-and-support-courses">Read more</a>,,
Bracknell Breastfeeding Support,,GDOS,Bracknell Forest Children's Centres,,,Bracknell based,Berkshire,RG12 7JZ,,Bracknell Forest Children's Centres offer breastfeeding support appointments to families living in Bracknell Forest.  Appointments are available Monda... <a href="https://www.netmums.com/local/l/bracknell-bfn">Read more</a>,,
Breastfeeding Support And Baby Weight Appointments In Hampshire,,GDOS,Basingstoke ,,,Basingstoke ,,RG27 9HF,Tel: 07475600068,As a midwife and breastfeeding specialist and tongue tie practitioner  Im passionate about helping new parents thrive with their baby. This can be ... <a href="https://www.netmums.com/local/l/breastfeeding-support-and-baby-weight-appointments-in-hampshire">Read more</a>,,
Tongue Tie Practitioner And Breastfeeding Support Basingstoke,,GDOS,Basingstoke,Hampshire,,Basingstoke,,RG24 8RR,Tel: 07475600068,"I am a midwife and Tongue Tie practitioner, passionate about supporting women and families in feeding and caring for their baby. I will visit you in y... <a href=https://www.netmums.com/local/l/tongue-tie-practitioner-and-breastfeeding-support-basingstoke>Read more</a>",,
Camberley Breastfeeding Hub,,GDOS,High Cross Church,Knoll Road,,Camberley,,GU15 3SY,,"Camberley Breastfeeding Hub is a safe space for families wishing to breast/chest feed, those who already do and for families who combi-feed by choice... <a href=https://www.netmums.com/local/l/camberley-breastfeeding-hub>Read more</a>",,
The Maternio - Hypnobirthing And Mindful Breastfeeding,,GDOS,6 Horseshoe Close,,,Camberley,Surrey,GU15 4DJ,Tel: 07708104203,"The Maternio “ Run by Jodie Gladish, a Hypnobirthing Teacher, Mindful Breastfeeding Practitioner, and a Photographer. I am very passionate about bir... <a href=https://www.netmums.com/local/l/the-maternio-hypnobirthing-and-mindful-breastfeeding>Read more</a>",,
Baby Hive - Breastfeeding Support At Home,,GDOS,fleet road,,,Fleet,,GU51 3BN,Tel: 07702788630,The Baby Hive team are IBCLC accredited Lactation Consultants with significant experience helping mothers with complex breastfeeding issues within th... <a href="https://www.netmums.com/local/l/baby-hive-breastfeeding-support-at-home-7">Read more</a>,,
Quarrendon Children'S Centre - Breastfeeding Drop-In,,GDOS,147 Meadowcroft,,,Aylesbury,Bucks,HP19 9HH,Tel: 01296 415304 or 01296 336789,A drop-in venue where you can breastfeed your baby in an informal setting and get help and support from skilled advisers or other mums ..... and a cup... <a href="https://www.netmums.com/local/l/breastfeeding-drop-in-10">Read more</a>,,
Lll Woking Breastfeeding Support On The First Friday Of Each Month,,GDOS,Horsell Village Hall,117 High Street,Horsell,Woking,Surrey,GU21 4SS,,"Breastfeeding support with trained La Leche League GB (LLL) breastfeeding counsellors, free to attend, free parking. Breastfeeding counsellors alongsi... <a href=https://www.netmums.com/local/l/breastfeeding-support-free-to-attend-free-to-park>Read more</a>",,
Bumps Boobs &Amp; Babies Group With Breastfeeding Support,,GDOS,Harefield Children's Centre,Harefield Infant School,High Street,Harefield,Middx,UB9 6BT,Tel: 01895 671982,"Come along to our lovely Bumps, Boobs &amp; Babies group, for expectant parents and parents with babies from birth to crawling.It provides a wonderful... <a href=https://www.netmums.com/local/l/bumps-boobs-babies-group-with-breastfeeding-support>Read more</a>",,
Free Breastfeeding Support Drop-In,,GDOS,Witney Methodist Church,40 High Street,,Witney,,OX28 6HG,Tel: 07824470002,We offer free breastfeeding help with specific issues for babies up to 8 weeks of age in a relaxed environment with ample tea and biscuits. There is n... <a href="https://www.netmums.com/local/l/free-breastfeeding-support-drop-in">Read more</a>,,
Breastfeeding Hypnotherapy,,GDOS,27 Lindlings,,,Hemel Hempstead,Hertsfordshire,HP1 2HB,Tel: 07757429445,Feeling relaxed is incredibly difficult when you have a newborn and this can contribute to difficulties in breastfeeding. Therefore hypnotherapy alon... <a href="https://www.netmums.com/local/l/breastfeeding-hypnotherapy">Read more</a>,,
