Organisation Name,NACS Code,Organisation Type,Address1,Address2,Address3,Address4,Address5,PostCode,Telephone Number,Information supplied by,Value  (Information supplied by),Banding Classification  (Information supplied by)
Trinity Baby Cafe - Martham,,GDOS,Trinity Childrens Centre,Black Street,Martham,Great Yarmouth,Norfolk,NR29 4PR,Tel: 01493 740242,"An informal relaxed 'cafe' style drop-in, providing support to pregnant and breastfeeding mothers and their families.Influenced by popular 'cafe cultu... <a href=https://www.netmums.com/local/l/trinity-baby-cafe-martham>Read more</a>",,
Breastfeeding Cafe,,GDOS,Priory Children's Centre,Well Baby Clinic,,Great Yarmouth,Norfolk,NR30 1NW,,Breastfeeding is good for you as well as your babyA place to meet and chat with other reastfeeding mums.Expert advice available from Midwives and Supp... <a href="https://www.netmums.com/local/l/breastfeeding-cafe-24">Read more</a>,,
Baby Cafe,,GDOS,Seagulls Children's Centre,Shrublands,Magdalen Way,Gorleston,Norfolk,NR31 7BP,Tel: 01493 660090,Breastfeeding is good for mums as well as their babies. This is a chance to come and meet other breastfeeding mums and get expert advice from a breast... <a href="https://www.netmums.com/local/l/breastfeeding-cafe-32">Read more</a>,,
Baby Nutrition Group,,GDOS,Seagulls Children's Centre,Shrublands,Magdalen Way,Gorleston,Norfolk,NR31 7BP,Tel: 01493 660090,A practical session designed to helpyou and your baby get off to the beststart. Designed for mums from 26weeks pregnant.We will give you information o... <a href="https://www.netmums.com/local/l/breastfeeding-workshop-7">Read more</a>,,
Breastfeeding Cafe,,GDOS,Seagulls Children's Centre,Magdalen Way,,Gorleston,Norfolk,NR31 7BP,Tel: 01493 660090,"A Baby CafÃ© drop-in centre set out with coffee tables, comfy sofas and play areas for accompanying toddlers.  All pregnant or breastfeeding mums are ... <a href=https://www.netmums.com/local/l/the-priory-centre-baby-cafe>Read more</a>",,
South Lowestoft Baby Cafe,,GDOS,Kirkley Children's Centre,Kirkley Street,,Lowestoft,Suffolk,NR33 0LU,Tel: 01502 532740,"A Baby CafÃ© drop-in centre set out with coffee tables, comfy sofas and play areas for accompanying toddlers.  All pregnant or breastfeeding mums are ... <a href=https://www.netmums.com/local/l/south-lowestoft-baby-cafe>Read more</a>",,
Sian Aldis -  Breastfeeding Practitioner,,GDOS,Framingham Earl ,,,Norwich,,NR14 7PD,Tel: 07766466307,"One to one breastfeeding support service for all stages of lactation, offering evidence based information and support in Norfolk and Suffolk.I offer ... <a href=https://www.netmums.com/local/l/sian-aldis-breastfeeding-practitioner>Read more</a>",,
Butterflies Baby Cafe,,GDOS,Beccles Childrens Centre,Castle Hill,,Beccles,,NR34 7BQ,Tel: 01493 852209,"An informal relaxed 'cafe' style drop-in, providing support to pregnant and breastfeeding mothers and their families.Influenced by popular 'cafe cultu... <a href=https://www.netmums.com/local/l/butterflies-baby-cafe>Read more</a>",,
Butterflies Breastfeeding Cafe At Earlham Early Years Centre,,GDOS,168a Motum Road,,,Norwich,,NR5 8EG,Tel: 01603 251779,Are you pregnant and interested in breastfeeding or already breastfeeding and want to meet other Mums and Dads? Do you need answers to breastfeeding ... <a href="https://www.netmums.com/local/l/butterflies-breastfeeding-cafe">Read more</a>,,
