Organisation Name,NACS Code,Organisation Type,Address1,Address2,Address3,Address4,Address5,PostCode,Telephone Number,NHS.UK users rating,Value  (NHS.UK users rating),Banding Classification  (NHS.UK users rating),Accepting NHS patients by referral only,Value  (Accepting NHS patients by referral only),Banding Classification  (Accepting NHS patients by referral only),Accepting new adult NHS patients,Value  (Accepting new adult NHS patients),Banding Classification  (Accepting new adult NHS patients),Accepting new adult patients entitled to free NHS dental care,Value  (Accepting new adult patients entitled to free NHS dental care),Banding Classification  (Accepting new adult patients entitled to free NHS dental care),Accepting children as new NHS patients,Value  (Accepting children as new NHS patients),Banding Classification  (Accepting children as new NHS patients),Urgent NHS dental appointments,Value  (Urgent NHS dental appointments),Banding Classification  (Urgent NHS dental appointments),Induction loop (Induction loop in place),Car parking (Is there car parking at this organisation?)
Clock Tower Dental Care,V004422,DEN,3 North Parade,North Road,,Ripon,,HG4 1ES,Tel: 01765 602161,No ratings yet Rate it yourself - /Services/dentists/LeaveReview/DefaultView.aspx?id=V004422,0,0,,false,no,No data supplied by the dental practice,Data not available,question,No data supplied by the dental practice,Data not available,question,No data supplied by the dental practice,Data not available,question,,true,yes,no,yes
Beech House Dental Practice,V004423,DEN,2 North Road,Ripon,,N Yorkshire,North Yorkshire,HG4 1HN,Tel: 01765 604200,6 ratings Rate it yourself - /Services/dentists/LeaveReview/DefaultView.aspx?id=V004423,,,Only by referral from a dental practitioner,true,yes,,false,no,,false,no,,false,no,,false,no,yes,yes
Bridge House Dental Practice,V004378,DEN,Bridge House Dental Practice,29 Bondgate Green,,Ripon,North Yorkshire,HG4 1QW,Tel: 01765 603215,22 ratings Rate it yourself - /Services/dentists/LeaveReview/DefaultView.aspx?id=V004378,,,,false,no,No data supplied by the dental practice,Data not available,question,No data supplied by the dental practice,Data not available,question,No data supplied by the dental practice,Data not available,question,,false,no,no,yes
Bedale Dental Practice,V006658,DEN,18 Sussex Street,Bedale,,N Yorkshire,,DL8 2AL,Tel: 01677 422865,2 ratings Rate it yourself - /Services/dentists/LeaveReview/DefaultView.aspx?id=V006658,,,,false,no,No data supplied by the dental practice,Data not available,question,No data supplied by the dental practice,Data not available,question,No data supplied by the dental practice,Data not available,question,,false,no,yes,yes
Alpha Dental Bedale ,V013448,DEN,,Mawson House,The Bridge,Bedale,North Yorkshire,DL8 1AW,Tel: 01677425427,No ratings yet Rate it yourself - /Services/dentists/LeaveReview/DefaultView.aspx?id=V013448,0,0,,false,no,No data supplied by the dental practice,Data not available,question,No data supplied by the dental practice,Data not available,question,No data supplied by the dental practice,Data not available,question,,true,yes,Data not available,no
Boroughbridge Dental Centre,V004432,DEN,Boroughbridge Dental Centre,Wetherby Road,Boroughbridge,York,North Yorkshire,YO51 9HS,Tel: 01423 322757,No ratings yet Rate it yourself - /Services/dentists/LeaveReview/DefaultView.aspx?id=V004432,0,0,,false,no,No data supplied by the dental practice,Data not available,question,No data supplied by the dental practice,Data not available,question,No data supplied by the dental practice,Data not available,question,,false,no,no,yes
Jennyfields Dental Practice,V004419,DEN,Jennyfields Health Centre,Grantley Drive,,Harrogate,,HG3 2XT,Tel: 01423 558118,7 ratings Rate it yourself - /Services/dentists/LeaveReview/DefaultView.aspx?id=V004419,,,,false,no,No data supplied by the dental practice,Data not available,question,No data supplied by the dental practice,Data not available,question,No data supplied by the dental practice,Data not available,question,,false,no,no,yes
Star Dental Care ,V006935,DEN,19 Finkle Street,Thirsk,,N Yorkshire,,YO7 1DA,Tel: 01845 522602,2 ratings Rate it yourself - /Services/dentists/LeaveReview/DefaultView.aspx?id=V006935,,,Only by referral from a dental practitioner,true,yes,,false,no,,false,no,,false,no,,false,no,yes,no
RF Dental Care,V004406,DEN,12 Ripon Road,Harrogate,,North Yorkshire,,HG1 2JB,Tel: 01423 504277,1 rating Rate it yourself - /Services/dentists/LeaveReview/DefaultView.aspx?id=V004406,,,Only by referral from a dental practitioner,true,yes,,false,no,,false,no,,false,no,,false,no,,yes
Mount Parade Dental Practice,V004401,DEN,14 Mount Parade,Harrogate,,N Yorkshire,,HG1 1BX,Tel: 01423 503999,11 ratings Rate it yourself - /Services/dentists/LeaveReview/DefaultView.aspx?id=V004401,,,,false,no,No data supplied by the dental practice,Data not available,question,No data supplied by the dental practice,Data not available,question,No data supplied by the dental practice,Data not available,question,,false,no,no,yes
"Bupa Dental Care, Harrogate",V014004,DEN,East Parade,,,Harrogate,North Yorkshire,HG1 5LB,Tel: 01423 522555,11 ratings Rate it yourself - /Services/dentists/LeaveReview/DefaultView.aspx?id=V014004,,,Only by referral from a dental practitioner,true,yes,,false,no,,false,no,,false,no,,false,no,yes,no
Knaresborough Dental Surgery,V004429,DEN,18 High Street,,,Knaresborough,North Yorkshire,HG5 0EQ,Tel: 01423 862571,No ratings yet Rate it yourself - /Services/dentists/LeaveReview/DefaultView.aspx?id=V004429,0,0,,false,no,No data supplied by the dental practice,Data not available,question,No data supplied by the dental practice,Data not available,question,No data supplied by the dental practice,Data not available,question,,false,no,no,yes
"mydentist, Castle Yard, Knaresborough",V013688,DEN,,Castle Yard,,Knaresborough,North Yorkshire,HG5 8AS,Tel: 01423862506,35 ratings Rate it yourself - /Services/dentists/LeaveReview/DefaultView.aspx?id=V013688,,,,false,no,No data supplied by the dental practice,Data not available,question,No data supplied by the dental practice,Data not available,question,No data supplied by the dental practice,Data not available,question,,true,yes,yes,
North Park Dental Practice,V004414,DEN,3 North Park Road,,N Yorkshire,Harrogate,,HG1 5PD,Tel: 01423 503547,3 ratings Rate it yourself - /Services/dentists/LeaveReview/DefaultView.aspx?id=V004414,,,Only by referral from a dental practitioner,true,yes,,false,no,,false,no,,false,no,,false,no,no,yes
Linden House Dental Practice,V004402,DEN,Linden House,10 Victoria Avenue,,Harrogate,,HG1 1ED,Tel: 01423 503162,1 rating Rate it yourself - /Services/dentists/LeaveReview/DefaultView.aspx?id=V004402,,,,false,no,No data supplied by the dental practice,Data not available,question,No data supplied by the dental practice,Data not available,question,No data supplied by the dental practice,Data not available,question,,false,no,Data not available,yes
South Park Dental Practice,V004415,DEN,1 South Park Road,Harrogate,,N Yorkshire,,HG1 5QU,Tel: 01423 502237,1 rating Rate it yourself - /Services/dentists/LeaveReview/DefaultView.aspx?id=V004415,,,,false,no,No data supplied by the dental practice,Data not available,question,No data supplied by the dental practice,Data not available,question,No data supplied by the dental practice,Data not available,question,,false,no,no,yes
Harrogate Dental Care,V025549,DEN,2 Hookstone Park,Hookstone Chase,,Harrogate,,HG2 7DB,Tel: 01423 884503,43 ratings Rate it yourself - /Services/dentists/LeaveReview/DefaultView.aspx?id=V025549,,,,false,no,No data supplied by the dental practice,Data not available,question,No data supplied by the dental practice,Data not available,question,No data supplied by the dental practice,Data not available,question,,true,yes,yes,yes
Orchard House Dental Care,V006950,DEN,Orchard House,16 Ainderby Road,Romanby,Northallerton,North Yorkshire,DL7 8HD,Tel: 01609 771888,4 ratings Rate it yourself - /Services/dentists/LeaveReview/DefaultView.aspx?id=V006950,,,,false,no,No data supplied by the dental practice,Data not available,question,No data supplied by the dental practice,Data not available,question,No data supplied by the dental practice,Data not available,question,,false,no,no,yes
Alpha Dental Leyburn,V008989,DEN,Brentwood Lodge,"Brentwood Lodge,  Leyburn","Quarry Hills Lane,",Leyburn,,DL8 5EJ,Tel: 01969623999,4 ratings Rate it yourself - /Services/dentists/LeaveReview/DefaultView.aspx?id=V008989,,,,false,no,No data supplied by the dental practice,Data not available,question,No data supplied by the dental practice,Data not available,question,No data supplied by the dental practice,Data not available,question,,true,yes,no,yes
Leyburn Dental Practice,V006662,DEN,Leyburn Dental Practice,Wensley Road,,Leyburn,Yorkshire(North Riding),DL8 5BN,Tel: 01969 622132,1 rating Rate it yourself - /Services/dentists/LeaveReview/DefaultView.aspx?id=V006662,,,,false,no,No data supplied by the dental practice,Data not available,question,No data supplied by the dental practice,Data not available,question,No data supplied by the dental practice,Data not available,question,,false,no,yes,yes
Malpas House Dental Surgery,V006428,DEN,Malpas House,11 South Parade,,Northallerton,North Yorkshire,DL7 8SE,Tel: 01609 772549,1 rating Rate it yourself - /Services/dentists/LeaveReview/DefaultView.aspx?id=V006428,,,,false,no,No data supplied by the dental practice,Data not available,question,No data supplied by the dental practice,Data not available,question,No data supplied by the dental practice,Data not available,question,,false,no,yes,yes
Ashby & Atkinson Dental Practice,V006937,DEN,124 High Street,Northallerton,,N Yorkshire,,DL7 8PQ,Tel: 01609 776677,1 rating Rate it yourself - /Services/dentists/LeaveReview/DefaultView.aspx?id=V006937,,,,false,no,No data supplied by the dental practice,Data not available,question,No data supplied by the dental practice,Data not available,question,No data supplied by the dental practice,Data not available,question,,false,no,no,yes
Hampsteads,V016050,DEN,Standard House,48 High Street,Northallerton,N Yorkshire,,DL7 8EQ,Tel: 01609 761377,No ratings yet Rate it yourself - /Services/dentists/LeaveReview/DefaultView.aspx?id=V016050,0,0,,false,no,No data supplied by the dental practice,Data not available,question,No data supplied by the dental practice,Data not available,question,No data supplied by the dental practice,Data not available,question,,false,no,yes,yes
North Yorkshire Dental Care,V008694,DEN,Zetland House Clinic,Bullamoor Road,,Northallerton,North Yorkshire,DL6 1JG,Tel: 01423 542338,No ratings yet Rate it yourself - /Services/dentists/LeaveReview/DefaultView.aspx?id=V008694,0,0,Only by referral from a dental practitioner,true,yes,,false,no,,false,no,,false,no,,false,no,no,no
Alpha Dental Studio Northallerton,V012704,DEN,Alpha Dental Care,Brompton Road,NORTHALLERTON,North Yorkshire,,DL6 1DY,Tel: 01609 772244,No ratings yet Rate it yourself - /Services/dentists/LeaveReview/DefaultView.aspx?id=V012704,0,0,,false,no,No data supplied by the dental practice,Data not available,question,No data supplied by the dental practice,Data not available,question,No data supplied by the dental practice,Data not available,question,,true,yes,,
Pannal Dental Clinic,V004418,DEN,2 Hillside Road,Pannal,Harrogate,N Yorkshire,,HG3 1JP,Tel: 01423 870879,4 ratings Rate it yourself - /Services/dentists/LeaveReview/DefaultView.aspx?id=V004418,,,,false,no,No data supplied by the dental practice,Data not available,question,No data supplied by the dental practice,Data not available,question,No data supplied by the dental practice,Data not available,question,,false,no,no,yes
Alpha Dental Catterick,V006426,DEN,,16b Hildyard Row,,Catterick Garrison,,DL9 4DH,Tel: 01748 832802,4 ratings Rate it yourself - /Services/dentists/LeaveReview/DefaultView.aspx?id=V006426,,,,false,no,No data supplied by the dental practice,Data not available,question,No data supplied by the dental practice,Data not available,question,No data supplied by the dental practice,Data not available,question,,true,yes,no,yes
North Yorkshire Dental Care,V008692,DEN,42 Richmond Road,,,Catterick Garrison,North Yorkshire,DL9 3JD,Tel: 01423 542485,No ratings yet Rate it yourself - /Services/dentists/LeaveReview/DefaultView.aspx?id=V008692,0,0,Only by referral from a dental practitioner,true,yes,,false,no,,false,no,,false,no,,false,no,no,no
Easingwold Dental Care,V007676,DEN,68 Long Street,Easingwold,York,N Yorkshire,,YO61 3HT,Tel: 01347 821181,69 ratings Rate it yourself - /Services/dentists/LeaveReview/DefaultView.aspx?id=V007676,,,,false,no,No data supplied by the dental practice,Data not available,question,No data supplied by the dental practice,Data not available,question,No data supplied by the dental practice,Data not available,question,,false,no,yes,yes
Red Lea Dental Practice,V007677,DEN,Market Place,Easingwold,York,North Yorkshire,,YO61 3AD,Tel: 01347 821435,53 ratings Rate it yourself - /Services/dentists/LeaveReview/DefaultView.aspx?id=V007677,,,Only by referral from a dental practitioner,true,yes,,false,no,,false,no,,false,no,,false,no,no,yes
Grassington Dental Care,V004397,DEN,Grassington Medical Centre,9 Station Road,Grassington,Skipton,North Yorkshire,BD23 5LS,Tel: 01756 753782,2 ratings Rate it yourself - /Services/dentists/LeaveReview/DefaultView.aspx?id=V004397,,,,false,no,No data supplied by the dental practice,Data not available,question,No data supplied by the dental practice,Data not available,question,No data supplied by the dental practice,Data not available,question,,false,no,no,yes
Lion House Dental Practice,V006660,DEN,Lion House,6 Pottergate,,Richmond,North Yorkshire,DL10 4AB,Tel: 01748 822321,9 ratings Rate it yourself - /Services/dentists/LeaveReview/DefaultView.aspx?id=V006660,,,Only by referral from a dental practitioner,true,yes,,false,no,,false,no,,false,no,,false,no,yes,no
Bridge Street Dental Practice,V003027,DEN,1b Bridge Street,Otley,,W Yorkshire,,LS21 1BQ,Tel: 01943 462415,6 ratings Rate it yourself - /Services/dentists/LeaveReview/DefaultView.aspx?id=V003027,,,Only by referral from a dental practitioner,true,yes,,false,no,,false,no,,false,no,,true,yes,,yes
Otley Dental Centre,V003029,DEN,Otley Dental Centre,69 Boroughgate,Otley,Leeds,West Yorkshire,LS21 1AG,Tel: 01943 462215,2 ratings Rate it yourself - /Services/dentists/LeaveReview/DefaultView.aspx?id=V003029,,,,false,no,No data supplied by the dental practice,Data not available,question,No data supplied by the dental practice,Data not available,question,No data supplied by the dental practice,Data not available,question,,false,no,no,no
Acorn Dental Centre,V041332,DEN,69 Boroughgate,Otley,Leeds,,,LS21 1AG,,No ratings yet Rate it yourself - /Services/dentists/LeaveReview/DefaultView.aspx?id=V041332,0,0,No data supplied by the dental practice,Data not available,question,No data supplied by the dental practice,Data not available,question,No data supplied by the dental practice,Data not available,question,No data supplied by the dental practice,Data not available,question,No data supplied by the dental practice,Data not available,question,,
Portman Healthcare Limited,V285351,DEN,INTERNATIONAL DEVELOPMENT CENTRE,VALLEY DRIVE,ILKLEY,,,LS29 8AL,,No ratings yet Rate it yourself - /Services/dentists/LeaveReview/DefaultView.aspx?id=V285351,0,0,No data supplied by the dental practice,Data not available,question,No data supplied by the dental practice,Data not available,question,No data supplied by the dental practice,Data not available,question,No data supplied by the dental practice,Data not available,question,No data supplied by the dental practice,Data not available,question,,
York Place Dental Practice,V003077,DEN,3 York Place,Wetherby,,W Yorkshire,,LS22 6NZ,Tel: 01937 583028,2 ratings Rate it yourself - /Services/dentists/LeaveReview/DefaultView.aspx?id=V003077,,,Only by referral from a dental practitioner,true,yes,,false,no,,false,no,,false,no,,false,no,no,yes
GlenLea Dental Suite,V003075,DEN,Glen Lea Dental Suite,20 York Road,,Wetherby,West Yorkshire,LS22 6SL,Tel: 01937 583502,15 ratings Rate it yourself - /Services/dentists/LeaveReview/DefaultView.aspx?id=V003075,,,,false,no,No data supplied by the dental practice,Data not available,question,No data supplied by the dental practice,Data not available,question,No data supplied by the dental practice,Data not available,question,,false,no,no,yes
Ilkley Dental Care,V002025,DEN,,39 Leeds Road,,Ilkley,West Yorkshire,LS29 8DP,Tel: 01943 608750,No ratings yet Rate it yourself - /Services/dentists/LeaveReview/DefaultView.aspx?id=V002025,0,0,Only by referral from a dental practitioner,true,yes,,false,no,,false,no,,false,no,,false,no,yes,no
Genesis Dental Care,V013072,DEN,Genesis Dental Care,19 Springs Lane,,Ilkley,West Yorkshire,LS29 8UA,Tel: 01943 674080,358 ratings Rate it yourself - /Services/dentists/LeaveReview/DefaultView.aspx?id=V013072,,,Only by referral from a dental practitioner,true,yes,,false,no,,false,no,,false,no,,false,no,yes,yes
Wells Road Dental Surgery,V002027,DEN,11 Wells Road,Ilkley,,W Yorkshire,,LS29 9JB,Tel: 01943 608748,1 rating Rate it yourself - /Services/dentists/LeaveReview/DefaultView.aspx?id=V002027,,,Only by referral from a dental practitioner,true,yes,,false,no,,false,no,,false,no,,false,no,no,yes
Regent Orthodontics,V002067,DEN,2a Regent Road,,,Ilkley,,LS29 9EA,Tel: 01943 604 402,5 ratings Rate it yourself - /Services/dentists/LeaveReview/DefaultView.aspx?id=V002067,,,No data supplied by the dental practice,Data not available,question,No data supplied by the dental practice,Data not available,question,No data supplied by the dental practice,Data not available,question,No data supplied by the dental practice,Data not available,question,No data supplied by the dental practice,Data not available,question,no,yes
Acorn Dental Centre,V002049,DEN,,64 The Grove,,Ilkley,West Yorkshire,LS29 9PA,Tel: 01943 607474,1 rating Rate it yourself - /Services/dentists/LeaveReview/DefaultView.aspx?id=V002049,,,,false,no,No data supplied by the dental practice,Data not available,question,No data supplied by the dental practice,Data not available,question,No data supplied by the dental practice,Data not available,question,,false,no,yes,no
MR JW MUIRHEAD,V043418,DEN,103 MAIN STREET,ADDINGHAM,ILKLEY,,,LS29 0PD,,No ratings yet Rate it yourself - /Services/dentists/LeaveReview/DefaultView.aspx?id=V043418,0,0,No data supplied by the dental practice,Data not available,question,No data supplied by the dental practice,Data not available,question,No data supplied by the dental practice,Data not available,question,No data supplied by the dental practice,Data not available,question,No data supplied by the dental practice,Data not available,question,,
SPRINGFIELD DENTAL CLINIC,V012146,DEN,2 Springfield Road,Guiseley,Leeds,West Yorkshire,,LS20 8AL,Tel: 01943 884848,414 ratings Rate it yourself - /Services/dentists/LeaveReview/DefaultView.aspx?id=V012146,,,,false,no,No data supplied by the dental practice,Data not available,question,No data supplied by the dental practice,Data not available,question,No data supplied by the dental practice,Data not available,question,,false,no,no,yes
"Bupa Dental Care, Guiseley",V003009,DEN,8 The Green,Guiseley,,Leeds,,LS20 9BT,Tel: 01943 877530,No ratings yet Rate it yourself - /Services/dentists/LeaveReview/DefaultView.aspx?id=V003009,0,0,Only by referral from a dental practitioner,true,yes,,false,no,,false,no,,false,no,,true,yes,no,yes
210 DENTAL CLINIC,V003460,DEN,210 High Street,Boston Spa,,Wetherby,West Yorkshire,LS23 6BT,Tel: 01937 844124,10 ratings Rate it yourself - /Services/dentists/LeaveReview/DefaultView.aspx?id=V003460,,,,false,no,No data supplied by the dental practice,Data not available,question,No data supplied by the dental practice,Data not available,question,No data supplied by the dental practice,Data not available,question,,false,no,yes,yes
"Renshaw, Kaushal & Kaushal",V272081,DEN,25 HIGH STREET,YEADON,LEEDS,,,LS19 7SP,,No ratings yet Rate it yourself - /Services/dentists/LeaveReview/DefaultView.aspx?id=V272081,0,0,No data supplied by the dental practice,Data not available,question,No data supplied by the dental practice,Data not available,question,No data supplied by the dental practice,Data not available,question,No data supplied by the dental practice,Data not available,question,No data supplied by the dental practice,Data not available,question,,
The Parade Dental,V012967,DEN,Unit 5,Asda Shopping Centre,Holt Park,Leeds,West Yorkshire,LS16 7SR,Tel: 0113 2614228,29 ratings Rate it yourself - /Services/dentists/LeaveReview/DefaultView.aspx?id=V012967,,,Only by referral from a dental practitioner,true,yes,,false,no,,false,no,,false,no,,true,yes,yes,yes
Adel Dental Practice,V003036,DEN,467a Otley Road,Adel,,Leeds,,LS16 7NR,Tel: 0113 2671628,3 ratings Rate it yourself - /Services/dentists/LeaveReview/DefaultView.aspx?id=V003036,,,Only by referral from a dental practitioner,true,yes,,false,no,,false,no,,false,no,,false,no,no,yes
High Ash Dental Surgery,V003064,DEN,88 High Ash Drive,Leeds,,W Yorkshire,,LS17 8RE,Tel: 0113 2688391,6 ratings Rate it yourself - /Services/dentists/LeaveReview/DefaultView.aspx?id=V003064,,,,false,no,No data supplied by the dental practice,Data not available,question,No data supplied by the dental practice,Data not available,question,No data supplied by the dental practice,Data not available,question,,false,no,no,yes
Nursery Lane Dental Practice,V003273,DEN,176 Nursery Lane,Leeds,,W Yorkshire,,LS17 7AQ,Tel: 0113 2686508,23 ratings Rate it yourself - /Services/dentists/LeaveReview/DefaultView.aspx?id=V003273,,,,false,no,No data supplied by the dental practice,Data not available,question,No data supplied by the dental practice,Data not available,question,No data supplied by the dental practice,Data not available,question,,false,no,no,no
Muirhead & Associates,V004388,DEN,Muirhead Dental Health,52-54 Otley Street,,Skipton,,BD23 1ET,Tel: 01756 792433,No ratings yet Rate it yourself - /Services/dentists/LeaveReview/DefaultView.aspx?id=V004388,0,0,Only by referral from a dental practitioner,true,yes,,false,no,,false,no,,false,no,,false,no,no,yes
Mr J S Deu,V002995,DEN,68 Otley Old Road,Cookridge,,Leeds,West Yorkshire,LS16 6LQ,Tel: 0113 2611400,82 ratings Rate it yourself - /Services/dentists/LeaveReview/DefaultView.aspx?id=V002995,,,,false,no,No data supplied by the dental practice,Data not available,question,No data supplied by the dental practice,Data not available,question,No data supplied by the dental practice,Data not available,question,,false,no,no,yes
Horsforth Dental,V013307,DEN,2 Troy Road,Horsforth,,Leeds,,LS18 5NQ,Tel: 0113 2582180,11 ratings Rate it yourself - /Services/dentists/LeaveReview/DefaultView.aspx?id=V013307,,,Only by referral from a dental practitioner,true,yes,,false,no,,false,no,,false,no,,false,no,no,no
Harker and Associates,V002458,DEN,1 Hothfield Street,Silsden,,Keighley,,BD20 0PP,Tel: 01535 652059,2 ratings Rate it yourself - /Services/dentists/LeaveReview/DefaultView.aspx?id=V002458,,,Only by referral from a dental practitioner,true,yes,,false,no,,false,no,,false,no,,true,yes,no,yes
 North Yorkshire Dental Care,V009483,DEN,Skipton Hospital,Keighley Road,,SKIPTON,North Yorkshire,BD23 2RJ,Tel: 01423 557562,No ratings yet Rate it yourself - /Services/dentists/LeaveReview/DefaultView.aspx?id=V009483,0,0,Only by referral from a dental practitioner,true,yes,,false,no,,false,no,,false,no,,false,no,,
Belle Vue Dental Practice,V004392,DEN,32 Belle Vue Terrace,Skipton,,N Yorkshire,,BD23 1RU,Tel: 01756 793558,No ratings yet Rate it yourself - /Services/dentists/LeaveReview/DefaultView.aspx?id=V004392,0,0,Only by referral from a dental practitioner,true,yes,,false,no,,false,no,,false,no,,false,no,no,yes