Organisation Name,NACS Code,Organisation Type,Address1,Address2,Address3,Address4,Address5,PostCode,Telephone Number,NHS.UK users rating,Value  (NHS.UK users rating),Banding Classification  (NHS.UK users rating),Accepting NHS patients by referral only,Value  (Accepting NHS patients by referral only),Banding Classification  (Accepting NHS patients by referral only),Accepting new adult NHS patients,Value  (Accepting new adult NHS patients),Banding Classification  (Accepting new adult NHS patients),Accepting new adult patients entitled to free NHS dental care,Value  (Accepting new adult patients entitled to free NHS dental care),Banding Classification  (Accepting new adult patients entitled to free NHS dental care),Accepting children as new NHS patients,Value  (Accepting children as new NHS patients),Banding Classification  (Accepting children as new NHS patients),Urgent NHS dental appointments,Value  (Urgent NHS dental appointments),Banding Classification  (Urgent NHS dental appointments),Induction loop (Induction loop in place),Car parking (Is there car parking at this organisation?)
Aveley Dental Practice,V001783,DEN,116 High Street,Aveley,,South Ockendon,Essex,RM15 4BX,Tel: 01708 865743,9 ratings Rate it yourself - /Services/dentists/LeaveReview/DefaultView.aspx?id=V001783,,,Only by referral from a dental practitioner,true,yes,,false,no,,false,no,,false,no,,true,yes,no,no
Purfleet Dental Surgery,V001787,DEN,Tank Hill Road,,,Purfleet,Essex,RM19 1SX,Tel: 01708 863123,12 ratings Rate it yourself - /Services/dentists/LeaveReview/DefaultView.aspx?id=V001787,,,,false,no,No data supplied by the dental practice,Data not available,question,No data supplied by the dental practice,Data not available,question,No data supplied by the dental practice,Data not available,question,,true,yes,no,yes
Humber Avenue Dental Surgery,V045343,DEN,73 Garron Lane,,South Ockendon,Essex,,RM15 5JQ,Tel: 01708 853107,4 ratings Rate it yourself - /Services/dentists/LeaveReview/DefaultView.aspx?id=V045343,,,,false,no,No data supplied by the dental practice,Data not available,question,No data supplied by the dental practice,Data not available,question,No data supplied by the dental practice,Data not available,question,,false,no,no,yes
St Clements Dental Suite,V011882,DEN,London Road,West Thurrock,,Grays,,RM20 4AR,Tel: 01708 895480,230 ratings Rate it yourself - /Services/dentists/LeaveReview/DefaultView.aspx?id=V011882,,,,false,no,No data supplied by the dental practice,Data not available,question,No data supplied by the dental practice,Data not available,question,No data supplied by the dental practice,Data not available,question,,false,no,no,yes
Raydens Dental Practice,V003536,DEN,Raydens,Upminster Road South,Rainham,Essex,,RM13 9AB,Tel: 01708 552459,44 ratings Rate it yourself - /Services/dentists/LeaveReview/DefaultView.aspx?id=V003536,,,,false,no,No data supplied by the dental practice,Data not available,question,No data supplied by the dental practice,Data not available,question,No data supplied by the dental practice,Data not available,question,,true,yes,no,yes
Patient First Dental Practice,V001786,DEN,28 London Road,,,Grays,Essex,RM17 5XY,Tel: 01375 396264,25 ratings Rate it yourself - /Services/dentists/LeaveReview/DefaultView.aspx?id=V001786,,,,false,no,No data supplied by the dental practice,Data not available,question,No data supplied by the dental practice,Data not available,question,No data supplied by the dental practice,Data not available,question,,true,yes,no,no
Mr P S Datta,V001781,DEN,65-67 High Street,,,Grays,,RM17 6NX,Tel: 01375 382166,10 ratings Rate it yourself - /Services/dentists/LeaveReview/DefaultView.aspx?id=V001781,,,No data supplied by the dental practice,Data not available,question,No data supplied by the dental practice,Data not available,question,No data supplied by the dental practice,Data not available,question,No data supplied by the dental practice,Data not available,question,No data supplied by the dental practice,Data not available,question,no,yes
Ice White Dental Practice,V001789,DEN,,87 Orsett Road,,Grays,Essex,RM17 5HH,Tel: 01375 372111,1 rating Rate it yourself - /Services/dentists/LeaveReview/DefaultView.aspx?id=V001789,,,,false,no,No data supplied by the dental practice,Data not available,question,No data supplied by the dental practice,Data not available,question,No data supplied by the dental practice,Data not available,question,,true,yes,yes,no
Southend Road Dental Surgery,V003535,DEN,166 South End Road,Rainham,,Essex,,RM13 7XR,Tel: 01708 555525,16 ratings Rate it yourself - /Services/dentists/LeaveReview/DefaultView.aspx?id=V003535,,,,false,no,No data supplied by the dental practice,Data not available,question,No data supplied by the dental practice,Data not available,question,No data supplied by the dental practice,Data not available,question,,true,yes,no,yes
Toothshine Dental Clinic,V008106,DEN,126 Orsett Road,,,Grays,Essex,RM17 5ET,Tel: 01375 392303,38 ratings Rate it yourself - /Services/dentists/LeaveReview/DefaultView.aspx?id=V008106,,,,false,no,No data supplied by the dental practice,Data not available,question,No data supplied by the dental practice,Data not available,question,No data supplied by the dental practice,Data not available,question,,true,yes,no,yes
Patiali Limited,V008455,DEN,Dental Beauty Greenhithe,The Avenue,Greenhithe,Kent,Kent,DA9 9NX,Tel: 01322 422800,1 rating Rate it yourself - /Services/dentists/LeaveReview/DefaultView.aspx?id=V008455,,,Only by referral from a dental practitioner,true,yes,,false,no,,false,no,,false,no,,false,no,yes,yes
Corbets Tey Dental Practice,V003540,DEN,36a Corbets Tey Road,Upminster,Essex,,,RM14 2AD,Tel: 01708 227943,4 ratings Rate it yourself - /Services/dentists/LeaveReview/DefaultView.aspx?id=V003540,,,No data supplied by the dental practice,Data not available,question,No data supplied by the dental practice,Data not available,question,No data supplied by the dental practice,Data not available,question,No data supplied by the dental practice,Data not available,question,No data supplied by the dental practice,Data not available,question,no,yes
Diamond Dental Group Ltd,V001784,DEN,Diamond Dental Care,279 Rectory Road,Grays,Essex,,RM17 5SW,Tel: 01375 373409,9 ratings Rate it yourself - /Services/dentists/LeaveReview/DefaultView.aspx?id=V001784,,,,false,no,No data supplied by the dental practice,Data not available,question,No data supplied by the dental practice,Data not available,question,No data supplied by the dental practice,Data not available,question,,true,yes,no,yes
St. Mary's Dental Care,V003542,DEN,163 St. Mary,Upminster,,Essex,,RM14 3BL,Tel: 01708 229330,5 ratings Rate it yourself - /Services/dentists/LeaveReview/DefaultView.aspx?id=V003542,,,No data supplied by the dental practice,Data not available,question,No data supplied by the dental practice,Data not available,question,No data supplied by the dental practice,Data not available,question,No data supplied by the dental practice,Data not available,question,No data supplied by the dental practice,Data not available,question,no,yes
Photay & Associates,V005458,DEN,60 The Brent,,,Dartford,Kent,DA1 1YW,Tel: 01322272622,6 ratings Rate it yourself - /Services/dentists/LeaveReview/DefaultView.aspx?id=V005458,,,Only by referral from a dental practitioner,true,yes,,false,no,,false,no,,false,no,,false,no,,
Smiledartford Dental Practice,V005303,DEN,69 The Brent,69 the brent,69 The Brent,dartford,Kent,DA1 1YD,Tel: 01322220677,9 ratings Rate it yourself - /Services/dentists/LeaveReview/DefaultView.aspx?id=V005303,,,,false,no,No data supplied by the dental practice,Data not available,question,No data supplied by the dental practice,Data not available,question,No data supplied by the dental practice,Data not available,question,,true,yes,no,yes
Elm Park Dental Surgery,V003534,DEN,28 Rosewood Avenue,Hornchurch,Essex,,,RM12 5LH,Tel: 01708 451882,21 ratings Rate it yourself - /Services/dentists/LeaveReview/DefaultView.aspx?id=V003534,,,,false,no,No data supplied by the dental practice,Data not available,question,No data supplied by the dental practice,Data not available,question,No data supplied by the dental practice,Data not available,question,,true,yes,,yes
Church View Dental Practice,V003539,DEN,34a Station Road,,,Upminster,Essex,RM14 2TR,Tel: 01708 220563,17 ratings Rate it yourself - /Services/dentists/LeaveReview/DefaultView.aspx?id=V003539,,,,false,no,No data supplied by the dental practice,Data not available,question,No data supplied by the dental practice,Data not available,question,No data supplied by the dental practice,Data not available,question,,false,no,no,no
Miss D M  Daly,V005298,DEN,1A Spital Street,Dartford,Kent,,,DA1 2DJ,Tel: 01322 221584,1 rating Rate it yourself - /Services/dentists/LeaveReview/DefaultView.aspx?id=V005298,,,No data supplied by the dental practice,Data not available,question,No data supplied by the dental practice,Data not available,question,No data supplied by the dental practice,Data not available,question,No data supplied by the dental practice,Data not available,question,No data supplied by the dental practice,Data not available,question,no,no
Sunny Smiles Dental Innovations,V010875,DEN,,7 St Marys Lane,Essex,Upminster,Essex,RM14 2QU,Tel: 01708 226899,2 ratings Rate it yourself - /Services/dentists/LeaveReview/DefaultView.aspx?id=V010875,,,,false,no,No data supplied by the dental practice,Data not available,question,No data supplied by the dental practice,Data not available,question,No data supplied by the dental practice,Data not available,question,,true,yes,,yes
Saimo Ltd,V237870,DEN,16-18,LOWFIELD STREET,DARTFORD,Kent,Kent,DA1 1HD,Tel: 01322941111,No ratings yet Rate it yourself - /Services/dentists/LeaveReview/DefaultView.aspx?id=V237870,0,0,,false,no,No data supplied by the dental practice,Data not available,question,No data supplied by the dental practice,Data not available,question,No data supplied by the dental practice,Data not available,question,,true,yes,,
Ashley S Lupin & Associates Limited,V351366,DEN,Kentish Smiles Clinic,42 - 44 Lowfield Street,Dartford,Kent,,DA1 1HD,,No ratings yet Rate it yourself - /Services/dentists/LeaveReview/DefaultView.aspx?id=V351366,0,0,No data supplied by the dental practice,Data not available,question,No data supplied by the dental practice,Data not available,question,No data supplied by the dental practice,Data not available,question,No data supplied by the dental practice,Data not available,question,No data supplied by the dental practice,Data not available,question,,
West Hill Dental Practice,V005463,DEN,46 West Hill,Dartford,Kent,Dartford,Kent,DA1 2EU,Tel: 01322 223352,8 ratings Rate it yourself - /Services/dentists/LeaveReview/DefaultView.aspx?id=V005463,,,Only by referral from a dental practitioner,true,yes,,false,no,,false,no,,false,no,,true,yes,no,yes
Mayor and Tokareva,V026454,DEN,172 Bexley Road,Erith,,Kent,,DA8 3HG,Tel: 01322 332590,2 ratings Rate it yourself - /Services/dentists/LeaveReview/DefaultView.aspx?id=V026454,,,No data supplied by the dental practice,Data not available,question,No data supplied by the dental practice,Data not available,question,No data supplied by the dental practice,Data not available,question,No data supplied by the dental practice,Data not available,question,No data supplied by the dental practice,Data not available,question,,
Hall Lane Dental Practice,V003537,DEN,Hall Lane,Upminster,Essex,essex,Essex,RM14 1AE,Tel: 01708 220043,13 ratings Rate it yourself - /Services/dentists/LeaveReview/DefaultView.aspx?id=V003537,,,Only by referral from a dental practitioner,true,yes,,false,no,,false,no,,false,no,,true,yes,no,yes
North Heath Dental Practice,V008728,DEN,184-186 Bexley Road,Erith,,Bexley,Kent,DA8 3HF,Tel: 01322 336401,19 ratings Rate it yourself - /Services/dentists/LeaveReview/DefaultView.aspx?id=V008728,,,,false,no,No data supplied by the dental practice,Data not available,question,No data supplied by the dental practice,Data not available,question,No data supplied by the dental practice,Data not available,question,,true,yes,,
Highfield Dental Centre,V005748,DEN,23 Highfield Road,Dartford,Kent,Dartford,Kent,DA1 2JS,Tel: 01322 225397,3 ratings Rate it yourself - /Services/dentists/LeaveReview/DefaultView.aspx?id=V005748,,,Only by referral from a dental practitioner,true,yes,,false,no,,false,no,,false,no,,true,yes,no,no
Mr M S Tawana,V005299,DEN,107-109 Brent Lane,Dartford,Kent,,,DA1 1QU,Tel: 01322 223649,5 ratings Rate it yourself - /Services/dentists/LeaveReview/DefaultView.aspx?id=V005299,,,Only by referral from a dental practitioner,true,yes,,false,no,,false,no,,false,no,,true,yes,no,no
Lowfield Dental Clinic,V043216,DEN,69 Lowfield Street,Dartford,Kent,Dartford,Kent,DA1 1HP,Tel: 01322 293097,No ratings yet Rate it yourself - /Services/dentists/LeaveReview/DefaultView.aspx?id=V043216,0,0,Only by referral from a dental practitioner,true,yes,,false,no,,false,no,,false,no,,true,yes,,
Hews House,V005485,DEN,'Hews House',23 The High Street,,Swanscombe,Kent,DA10 0AG,Tel: 01322 386688,23 ratings Rate it yourself - /Services/dentists/LeaveReview/DefaultView.aspx?id=V005485,,,Only by referral from a dental practitioner,true,yes,,false,no,,false,no,,false,no,,true,yes,no,yes
Picardy Street Dental Surgery,V000605,DEN,1A Picardy Street,Belvedere,Kent,Kent,,DA17 5QQ,Tel: 020 8311 3008,13 ratings Rate it yourself - /Services/dentists/LeaveReview/DefaultView.aspx?id=V000605,,,No data supplied by the dental practice,Data not available,question,No data supplied by the dental practice,Data not available,question,No data supplied by the dental practice,Data not available,question,No data supplied by the dental practice,Data not available,question,No data supplied by the dental practice,Data not available,question,no,yes
Cranham Dental Centre,V003543,DEN,,141 Ingrebourne Gardens,,Upminster,Essex,RM14 1BJ,Tel: 01708 228291,6 ratings Rate it yourself - /Services/dentists/LeaveReview/DefaultView.aspx?id=V003543,,,,false,no,No data supplied by the dental practice,Data not available,question,No data supplied by the dental practice,Data not available,question,No data supplied by the dental practice,Data not available,question,,false,no,no,yes
2 Green Dental,V008725,DEN,2 Green Walk,Crayford,Kent,Kent,,DA1 4JL,Tel: 01322 521044,38 ratings Rate it yourself - /Services/dentists/LeaveReview/DefaultView.aspx?id=V008725,,,,false,no,No data supplied by the dental practice,Data not available,question,No data supplied by the dental practice,Data not available,question,No data supplied by the dental practice,Data not available,question,,true,yes,,no
Ark-G Dental Centre,V030186,DEN,10-12 Crayford High Street,Dartford,,Kent,,DA1 4HG,Tel: 01322 527 415,14 ratings Rate it yourself - /Services/dentists/LeaveReview/DefaultView.aspx?id=V030186,,,,false,no,No data supplied by the dental practice,Data not available,question,No data supplied by the dental practice,Data not available,question,No data supplied by the dental practice,Data not available,question,,true,yes,no,yes
Parkview Dental Practice,V003532,DEN,300 Upper Rainham Road,Hornchurch,,Essex,,RM12 4EQ,Tel: 01708 477900,12 ratings Rate it yourself - /Services/dentists/LeaveReview/DefaultView.aspx?id=V003532,,,Only by referral from a dental practitioner,true,yes,,false,no,,false,no,,false,no,,false,no,no,yes
Aligndent NK Ltd,V020529,DEN,Grove House Orthodontics,Grove Road,Northfleet,Gravesend,Kent,DA11 9AX,Tel: 01474 358104,No ratings yet Rate it yourself - /Services/dentists/LeaveReview/DefaultView.aspx?id=V020529,0,0,Only by referral from a dental practitioner,true,yes,,false,no,,false,no,,false,no,,false,no,yes,yes
Dental Surgery,V008717,DEN,318  Erith Road,Bexleyheath,Kent,,,DA7 6HJ,Tel: 01322 336876,4 ratings Rate it yourself - /Services/dentists/LeaveReview/DefaultView.aspx?id=V008717,,,No data supplied by the dental practice,Data not available,question,No data supplied by the dental practice,Data not available,question,No data supplied by the dental practice,Data not available,question,No data supplied by the dental practice,Data not available,question,No data supplied by the dental practice,Data not available,question,no,yes
Patiali Limited,V005498,DEN,Dental Beauty Swanscombe,Swanscombe Health Centre,Southfleet Road,"Swanscombe, Kent",Kent,DA10 0BF,Tel: 01322 422790,1 rating Rate it yourself - /Services/dentists/LeaveReview/DefaultView.aspx?id=V005498,,,Only by referral from a dental practitioner,true,yes,,false,no,,false,no,,false,no,,false,no,no,yes
Harrow (The) Dental Practice,V023750,DEN,The Harrow Dental Practice and Dental Implant Centre,23-27 High Street,,Hornchurch,Essex,RM11 1TP,Tel: 01708 479717,23 ratings Rate it yourself - /Services/dentists/LeaveReview/DefaultView.aspx?id=V023750,,,,false,no,No data supplied by the dental practice,Data not available,question,No data supplied by the dental practice,Data not available,question,No data supplied by the dental practice,Data not available,question,,false,no,yes,yes
Aspire Dental,V013560,DEN,1-3,Dewey Road,,Dagenham,,RM10 8AP,Tel: 0208 595 1116,6 ratings Rate it yourself - /Services/dentists/LeaveReview/DefaultView.aspx?id=V013560,,,,false,no,No data supplied by the dental practice,Data not available,question,No data supplied by the dental practice,Data not available,question,No data supplied by the dental practice,Data not available,question,,true,yes,no,yes
Orchard Road (DS) Limited,V002806,DEN,Essex Family Dental Care,1-5 Orchard Road,Dagenham,Essex,,RM10 9PT,Tel: 020 8592 4330,52 ratings Rate it yourself - /Services/dentists/LeaveReview/DefaultView.aspx?id=V002806,,,,false,no,No data supplied by the dental practice,Data not available,question,No data supplied by the dental practice,Data not available,question,No data supplied by the dental practice,Data not available,question,,true,yes,no,yes
Hornchurch Dental Care,V003525,DEN,98 North Street,,Hornchurch,Essex,,RM11 1SU,Tel: 01708 620403,3 ratings Rate it yourself - /Services/dentists/LeaveReview/DefaultView.aspx?id=V003525,,,No data supplied by the dental practice,Data not available,question,No data supplied by the dental practice,Data not available,question,No data supplied by the dental practice,Data not available,question,No data supplied by the dental practice,Data not available,question,No data supplied by the dental practice,Data not available,question,no,yes
Chadwell Dental Practice,V001772,DEN,30 Riverview,Chadwell St. Mary,,Grays,,RM16 4BJ,Tel: 01375 842620,5 ratings Rate it yourself - /Services/dentists/LeaveReview/DefaultView.aspx?id=V001772,,,,false,no,No data supplied by the dental practice,Data not available,question,No data supplied by the dental practice,Data not available,question,No data supplied by the dental practice,Data not available,question,,true,yes,yes,yes
Mr M Patel,V001780,DEN,,154 Dock Road,,Tilbury,,RM18 7BS,Tel: 01375 858478,7 ratings Rate it yourself - /Services/dentists/LeaveReview/DefaultView.aspx?id=V001780,,,,false,no,No data supplied by the dental practice,Data not available,question,No data supplied by the dental practice,Data not available,question,No data supplied by the dental practice,Data not available,question,,true,yes,,
Long Lane Dental Surgery,V008720,DEN,,144 Long Lane,,Bexleyheath,Kent,DA7 5AH,Tel: 020 8303 3120,11 ratings Rate it yourself - /Services/dentists/LeaveReview/DefaultView.aspx?id=V008720,,,Only by referral from a dental practitioner,true,yes,,false,no,,false,no,,false,no,,false,no,no,yes
All Smiles Dental Care,V003518,DEN,,261 Hornchurch Road,,Hornchurch,Essex,RM12 4TG,Tel: 01708 444656,12 ratings Rate it yourself - /Services/dentists/LeaveReview/DefaultView.aspx?id=V003518,,,,false,no,No data supplied by the dental practice,Data not available,question,No data supplied by the dental practice,Data not available,question,No data supplied by the dental practice,Data not available,question,,false,no,no,yes
Dagenham Dental,V002807,DEN,221 Heathway,,Essex,Dagenham,,RM9 6AE,Tel: 020 8592 0822,19 ratings Rate it yourself - /Services/dentists/LeaveReview/DefaultView.aspx?id=V002807,,,,false,no,No data supplied by the dental practice,Data not available,question,No data supplied by the dental practice,Data not available,question,No data supplied by the dental practice,Data not available,question,,true,yes,no,yes
Chapel Road Orthodontics ,V008723,DEN,39 Chapel Road,Bexleyheath,,Kent,,DA7 4HW,Tel: 020 8303 6836,1 rating Rate it yourself - /Services/dentists/LeaveReview/DefaultView.aspx?id=V008723,,,Only by referral from a dental practitioner,true,yes,,false,no,,false,no,,false,no,,false,no,no,yes
The Heathway Dental Surgery,V002809,DEN,,276a Heathway,Essex,Dagenham,,RM10 8QS,Tel: 020 8592 5030,7 ratings Rate it yourself - /Services/dentists/LeaveReview/DefaultView.aspx?id=V002809,,,,false,no,No data supplied by the dental practice,Data not available,question,No data supplied by the dental practice,Data not available,question,No data supplied by the dental practice,Data not available,question,,true,yes,no,yes
"Bupa Dental Care, Hornchurch",V003527,DEN,Green Lawns,Slewins Lane,Hornchurch,Essex,,RM11 2BS,Tel: 01708 443059,10 ratings Rate it yourself - /Services/dentists/LeaveReview/DefaultView.aspx?id=V003527,,,Only by referral from a dental practitioner,true,yes,,false,no,,false,no,,false,no,,true,yes,no,yes
Inspire Dental Practice,V002831,DEN,228 Oxlow Lane,Dagenham,,Essex,,RM10 7YX,Tel: 020 8517 5347,265 ratings Rate it yourself - /Services/dentists/LeaveReview/DefaultView.aspx?id=V002831,,,,false,no,No data supplied by the dental practice,Data not available,question,No data supplied by the dental practice,Data not available,question,No data supplied by the dental practice,Data not available,question,,true,yes,no,yes
Elite Dental Studio,V011872,DEN,13-14 Civic Square,Tilbury,,Essex,Essex,RM18 8AD,Tel: 01375 852044,228 ratings Rate it yourself - /Services/dentists/LeaveReview/DefaultView.aspx?id=V011872,,,,false,no,No data supplied by the dental practice,Data not available,question,No data supplied by the dental practice,Data not available,question,No data supplied by the dental practice,Data not available,question,,true,yes,yes,yes
Dental Beauty Bexleyheath,V013079,DEN,Pickford Lane Dental Practice,70 Pickford Lane,,Bexleyheath,Kent,DA7 4QX,Tel: 020 8303 2258,6 ratings Rate it yourself - /Services/dentists/LeaveReview/DefaultView.aspx?id=V013079,,,,false,no,No data supplied by the dental practice,Data not available,question,No data supplied by the dental practice,Data not available,question,No data supplied by the dental practice,Data not available,question,,true,yes,no,no
Abbeywood Dental Practice,V007529,DEN,Lakeside Health Centre,Tavy Bridge,,Thamesmead,,SE2 9LH,Tel: 020 8320 7355,4 ratings Rate it yourself - /Services/dentists/LeaveReview/DefaultView.aspx?id=V007529,,,,false,no,No data supplied by the dental practice,Data not available,question,No data supplied by the dental practice,Data not available,question,No data supplied by the dental practice,Data not available,question,,true,yes,no,yes
Rush Green Dental Practice,V003500,DEN,193 Rush Green Road,,,Romford,,RM7 0PX,Tel: 01708 748707,50 ratings Rate it yourself - /Services/dentists/LeaveReview/DefaultView.aspx?id=V003500,,,No data supplied by the dental practice,Data not available,question,No data supplied by the dental practice,Data not available,question,No data supplied by the dental practice,Data not available,question,No data supplied by the dental practice,Data not available,question,No data supplied by the dental practice,Data not available,question,yes,no