Organisation Name,NACS Code,Organisation Type,Address1,Address2,Address3,Address4,Address5,PostCode,Telephone Number,NHS.UK users rating,Value  (NHS.UK users rating),Banding Classification  (NHS.UK users rating),Accepting NHS patients by referral only,Value  (Accepting NHS patients by referral only),Banding Classification  (Accepting NHS patients by referral only),Accepting new adult NHS patients,Value  (Accepting new adult NHS patients),Banding Classification  (Accepting new adult NHS patients),Accepting new adult patients entitled to free NHS dental care,Value  (Accepting new adult patients entitled to free NHS dental care),Banding Classification  (Accepting new adult patients entitled to free NHS dental care),Accepting children as new NHS patients,Value  (Accepting children as new NHS patients),Banding Classification  (Accepting children as new NHS patients),Urgent NHS dental appointments,Value  (Urgent NHS dental appointments),Banding Classification  (Urgent NHS dental appointments),Induction loop (Induction loop in place),Car parking (Is there car parking at this organisation?)
Camphill Dental Practice,V041373,DEN,Whitestone Family Dental,"Practice, 41 Lutterworth Rd",Nuneaton,Warwickshire,,CV11 4LE,,13 ratings Rate it yourself - /Services/dentists/LeaveReview/DefaultView.aspx?id=V041373,,,No data supplied by the dental practice,Data not available,question,No data supplied by the dental practice,Data not available,question,No data supplied by the dental practice,Data not available,question,No data supplied by the dental practice,Data not available,question,No data supplied by the dental practice,Data not available,question,,
Attleborough Dental Surgery,V008475,DEN,3 Wembrook House The Green,Attleborough,Nuneaton,Warks,,CV11 4FJ,Tel: 02476343928,3 ratings Rate it yourself - /Services/dentists/LeaveReview/DefaultView.aspx?id=V008475,,,,false,no,No data supplied by the dental practice,Data not available,question,No data supplied by the dental practice,Data not available,question,No data supplied by the dental practice,Data not available,question,,true,yes,no,yes
Accessible Orthodontics,V012378,DEN,1 Back Street,Nuneaton,,Warks,,CV11 4DG,Tel: 02476 329 763,No ratings yet Rate it yourself - /Services/dentists/LeaveReview/DefaultView.aspx?id=V012378,0,0,Only by referral from a dental practitioner,true,yes,,false,no,,false,no,,false,no,,true,yes,yes,no
"Bupa Dental Care, Nuneaton",V006086,DEN,19 Bond Street,Nuneaton,Warks,Warks,,CV11 4BX,Tel: 02476 382682,7 ratings Rate it yourself - /Services/dentists/LeaveReview/DefaultView.aspx?id=V006086,,,,false,no,No data supplied by the dental practice,Data not available,question,No data supplied by the dental practice,Data not available,question,No data supplied by the dental practice,Data not available,question,,true,yes,no,yes
Mr Dulku & Mr Kang,V006085,DEN,The Dental Practice,25 Hinckley Road,,Nuneaton,Warwickshire,CV11 6LG,Tel: 024 76344222,23 ratings Rate it yourself - /Services/dentists/LeaveReview/DefaultView.aspx?id=V006085,,,No data supplied by the dental practice,Data not available,question,No data supplied by the dental practice,Data not available,question,No data supplied by the dental practice,Data not available,question,No data supplied by the dental practice,Data not available,question,No data supplied by the dental practice,Data not available,question,no,yes
Holywell House Nuneaton,V006091,DEN,115 Manor Court Road,,Nuneaton,Warwickshire,,CV11 5HQ,Tel: 024 76353450,8 ratings Rate it yourself - /Services/dentists/LeaveReview/DefaultView.aspx?id=V006091,,,Only by referral from a dental practitioner,true,yes,,false,no,,false,no,,false,no,,true,yes,yes,yes
The Manor Dental Surgery,V006091_1,DEN,115 Manor Court Road,Nuneaton,,Warks,,CV11 5HQ,Tel: Tel No: 024 76382158,50 ratings Rate it yourself - /Services/dentists/LeaveReview/DefaultView.aspx?id=V006091_1,,,,false,no,No data supplied by the dental practice,Data not available,question,No data supplied by the dental practice,Data not available,question,No data supplied by the dental practice,Data not available,question,,true,yes,no,yes
The Cottage Dental Practice ,V006106,DEN,The Cottage Dental Practice,35 Manor Court Road,,Nuneaton,Warwickshire,CV11 5HU,Tel: 02476 382081,22 ratings Rate it yourself - /Services/dentists/LeaveReview/DefaultView.aspx?id=V006106,,,Only by referral from a dental practitioner,true,yes,,false,no,,false,no,,false,no,,false,no,yes,yes
Prestige Dental Care,V199907,DEN,19-21,CONGREVE WALK,BEDWORTH,,,CV12 8LX,,No ratings yet Rate it yourself - /Services/dentists/LeaveReview/DefaultView.aspx?id=V199907,0,0,No data supplied by the dental practice,Data not available,question,No data supplied by the dental practice,Data not available,question,No data supplied by the dental practice,Data not available,question,No data supplied by the dental practice,Data not available,question,No data supplied by the dental practice,Data not available,question,,
Prestige Dental Care,V006076,DEN,1-5 Church Way,,,Bedworth,Warwickshire,CV12 8NA,Tel: 02476 314912,94 ratings Rate it yourself - /Services/dentists/LeaveReview/DefaultView.aspx?id=V006076,,,,false,no,No data supplied by the dental practice,Data not available,question,No data supplied by the dental practice,Data not available,question,No data supplied by the dental practice,Data not available,question,,true,yes,yes,yes
Coventry Road Dental Practice,V000189,DEN,94 Coventry Road,Bedworth,Warks,Bedworth,,CV12 8NW,Tel: 02476 312256,20 ratings Rate it yourself - /Services/dentists/LeaveReview/DefaultView.aspx?id=V000189,,,Only by referral from a dental practitioner,true,yes,,false,no,,false,no,,false,no,,true,yes,no,yes
"Balbir S Bhandal, Amrik S Bhandal & Baljit S Bhandal",V039207,DEN,4A Leicester Street,Bulkington,BEDWWORTH,Leicestershire,,CV12 9NG,,No ratings yet Rate it yourself - /Services/dentists/LeaveReview/DefaultView.aspx?id=V039207,0,0,No data supplied by the dental practice,Data not available,question,No data supplied by the dental practice,Data not available,question,No data supplied by the dental practice,Data not available,question,No data supplied by the dental practice,Data not available,question,No data supplied by the dental practice,Data not available,question,,
Camphill Dental Practice,V006087,DEN,206 Camp Hill Road,,,Nuneaton,,CV10 0JL,Tel: 0247 6394571,172 ratings Rate it yourself - /Services/dentists/LeaveReview/DefaultView.aspx?id=V006087,,,,false,no,No data supplied by the dental practice,Data not available,question,No data supplied by the dental practice,Data not available,question,No data supplied by the dental practice,Data not available,question,,true,yes,no,yes
"mydentist, Clarendon Road, Hinckley ",V006493,DEN,,8 Clarendon Road,,Hinckley,Leicestershire,LE10 0PL,Tel: 01455631123,34 ratings Rate it yourself - /Services/dentists/LeaveReview/DefaultView.aspx?id=V006493,,,,false,no,No data supplied by the dental practice,Data not available,question,No data supplied by the dental practice,Data not available,question,No data supplied by the dental practice,Data not available,question,,true,yes,yes,yes
House of Dental Station Road,V006484,DEN,34 Station Road,,,Hinckley,Leicestershire,LE10 1AP,Tel: 01455 637141,51 ratings Rate it yourself - /Services/dentists/LeaveReview/DefaultView.aspx?id=V006484,,,,false,no,No data supplied by the dental practice,Data not available,question,No data supplied by the dental practice,Data not available,question,No data supplied by the dental practice,Data not available,question,,false,no,no,yes
Mount Road Dental Practice,V006481,DEN,23,Mount Road,,Hinckley,Leicestershire,LE10 1AD,Tel: 01455 637253,11 ratings Rate it yourself - /Services/dentists/LeaveReview/DefaultView.aspx?id=V006481,,,Only by referral from a dental practitioner,true,yes,,false,no,,false,no,,false,no,,false,no,yes,yes
Longford Dental Practice,V007109,DEN,177 Longford Road,Longford,,Coventry,W Midlands,CV6 6EE,Tel: 024 76644777,68 ratings Rate it yourself - /Services/dentists/LeaveReview/DefaultView.aspx?id=V007109,,,Only by referral from a dental practitioner,true,yes,,false,no,,false,no,,false,no,,false,no,yes,yes
Holywell House,V006478,DEN,56 London Road,,Hinckley,Leics,,LE10 1HL,Tel: 01455 234758,10 ratings Rate it yourself - /Services/dentists/LeaveReview/DefaultView.aspx?id=V006478,,,Only by referral from a dental practitioner,true,yes,,false,no,,false,no,,false,no,,true,yes,yes,yes
Burbage Dental Practice,V012415,DEN,105-107 Church Street,Burbage,,Hinckley,Leicestershire,LE10 2DB,Tel: 01455 614 895,178 ratings Rate it yourself - /Services/dentists/LeaveReview/DefaultView.aspx?id=V012415,,,Only by referral from a dental practitioner,true,yes,,false,no,,false,no,,false,no,,true,yes,no,yes
Windmill Dental Surgery,V000735,DEN,108 Windmill Road,Coventry,W Midlands,,,CV6 7BG,Tel: 024 7663 7031,2 ratings Rate it yourself - /Services/dentists/LeaveReview/DefaultView.aspx?id=V000735,,,No data supplied by the dental practice,Data not available,question,No data supplied by the dental practice,Data not available,question,No data supplied by the dental practice,Data not available,question,No data supplied by the dental practice,Data not available,question,No data supplied by the dental practice,Data not available,question,no,yes
Holbrooks Dental Care,V007084,DEN,75-77 Wheelwright Lane,75-77 Wheelwright Lane,W Midlands,Coventry,,CV6 4HN,Tel: 024 76366115,9 ratings Rate it yourself - /Services/dentists/LeaveReview/DefaultView.aspx?id=V007084,,,,false,no,No data supplied by the dental practice,Data not available,question,No data supplied by the dental practice,Data not available,question,No data supplied by the dental practice,Data not available,question,,true,yes,yes,yes
MR AS DEOL,V036634,DEN,Holbrooks Dental Care,75 - 77 Wheelwright Lane,HOLBROOKS,Coventry,,CV6 4HN,,No ratings yet Rate it yourself - /Services/dentists/LeaveReview/DefaultView.aspx?id=V036634,0,0,No data supplied by the dental practice,Data not available,question,No data supplied by the dental practice,Data not available,question,No data supplied by the dental practice,Data not available,question,No data supplied by the dental practice,Data not available,question,No data supplied by the dental practice,Data not available,question,,
Bell Green Dental Surgery,V007093,DEN,91 Roseberry Avenue,Bell Green Dental Surgery,Roseberry Avenue,Coventry,West Midlands,CV2 1NB,Tel: 02476688579,18 ratings Rate it yourself - /Services/dentists/LeaveReview/DefaultView.aspx?id=V007093,,,,false,no,No data supplied by the dental practice,Data not available,question,No data supplied by the dental practice,Data not available,question,No data supplied by the dental practice,Data not available,question,,true,yes,,yes
Wood End Dental Practice,V012603,DEN,Deedmore Road,Wood End,,Coventry,West Midlands,CV2 1XA,Tel: 024 76619286,5 ratings Rate it yourself - /Services/dentists/LeaveReview/DefaultView.aspx?id=V012603,,,,false,no,No data supplied by the dental practice,Data not available,question,No data supplied by the dental practice,Data not available,question,No data supplied by the dental practice,Data not available,question,,true,yes,no,yes
The Gentle Dental Centre,V007107,DEN,Gentle Dental Centre,318 - 320 Bell Green Road,COVENTRY,West Midlands,,CV6 7HB,Tel: 0247668 7855,18 ratings Rate it yourself - /Services/dentists/LeaveReview/DefaultView.aspx?id=V007107,,,,false,no,No data supplied by the dental practice,Data not available,question,No data supplied by the dental practice,Data not available,question,No data supplied by the dental practice,Data not available,question,,true,yes,,
Rotherham Road Dental Practice,V007114,DEN,4 Rotherham Road,Holbrooks,,Coventry,West Midlands,CV6 4FE,Tel: 024 76688266,5 ratings Rate it yourself - /Services/dentists/LeaveReview/DefaultView.aspx?id=V007114,,,,false,no,No data supplied by the dental practice,Data not available,question,No data supplied by the dental practice,Data not available,question,No data supplied by the dental practice,Data not available,question,,true,yes,,no
Mrs C A Connor,V006074,DEN,165 Long Street,,,Atherstone,Warwickshire,CV9 1AD,Tel: 01827 714166,10 ratings Rate it yourself - /Services/dentists/LeaveReview/DefaultView.aspx?id=V006074,,,,false,no,No data supplied by the dental practice,Data not available,question,No data supplied by the dental practice,Data not available,question,No data supplied by the dental practice,Data not available,question,,true,yes,no,yes
Foleshill Dental Practice ,V007105,DEN,549a Foleshill Road,Coventry,In case of urgent Dental Problem: WHATSAPP MESSAGE ONLY : 07570815387,W Midlands,,CV6 5AU,Tel: 024 7668 8207,7 ratings Rate it yourself - /Services/dentists/LeaveReview/DefaultView.aspx?id=V007105,,,,false,no,No data supplied by the dental practice,Data not available,question,No data supplied by the dental practice,Data not available,question,No data supplied by the dental practice,Data not available,question,,true,yes,yes,yes
Densmile Dental Care,V007110,DEN,197 Broad Street,Coventry,,W Midlands,,CV6 5BN,Tel: 024 7668 9483,No ratings yet Rate it yourself - /Services/dentists/LeaveReview/DefaultView.aspx?id=V007110,0,0,,false,no,No data supplied by the dental practice,Data not available,question,No data supplied by the dental practice,Data not available,question,No data supplied by the dental practice,Data not available,question,,true,yes,no,yes
Atherstone Dental Practice,V006075,DEN,60 Long Street,,,Atherstone,Warwickshire,CV9 1AU,Tel: 01827 718946,57 ratings Rate it yourself - /Services/dentists/LeaveReview/DefaultView.aspx?id=V006075,,,,false,no,No data supplied by the dental practice,Data not available,question,No data supplied by the dental practice,Data not available,question,No data supplied by the dental practice,Data not available,question,,true,yes,no,yes
Jubilee Dental Practice,V007119,DEN,3 Jubilee Crescent,Radford,,Coventry,West Midlands,CV6 3EX,Tel: 024 7659 9810,94 ratings Rate it yourself - /Services/dentists/LeaveReview/DefaultView.aspx?id=V007119,,,Only by referral from a dental practitioner,true,yes,,false,no,,false,no,,false,no,,false,no,yes,no
Bhandal Dental Practice ,V007075,DEN,Bhandal Dental Practice,298a-c Foleshill Road,Foleshill,Coventry,West Midlands,CV6 5AH,Tel: 024 7668 6690,95 ratings Rate it yourself - /Services/dentists/LeaveReview/DefaultView.aspx?id=V007075,,,,false,no,No data supplied by the dental practice,Data not available,question,No data supplied by the dental practice,Data not available,question,No data supplied by the dental practice,Data not available,question,,true,yes,yes,yes
Torcross Dental Practice,V007120,DEN,41 Torcross Avenue,Coventry,,W Midlands,,CV2 3NE,Tel: 024 7645 0099,136 ratings Rate it yourself - /Services/dentists/LeaveReview/DefaultView.aspx?id=V007120,,,Only by referral from a dental practitioner,true,yes,,false,no,,false,no,,false,no,,false,no,yes,yes
Longfellow Road Partnership,V031048,DEN,2-4 LONGFELLOW ROAD,COVENTRY,,coventry,West Midlands,CV2 5HB,Tel: 024 7645 1569,24 ratings Rate it yourself - /Services/dentists/LeaveReview/DefaultView.aspx?id=V031048,,,,false,no,No data supplied by the dental practice,Data not available,question,No data supplied by the dental practice,Data not available,question,No data supplied by the dental practice,Data not available,question,,true,yes,,
Hillfields Dental Surgery,V007136,DEN,21 Berry Street,Hillfields,W Midlands,Coventry,West Midlands,CV1 5JT,Tel: 024 7622 3707,8 ratings Rate it yourself - /Services/dentists/LeaveReview/DefaultView.aspx?id=V007136,,,,false,no,No data supplied by the dental practice,Data not available,question,No data supplied by the dental practice,Data not available,question,No data supplied by the dental practice,Data not available,question,,true,yes,yes,yes
The Smile Centre ,V007118,DEN,90 Walsgrave Road,Coventry,,West Midlands,,CV2 4ED,Tel: 024 7645 3850,23 ratings Rate it yourself - /Services/dentists/LeaveReview/DefaultView.aspx?id=V007118,,,,false,no,No data supplied by the dental practice,Data not available,question,No data supplied by the dental practice,Data not available,question,No data supplied by the dental practice,Data not available,question,,true,yes,no,no
Light Lane Dental Surgery,V007074,DEN,1 Light Lane,Coventry,,W Midlands,,CV1 4BQ,Tel: 024 7622 8108,14 ratings Rate it yourself - /Services/dentists/LeaveReview/DefaultView.aspx?id=V007074,,,,false,no,No data supplied by the dental practice,Data not available,question,No data supplied by the dental practice,Data not available,question,No data supplied by the dental practice,Data not available,question,,true,yes,yes,yes
"mydentist, Moseley Avenue, Coundon",V007112,DEN,,107 Moseley Avenue,,Coventry,,CV6 1HR,Tel: 02476592723,19 ratings Rate it yourself - /Services/dentists/LeaveReview/DefaultView.aspx?id=V007112,,,,false,no,No data supplied by the dental practice,Data not available,question,No data supplied by the dental practice,Data not available,question,No data supplied by the dental practice,Data not available,question,,true,yes,yes,yes
Earl Shilton Dental Practice,V006489,DEN,128a Wood Street,,,Earl Shilton,,LE9 7ND,Tel: 01455 842941,3 ratings Rate it yourself - /Services/dentists/LeaveReview/DefaultView.aspx?id=V006489,,,,false,no,No data supplied by the dental practice,Data not available,question,No data supplied by the dental practice,Data not available,question,No data supplied by the dental practice,Data not available,question,,true,yes,yes,yes
Marlborough Road Dental Practice,V007127,DEN,106 Marlborough Road,Coventry,,W Midlands,,CV2 4ER,Tel: 024 7645 4350,1 rating Rate it yourself - /Services/dentists/LeaveReview/DefaultView.aspx?id=V007127,,,Only by referral from a dental practitioner,true,yes,,false,no,,false,no,,false,no,,false,no,,yes
"Bupa Dental Care, Coventry",V007071,DEN,Gosford Lodge Dental Surgery,Binley Road,,Coventry,,CV3 1JD,Tel: 024 7623 1814,9 ratings Rate it yourself - /Services/dentists/LeaveReview/DefaultView.aspx?id=V007071,,,Only by referral from a dental practitioner,true,yes,,false,no,,false,no,,false,no,,true,yes,yes,yes
Holyhead Dental Practice,V007130,DEN,Holyhead Dental Practice,117 Holyhead Road,,Coventry,,CV1 3AD,Tel: 024 7622 0514,9 ratings Rate it yourself - /Services/dentists/LeaveReview/DefaultView.aspx?id=V007130,,,Only by referral from a dental practitioner,true,yes,,false,no,,false,no,,false,no,,true,yes,yes,yes
Stoke Aldermoor Dental Surgery,V010298,DEN,Aldermoor Lane,Stoke Aldermoor,,Coventry,West Midlands,CV3 1BN,Tel: 024 76459510,9 ratings Rate it yourself - /Services/dentists/LeaveReview/DefaultView.aspx?id=V010298,,,,false,no,No data supplied by the dental practice,Data not available,question,No data supplied by the dental practice,Data not available,question,No data supplied by the dental practice,Data not available,question,,true,yes,no,yes
Pinnacle Orthodontics,V007077,DEN,13 Park Road,Coventry,,W Midlands,,CV1 2LE,Tel: 024 7622 1289,9 ratings Rate it yourself - /Services/dentists/LeaveReview/DefaultView.aspx?id=V007077,,,Only by referral from a dental practitioner,true,yes,,false,no,,false,no,,false,no,,true,yes,yes,yes
Dental Perfection,V007083,DEN,7 Grosvenor House Grosvenor Road,Coventry,,West  Midlands,,CV1 3FE,Tel: 024 7622 0420,3 ratings Rate it yourself - /Services/dentists/LeaveReview/DefaultView.aspx?id=V007083,,,No data supplied by the dental practice,Data not available,question,No data supplied by the dental practice,Data not available,question,No data supplied by the dental practice,Data not available,question,No data supplied by the dental practice,Data not available,question,No data supplied by the dental practice,Data not available,question,no,yes
Park Road Dental Care,V014939,DEN,Park House,Station Square,,Coventry,West Midlands,CV1 2FL,Tel: 024 76220196,79 ratings Rate it yourself - /Services/dentists/LeaveReview/DefaultView.aspx?id=V014939,,,Only by referral from a dental practitioner,true,yes,,false,no,,false,no,,false,no,,true,yes,yes,yes
Chapelfields Dental Practice,V007073,DEN,2 Sir Thomas Whites Road,Coventry,,W Midlands,,CV5 8DQ,Tel: 024 7667 4886,7 ratings Rate it yourself - /Services/dentists/LeaveReview/DefaultView.aspx?id=V007073,,,,false,no,No data supplied by the dental practice,Data not available,question,No data supplied by the dental practice,Data not available,question,No data supplied by the dental practice,Data not available,question,,true,yes,yes,yes
Allesley Park Dental Surgery,V007121,DEN,,122 Winsford Avenue,,Coventry,West Midlands,CV5 9JB,Tel: 024 7669 1904,1 rating Rate it yourself - /Services/dentists/LeaveReview/DefaultView.aspx?id=V007121,,,Only by referral from a dental practitioner,true,yes,,false,no,,false,no,,false,no,,false,no,no,yes
Bosworth Dental Ltd,V006487,DEN,York House,41 Station Road,,Market Bosworth,Warwickshire,CV13 0LT,Tel: 01455 290777,10 ratings Rate it yourself - /Services/dentists/LeaveReview/DefaultView.aspx?id=V006487,,,,false,no,No data supplied by the dental practice,Data not available,question,No data supplied by the dental practice,Data not available,question,No data supplied by the dental practice,Data not available,question,,true,yes,yes,yes
"mydentist, Kingston Road, Coventry",V007076,DEN,,2 Kingston Road,Earlsdon,Coventry,West Midlands,CV5 6LN,Tel: 024 7667 2962,8 ratings Rate it yourself - /Services/dentists/LeaveReview/DefaultView.aspx?id=V007076,,,,false,no,No data supplied by the dental practice,Data not available,question,No data supplied by the dental practice,Data not available,question,No data supplied by the dental practice,Data not available,question,,true,yes,no,yes
Revel Dental,V006059,DEN,33 Coventry Road,Pailton,Rugby,Warks,,CV23 0QD,Tel: Tel: 01788 832346,2 ratings Rate it yourself - /Services/dentists/LeaveReview/DefaultView.aspx?id=V006059,,,No data supplied by the dental practice,Data not available,question,No data supplied by the dental practice,Data not available,question,No data supplied by the dental practice,Data not available,question,No data supplied by the dental practice,Data not available,question,No data supplied by the dental practice,Data not available,question,no,yes
Cheylesmore Dental Practice ,V007117,DEN,Face Dental,76 Quinton Road,Coventry,W Midlands,,CV3 5FD,Tel: 024 7650 1125,No ratings yet Rate it yourself - /Services/dentists/LeaveReview/DefaultView.aspx?id=V007117,0,0,Only by referral from a dental practitioner,true,yes,,false,no,,false,no,,false,no,,false,no,no,yes
Willenhall Dental Centre,V007072,DEN,Primary Care Building,Remembrance Rd,Willenhall,Coventry,West Midlands,CV3 3DG,Tel: 024 7630 4897,34 ratings Rate it yourself - /Services/dentists/LeaveReview/DefaultView.aspx?id=V007072,,,,false,no,No data supplied by the dental practice,Data not available,question,No data supplied by the dental practice,Data not available,question,No data supplied by the dental practice,Data not available,question,,true,yes,yes,yes
Broad Lane Dental Practice,V007123,DEN,276 Broad Lane,Coventry,,W Midlands,,CV5 7AT,Tel: 024 7646 5100,8 ratings Rate it yourself - /Services/dentists/LeaveReview/DefaultView.aspx?id=V007123,,,Only by referral from a dental practitioner,true,yes,,false,no,,false,no,,false,no,,false,no,,yes
Tile Hill Dental Practice,V012602,DEN,Jardine Crescent,Tile Hill,,Coventry,West Midlands,CV4 9PN,Tel: 024 76694215,4 ratings Rate it yourself - /Services/dentists/LeaveReview/DefaultView.aspx?id=V012602,,,,false,no,No data supplied by the dental practice,Data not available,question,No data supplied by the dental practice,Data not available,question,No data supplied by the dental practice,Data not available,question,,true,yes,no,yes