Organisation Name,NACS Code,Organisation Type,Address1,Address2,Address3,Address4,Address5,PostCode,Telephone Number,NHS.UK users rating,Value  (NHS.UK users rating),Banding Classification  (NHS.UK users rating),Car parking (Is there car parking at this organisation?),Disabled access (Disabled access)
Agincare Worcester,1-8664685889,SCL,Office 16 & 17,"1st Floor Riverside Business Centre, Worcester Road",,Stourport-on-severn,,DY13 9BZ,Tel: 01299871841,No ratings yet Rate it yourself - /Services/careproviders/LeaveReview/DefaultView.aspx?id=1-8664685889,0,0,,
Riverside Home Care,1-1848974329,SCL,Anglo House,Worcester Road,,Stourport-on-Severn,,DY13 9AW,Tel: 01299823777,No ratings yet Rate it yourself - /Services/careproviders/LeaveReview/DefaultView.aspx?id=1-1848974329,0,0,,
Advantage Health & Social Care,1-4393424020,SCL,Suite 13,"Old Anglo House, Mitton Street",,Stourport-on-severn,,DY13 9AW,Tel: 01299407177,No ratings yet Rate it yourself - /Services/careproviders/LeaveReview/DefaultView.aspx?id=1-4393424020,0,0,,
The Wharf Care Centre,1-7382852438,SCL,76 Minster Road,,,Stourport-on-severn,,DY13 8AP,Tel: 01299393098,No ratings yet Rate it yourself - /Services/careproviders/LeaveReview/DefaultView.aspx?id=1-7382852438,0,0,,
Radis Community Care (School Gardens),1-5086855628,SCL,Vernon Road,,,Stourport-on-severn,,DY13 8ES,Tel: 01299669942,No ratings yet Rate it yourself - /Services/careproviders/LeaveReview/DefaultView.aspx?id=1-5086855628,0,0,,
Shenstone House,1-163306355,SCL,Shenstone,,,Kidderminster,Worcestershire,DY10 4DH,Tel: 01562777454,1 rating Rate it yourself - /Services/careproviders/LeaveReview/DefaultView.aspx?id=1-163306355,,,,
Minster Grange Residential Home,1-416979147,SCL,Minster Road,,,Stourport On Severn,Worcestershire,DY13 8AT,Tel: 01299826636,No ratings yet Rate it yourself - /Services/careproviders/LeaveReview/DefaultView.aspx?id=1-416979147,0,0,,
Areley House,1-12257889102,SCL,Areley Lane,,,Stourport-on-severn,,DY13 0AB,Tel: 01299877727,No ratings yet Rate it yourself - /Services/careproviders/LeaveReview/DefaultView.aspx?id=1-12257889102,0,0,,
A & M Bewdley Care Services,1-841748157,SCL,Oldington Lane,,,Kidderminster,,DY11 7QN,Tel: 01562750060,No ratings yet Rate it yourself - /Services/careproviders/LeaveReview/DefaultView.aspx?id=1-841748157,0,0,,
Care 4 Mind Limited,1-15922508034,SCL,131a & 131b Redstone Lane,,,Stourport-on-severn,,DY13 0JN,,No ratings yet Rate it yourself - /Services/careproviders/LeaveReview/DefaultView.aspx?id=1-15922508034,0,0,,
Rutland Villa,1-127549079,SCL,62 Chesshire Avenue,,,Stourport On Severn,Worcestershire,DY13 0EA,Tel: 01299879221,No ratings yet Rate it yourself - /Services/careproviders/LeaveReview/DefaultView.aspx?id=1-127549079,0,0,,
Lanbeth Resolutions Ltd,1-10888980424,SCL,88 Linnet Rise,,,Kidderminster,,DY10 4TU,Tel: 07908731955,No ratings yet Rate it yourself - /Services/careproviders/LeaveReview/DefaultView.aspx?id=1-10888980424,0,0,,
Herons Park Nursing Home,1-8220002745,SCL,Heronswood Road,,,Kidderminster,,DY10 4EX,Tel: 01562825814,No ratings yet Rate it yourself - /Services/careproviders/LeaveReview/DefaultView.aspx?id=1-8220002745,0,0,,
Foley Grange,1-11982697817,SCL,Silverwoods Way,,,Kidderminster,,DY11 7DT,Tel: 01562543366,No ratings yet Rate it yourself - /Services/careproviders/LeaveReview/DefaultView.aspx?id=1-11982697817,0,0,,
Worth Crescent,1-147763160,SCL,35 Worth Crescent,,,Stourport on Severn,Worcestershire,DY13 8RR,Tel: 01299822515,No ratings yet Rate it yourself - /Services/careproviders/LeaveReview/DefaultView.aspx?id=1-147763160,0,0,,
Berrington Court,1-3515802189,SCL,Felix Baxter Drive,,,Kidderminster,Worcestershire,DY11 7FH,Tel: 01562733134,No ratings yet Rate it yourself - /Services/careproviders/LeaveReview/DefaultView.aspx?id=1-3515802189,0,0,,
Astley Hall Care Home,1-412490546,SCL,Church Lane,Astley,,Stourport-on-Severn,Worcestershire,DY13 0RW,Tel: 01299 827020,No ratings yet Rate it yourself - /Services/careproviders/LeaveReview/DefaultView.aspx?id=1-412490546,0,0,,
Ravenhurst Residential Care Home,1-124396183,SCL,21 Lickhill Road North,,,Stourport On Severn,Worcestershire,DY13 8RU,Tel: 01299825610,No ratings yet Rate it yourself - /Services/careproviders/LeaveReview/DefaultView.aspx?id=1-124396183,0,0,,
Coppice Lodge,1-4749428543,SCL,66-68 Walter Nash Road East,,,Kidderminster,Worcestershire,DY11 7BY,Tel: 01562637665,No ratings yet Rate it yourself - /Services/careproviders/LeaveReview/DefaultView.aspx?id=1-4749428543,0,0,,
Dunley Hall & Ryans Court,1-412499036,SCL,Dunley,,,Stourport-on-Severn,Worcestershire,DY13 0TX,Tel: 01299 822040,No ratings yet Rate it yourself - /Services/careproviders/LeaveReview/DefaultView.aspx?id=1-412499036,0,0,,
Infinity Home Care Ltd,1-2844923462,SCL,62 Summer Road,,,Kidderminster,Worcestershire,DY11 7JS,Tel: 01562 720955,No ratings yet Rate it yourself - /Services/careproviders/LeaveReview/DefaultView.aspx?id=1-2844923462,0,0,,
Brook Court,1-964917015,SCL,37-39 Oldnall Road,,,Kidderminster,,DY10 3HN,Tel: 01562814610,No ratings yet Rate it yourself - /Services/careproviders/LeaveReview/DefaultView.aspx?id=1-964917015,0,0,,
The Woodlands,1-15351658453,SCL,The Woodlands,Rifle Range Road,,Kidderminster,,DY11 7NN,Tel: 0156269525,No ratings yet Rate it yourself - /Services/careproviders/LeaveReview/DefaultView.aspx?id=1-15351658453,0,0,,
Fairmont Residential Limited,1-112445944,SCL,144 Chester Road South,,,Kidderminster,Worcestershire,DY10 1XB,,No ratings yet Rate it yourself - /Services/careproviders/LeaveReview/DefaultView.aspx?id=1-112445944,0,0,,
Stone House Care and Medical Limited,1-4869912655,SCL,Office 11 M C F Complex,60 New Road,,Kidderminster,,DY10 1AQ,Tel: 01562825603,No ratings yet Rate it yourself - /Services/careproviders/LeaveReview/DefaultView.aspx?id=1-4869912655,0,0,,
Endurance Care Worcestershire,1-8798479187,SCL,Suite 123 Paddington house,New Road,,Kidderminster,,DY10 1AL,Tel: 01562829115,No ratings yet Rate it yourself - /Services/careproviders/LeaveReview/DefaultView.aspx?id=1-8798479187,0,0,,
Holmwood Care Centre,1-140178932,SCL,30 Chaddesley Road,,,Kidderminster,Worcestershire,DY10 3DJ,Tel: 01562824496,1 rating Rate it yourself - /Services/careproviders/LeaveReview/DefaultView.aspx?id=1-140178932,,,,
Mariantonia House Residential Care Home,1-126656778,SCL,17 Comberton Road,,,Kidderminster,Worcestershire,DY10 1UA,Tel: 0156269445,No ratings yet Rate it yourself - /Services/careproviders/LeaveReview/DefaultView.aspx?id=1-126656778,0,0,,
Nightingale Court,1-243302416,SCL,11-14 Comberton Road,,,Kidderminster,Worcestershire,DY10 1UA,Tel: 01562824980,No ratings yet Rate it yourself - /Services/careproviders/LeaveReview/DefaultView.aspx?id=1-243302416,0,0,,
Lorne House,1-1072625331,SCL,14 Lorne Street,,,Kidderminster,Worcestershire,DY10 1SY,Tel: 01562630522,No ratings yet Rate it yourself - /Services/careproviders/LeaveReview/DefaultView.aspx?id=1-1072625331,0,0,,
Offmore Farm Residential Home,1-119206799,SCL,Offmore Farm Close,,,Kidderminster,Worcestershire,DY10 3HB,Tel: 01562515189,No ratings yet Rate it yourself - /Services/careproviders/LeaveReview/DefaultView.aspx?id=1-119206799,0,0,,
Ignite Health and Home Care Service,1-411021458,SCL,10 Lion Street,,,Kidderminster,Worcestershire,DY10 1PT,Tel: 01562515073,No ratings yet Rate it yourself - /Services/careproviders/LeaveReview/DefaultView.aspx?id=1-411021458,0,0,,
Arch Hill Court,1-2229351315,SCL,Orchard Street,,,Kidderminster,Worcestershire,DY10 2JA,Tel: 01562733000,No ratings yet Rate it yourself - /Services/careproviders/LeaveReview/DefaultView.aspx?id=1-2229351315,0,0,,
The Shrubbery Nursing Home,1-5579536315,SCL,Birmingham Road,,,Kidderminster,Worcestershire,DY10 2JZ,Tel: 01562822787,No ratings yet Rate it yourself - /Services/careproviders/LeaveReview/DefaultView.aspx?id=1-5579536315,0,0,,
Rockny House,1-142642315,SCL,25 Birmingham Road,,,Kidderminster,Worcestershire,DY10 2BX,Tel: 01562864067,No ratings yet Rate it yourself - /Services/careproviders/LeaveReview/DefaultView.aspx?id=1-142642315,0,0,,
Bewdley Care Ltd,1-1271852890,SCL,"The Coach House, Shrubbery House",21 Birmingham Road,,Kidderminster,Worcestershire,DY10 2BX,Tel: 0156269771,No ratings yet Rate it yourself - /Services/careproviders/LeaveReview/DefaultView.aspx?id=1-1271852890,0,0,,
Huuman Kind Care Ltd,1-9677461432,SCL,40 Mill Street,,,Kidderminster,,DY11 6XB,Tel: 01562307147,No ratings yet Rate it yourself - /Services/careproviders/LeaveReview/DefaultView.aspx?id=1-9677461432,0,0,,
The Grove,1-120814486,SCL,8 Blakebrook,,,Kidderminister,Worcestershire,DY11 6AP,Tel: 01562820728,No ratings yet Rate it yourself - /Services/careproviders/LeaveReview/DefaultView.aspx?id=1-120814486,0,0,,
Brookdale Nursing Home,1-154385956,SCL,16 Blakebrook,,,Kidderminster,Worcestershire,DY11 6AP,Tel: 01562823063,1 rating Rate it yourself - /Services/careproviders/LeaveReview/DefaultView.aspx?id=1-154385956,,,,
Orbital 4 Support Limited,1-2060180397,SCL,1 Clares Court,,,Kidderminster,Worcestershire,DY11 6YX,Tel: 01562742458,No ratings yet Rate it yourself - /Services/careproviders/LeaveReview/DefaultView.aspx?id=1-2060180397,0,0,,
Arden House,1-4936865308,SCL,11 Roden Avenue,,,Kidderminster,Worcestershire,DY10 2RF,Tel: 01562 744056,No ratings yet Rate it yourself - /Services/careproviders/LeaveReview/DefaultView.aspx?id=1-4936865308,0,0,,
Cambrian House,1-153979378,SCL,294 Chester Road North,,,Kidderminster,Worcestershire,DY10 2RR,Tel: 01562825537,No ratings yet Rate it yourself - /Services/careproviders/LeaveReview/DefaultView.aspx?id=1-153979378,0,0,,
Bryden House,1-1711596182,SCL,Marlpool Lane,,,Kidderminster,Worcestershire,DY11 5DA,Tel: 01562755888,No ratings yet Rate it yourself - /Services/careproviders/LeaveReview/DefaultView.aspx?id=1-1711596182,0,0,,
Pine Lodge CCT,1-15935651948,SCL,10 Broomfield Road,,,Kidderminster,,DY11 5PB,Tel: 01902854259,No ratings yet Rate it yourself - /Services/careproviders/LeaveReview/DefaultView.aspx?id=1-15935651948,0,0,,
The Gables Rest Home,1-7264402790,SCL,18 Broomfield Road,,,Kidderminster,Worcestershire,DY11 5PB,Tel: 01562745428,No ratings yet Rate it yourself - /Services/careproviders/LeaveReview/DefaultView.aspx?id=1-7264402790,0,0,,
West Midlands Supported Living Service,1-118032018,SCL,184 Franche Road,,,Kidderminster,Worcestershire,DY11 5AD,Tel: 01562745963,No ratings yet Rate it yourself - /Services/careproviders/LeaveReview/DefaultView.aspx?id=1-118032018,0,0,,
Coombe House,1-118031951,SCL,54 Broomfield Road,,,Kidderminster,Worcestershire,DY11 5PH,Tel: 01562824770,No ratings yet Rate it yourself - /Services/careproviders/LeaveReview/DefaultView.aspx?id=1-118031951,0,0,,
Milldale Close,1-873604805,SCL,3 Milldale Close,,,Kidderminster,Worcestershire,DY10 2PX,Tel: 0156263424,No ratings yet Rate it yourself - /Services/careproviders/LeaveReview/DefaultView.aspx?id=1-873604805,0,0,,
The Firs Care Home,1-120296844,SCL,105 Habberley Road,,,Kidderminster,Worcestershire,DY11 5PW,Tel: 01562741358,No ratings yet Rate it yourself - /Services/careproviders/LeaveReview/DefaultView.aspx?id=1-120296844,0,0,,
Stourport Nursing and Homecare Limited,1-130594772,SCL,Hernes Nest House,"7 Hernes Nest, Off Park Lane",,Bewdley,Worcestershire,DY12 2ET,Tel: 01299403353,No ratings yet Rate it yourself - /Services/careproviders/LeaveReview/DefaultView.aspx?id=1-130594772,0,0,,
Hernes Nest House,1-117538288,SCL,Herne's Nest,Off Park Lane,,Bewdley,Worcestershire,DY12 2ET,Tel: 01299402136,No ratings yet Rate it yourself - /Services/careproviders/LeaveReview/DefaultView.aspx?id=1-117538288,0,0,,
TLC Care at Home Ltd,1-2037345972,SCL,58 Load Street,,,Bewdley,Worcestershire,DY12 2AP,Tel: 01299272897,2 ratings Rate it yourself - /Services/careproviders/LeaveReview/DefaultView.aspx?id=1-2037345972,,,,
Hollyfields,1-125856154,SCL,Habberley Road,Habberley,,Kidderminster,Worcestershire,DY11 5RJ,Tel: 01562514810,1 rating Rate it yourself - /Services/careproviders/LeaveReview/DefaultView.aspx?id=1-125856154,,,,
Countywide Home Care Limited,1-113723385,SCL,97a Marlpool Lane,,,Kidderminster,Worcestershire,DY11 5HP,Tel: 01562515583,No ratings yet Rate it yourself - /Services/careproviders/LeaveReview/DefaultView.aspx?id=1-113723385,0,0,,
Westmead Residential Care Home,1-124396218,SCL,Westmead Close,Westacre,,Droitwich,Worcestershire,WR9 9LG,Tel: 01905778353,No ratings yet Rate it yourself - /Services/careproviders/LeaveReview/DefaultView.aspx?id=1-124396218,0,0,,
Rosedene,1-127548980,SCL,128 Franche Road,,,Kidderminster,Worcestershire,DY11 5BE,Tel: 01562861917,No ratings yet Rate it yourself - /Services/careproviders/LeaveReview/DefaultView.aspx?id=1-127548980,0,0,,
Diadem Care Limited,1-3296063004,SCL,27 Albrighton Drive,,,Kidderminster,,DY10 2NX,Tel: 07511591541,No ratings yet Rate it yourself - /Services/careproviders/LeaveReview/DefaultView.aspx?id=1-3296063004,0,0,,
The Priory Care Home,1-121484291,SCL,Crutch Lane,Dodderhill,,Droitwich,Worcestershire,WR9 0BE,Tel: 01905771595,No ratings yet Rate it yourself - /Services/careproviders/LeaveReview/DefaultView.aspx?id=1-121484291,0,0,,
Upper Ford Lodge,1-129855529,SCL,Ford Lane,,,Droitwich,Worcestershire,WR9 0BQ,Tel: 01905779949,No ratings yet Rate it yourself - /Services/careproviders/LeaveReview/DefaultView.aspx?id=1-129855529,0,0,,
Your Elysium Limited,1-3005110455,SCL,"Unit 5b, Top Barn Business Centre,","Worcester Road, Holt Heath",,Worcester,,WR6 6NH,Tel: 01905930699,No ratings yet Rate it yourself - /Services/careproviders/LeaveReview/DefaultView.aspx?id=1-3005110455,0,0,,
Snow Bengal Ltd,1-14907954822,SCL,"Unit 18a, Top Barn Business Centre","Worcester Road, Holt Heath",,Worcester,,WR6 6NH,Tel: 01905954694,No ratings yet Rate it yourself - /Services/careproviders/LeaveReview/DefaultView.aspx?id=1-14907954822,0,0,,
Virtuous Business Solutions Limited,1-10587106120,SCL,65 Ombersley Street East,,,Droitwich,,WR9 8QS,Tel: 07960102647,No ratings yet Rate it yourself - /Services/careproviders/LeaveReview/DefaultView.aspx?id=1-10587106120,0,0,,
Civicare (Central) Ltd,1-2344181179,SCL,Unit 4A,40 St Andrews House,,Droitwich,Worcestershire,WR9 8HE,Tel: 01905 770110,No ratings yet Rate it yourself - /Services/careproviders/LeaveReview/DefaultView.aspx?id=1-2344181179,0,0,,
Summerdyne Nursing Home,1-115758590,SCL,Cleobury Road,Wyre Hill,,Bewdley,Worcestershire,DY12 2QQ,Tel: 01299 403260,No ratings yet Rate it yourself - /Services/careproviders/LeaveReview/DefaultView.aspx?id=1-115758590,0,0,,
Honeybrook House,1-120814546,SCL,Honeybrook Lane,,,Kidderminster,Worcestershire,DY11 5QS,Tel: 01562748109,No ratings yet Rate it yourself - /Services/careproviders/LeaveReview/DefaultView.aspx?id=1-120814546,0,0,,
Uplifting Lives Services Ltd,1-5600612940,SCL,1a Nellies Yard,High Street,,Droitwich,,WR9 8ES,Tel: 01905954424,No ratings yet Rate it yourself - /Services/careproviders/LeaveReview/DefaultView.aspx?id=1-5600612940,0,0,,
North Star Foundation,1-201080733,SCL,8 Old Market Court,High Street,,Droitwich,Worcestershire,WR9 8ES,Tel: 01905772233,No ratings yet Rate it yourself - /Services/careproviders/LeaveReview/DefaultView.aspx?id=1-201080733,0,0,,
Advance Warwickshire and Worcestershire,1-15112584637,SCL,Kings Court,Worcester Road,,Droitwich,,WR9 8AG,Tel: 01905795899,No ratings yet Rate it yourself - /Services/careproviders/LeaveReview/DefaultView.aspx?id=1-15112584637,0,0,,
Dorset House Nursing Home,1-2188142731,SCL,Blackfriars Avenue,,,Droitwich,Worcestershire,WR9 8DR,Tel: 01905 772710,No ratings yet Rate it yourself - /Services/careproviders/LeaveReview/DefaultView.aspx?id=1-2188142731,0,0,,
YourLife (Droitwich),1-2213119679,SCL,Horton Mill Court,Hanbury Road,,Droitwich,Worcestershire,WR9 8GD,Tel: 01905770288,No ratings yet Rate it yourself - /Services/careproviders/LeaveReview/DefaultView.aspx?id=1-2213119679,0,0,,
Nightingales Residential Home,1-1467195016,SCL,"Wolverley Court, Wolverley Road",,,Kidderminster,Worcestershire,DY10 3RP,Tel: 01562850201,No ratings yet Rate it yourself - /Services/careproviders/LeaveReview/DefaultView.aspx?id=1-1467195016,0,0,,
Rashwood,1-119255502,SCL,Wychbold,,,Droitwich,Worcestershire,WR9 0BP,Tel: 01527861258,No ratings yet Rate it yourself - /Services/careproviders/LeaveReview/DefaultView.aspx?id=1-119255502,0,0,,
Spectrum Days,1-940109194,SCL,Old Coach Road,,,Droitwich,Worcestershire,WR9 8BB,Tel: 07972704378,No ratings yet Rate it yourself - /Services/careproviders/LeaveReview/DefaultView.aspx?id=1-940109194,0,0,,
Brindley Manor Nursing Home,1-9983923716,SCL,St. Peters Walk,,,Droitwich,,WR9 8EX,Tel: 01905794506,No ratings yet Rate it yourself - /Services/careproviders/LeaveReview/DefaultView.aspx?id=1-9983923716,0,0,,
Corbett House Nursing Home,1-629935882,SCL,40-42 Corbett Avenue,,,Droitwich,Worcestershire,WR9 7BE,Tel: 01905770572,2 ratings Rate it yourself - /Services/careproviders/LeaveReview/DefaultView.aspx?id=1-629935882,,,,
Alliance Care Ltd,1-7939893436,SCL,130 Worcester Road,,,Droitwich,,WR9 8AN,Tel: 01905795086,No ratings yet Rate it yourself - /Services/careproviders/LeaveReview/DefaultView.aspx?id=1-7939893436,0,0,,
Safeharbour (Droitwich),1-118314634,SCL,52 Corbett Avenue,,,Droitwich,Worcestershire,WR9 7BH,Tel: 01905796214,No ratings yet Rate it yourself - /Services/careproviders/LeaveReview/DefaultView.aspx?id=1-118314634,0,0,,
The Haven Rest Home,1-115740267,SCL,218 Worcester Road,,,Droitwich,Worcestershire,WR9 8AY,Tel: 01905772240,No ratings yet Rate it yourself - /Services/careproviders/LeaveReview/DefaultView.aspx?id=1-115740267,0,0,,
Seco Support (Birmingham),1-15928186846,SCL,Walnut Tree House,"Astwood Lane, Wychbold",,Droitwich,,WR9 0BU,Tel: 07760676109,No ratings yet Rate it yourself - /Services/careproviders/LeaveReview/DefaultView.aspx?id=1-15928186846,0,0,,
Coach House Nursing Home,1-9677727203,SCL,Broome House,"Broome, Clent",,Stourbridge,,DY9 0HB,Tel: 01562700417,No ratings yet Rate it yourself - /Services/careproviders/LeaveReview/DefaultView.aspx?id=1-9677727203,0,0,,
Droitwich Mews Care Home,1-9706807476,SCL,Mulberry Tree Hill,,,Droitwich,,WR9 7SS,Tel: 01604675566,No ratings yet Rate it yourself - /Services/careproviders/LeaveReview/DefaultView.aspx?id=1-9706807476,0,0,,
Head Office,1-6024729651,SCL,16 Gaymore Road,Cookley,,Kidderminster,Worcestershire,DY10 3TU,Tel: 07368435522,No ratings yet Rate it yourself - /Services/careproviders/LeaveReview/DefaultView.aspx?id=1-6024729651,0,0,,
Heathbrook House Care Home,1-130112995,SCL,223-229 Worcester Road,Stoke Heath,,Bromsgrove,Worcestershire,B61 7JA,Tel: 01527882146,No ratings yet Rate it yourself - /Services/careproviders/LeaveReview/DefaultView.aspx?id=1-130112995,0,0,,
Westley Court Care Home,1-479372248,SCL,Austcliffe Lane,Cookley,,Kidderminster,Worcestershire,DY10 3RT,Tel: 01562852952,1 rating Rate it yourself - /Services/careproviders/LeaveReview/DefaultView.aspx?id=1-479372248,,,,
Breach House,1-394407907,SCL,Holy Cross Lane,Belbroughton,,Stourbridge,West Midlands,DY9 9SP,Tel: 01562730021,No ratings yet Rate it yourself - /Services/careproviders/LeaveReview/DefaultView.aspx?id=1-394407907,0,0,,
Woodland View Care Home,1-14186664916,SCL,Woodland Way,,,Droitwich,,WR9 7GP,Tel: 01905917358,No ratings yet Rate it yourself - /Services/careproviders/LeaveReview/DefaultView.aspx?id=1-14186664916,0,0,,
Eclipse Homecare (Bromsgrove & Kidderminster),1-2840045800,SCL,37 Gilbert Road,Gilbert Court,,Bromsgrove,Worcestershire,B60 3JZ,Tel: 01527573939,No ratings yet Rate it yourself - /Services/careproviders/LeaveReview/DefaultView.aspx?id=1-2840045800,0,0,,
Blue Recruit LTD,1-13175404811,SCL,"Suite 2, Banham House",Stoke Prior,,Bromsgrove,,B60 4JZ,Tel: 01216636305,No ratings yet Rate it yourself - /Services/careproviders/LeaveReview/DefaultView.aspx?id=1-13175404811,0,0,,
Newland Hurst,1-115610691,SCL,Newland Lane,"Newland, Droitwich Spa",,Droitwich,Worcestershire,WR9 7JH,Tel: 01905 773156,No ratings yet Rate it yourself - /Services/careproviders/LeaveReview/DefaultView.aspx?id=1-115610691,0,0,,
Right at Home Bromsgrove,1-15645160278,SCL,4 West Court,"Saxon Business Park, Hanbury Road, Stoke Prior",,Bromsgrove,,B60 4AD,Tel: 015279216070,No ratings yet Rate it yourself - /Services/careproviders/LeaveReview/DefaultView.aspx?id=1-15645160278,0,0,,
Alina Homecare Bromsgrove,1-130488908,SCL,Harris Business Park,Hanbury Road,,Bromsgrove,Worcestershire,B60 4FG,Tel: 01527 914093,No ratings yet Rate it yourself - /Services/careproviders/LeaveReview/DefaultView.aspx?id=1-130488908,0,0,,
House of Care Services Ltd,1-507870114,SCL,8 The Courtyard,Buntsford Drive,,Bromsgrove,Worcestershire,B60 3DJ,Tel: 02476637969,No ratings yet Rate it yourself - /Services/careproviders/LeaveReview/DefaultView.aspx?id=1-507870114,0,0,,
Pulse8+ Ltd,1-2106498773,SCL,20 St. John Street,,,Bromsgrove,,B61 8QY,Tel: 01527870879,No ratings yet Rate it yourself - /Services/careproviders/LeaveReview/DefaultView.aspx?id=1-2106498773,0,0,,
St John's Court,1-144158060,SCL,St Johns Street,,,Bromsgrove,Worcestershire,B61 8QT,Tel: 01527575070,No ratings yet Rate it yourself - /Services/careproviders/LeaveReview/DefaultView.aspx?id=1-144158060,0,0,,
Bluebird Care (Bromsgrove & Redditch),1-965462877,SCL,3 Millennium Court,Buntsford Park Road,,Bromsgrove,Worcestershire,B60 3DX,Tel: 01527916442,No ratings yet Rate it yourself - /Services/careproviders/LeaveReview/DefaultView.aspx?id=1-965462877,0,0,,
Breme Residential Care Home,1-124396114,SCL,Breme,46 Providence Road,,Bromsgrove,Worcestershire,B61 8EF,Tel: 01527813690,1 rating Rate it yourself - /Services/careproviders/LeaveReview/DefaultView.aspx?id=1-124396114,,,,
Care Force Limited,1-312765144,SCL,Holland House,12A High Street,,Bromsgrove,Worcestershire,B61 8HQ,Tel: 01527577247,No ratings yet Rate it yourself - /Services/careproviders/LeaveReview/DefaultView.aspx?id=1-312765144,0,0,,
Fernhill House,1-5383009245,SCL,Grange Lane,Fernhill Heath,,Worcester,Worcestershire,WR3 7UR,Tel: 01905679300,No ratings yet Rate it yourself - /Services/careproviders/LeaveReview/DefaultView.aspx?id=1-5383009245,0,0,,
Yourlife (Bromsgrove),1-4780659566,SCL,Bilberry Place,Recreation Road,,Bromsgrove,,B61 8DT,Tel: 01527872749,No ratings yet Rate it yourself - /Services/careproviders/LeaveReview/DefaultView.aspx?id=1-4780659566,0,0,,
Chandler Court,1-4767351188,SCL,Recreation Road,,,Bromsgrove,Worcestershire,B61 8DT,Tel: 03334552317,No ratings yet Rate it yourself - /Services/careproviders/LeaveReview/DefaultView.aspx?id=1-4767351188,0,0,,
Field House Rest Home,1-2309902684,SCL,Thicknall Lane (Off Western Road),"Hagley, Clent",,Stourbridge,West Midlands,DY9 0HL,Tel: 01562885211,No ratings yet Rate it yourself - /Services/careproviders/LeaveReview/DefaultView.aspx?id=1-2309902684,0,0,,
Wayside Care Home,1-650533794,SCL,25 New Road,,,Bromsgrove,Worcestershire,B60 2JQ,Tel: 01527837774,No ratings yet Rate it yourself - /Services/careproviders/LeaveReview/DefaultView.aspx?id=1-650533794,0,0,,
Ashfield House,1-463991220,SCL,Sugar Loaf Lane,Iverley,,Kidderminster,Worcestershire,DY10 3PB,Tel: 01562701118,No ratings yet Rate it yourself - /Services/careproviders/LeaveReview/DefaultView.aspx?id=1-463991220,0,0,,
3 Ferndale Close,1-4641648968,SCL,3 Ferndale Close,Hagley,,Stourbridge,West Midlands,DY9 0QA,Tel: 07980145915,No ratings yet Rate it yourself - /Services/careproviders/LeaveReview/DefaultView.aspx?id=1-4641648968,0,0,,
Appletrees Care Home,1-11547688402,SCL,242 Stourbridge Road,Catshill,,Bromsgrove,Worcestershire,B61 9LE,Tel: 01527877152,No ratings yet Rate it yourself - /Services/careproviders/LeaveReview/DefaultView.aspx?id=1-11547688402,0,0,,
Helping Hands Redditch & Bromsgrove,1-4652126081,SCL,Ground Floor,21 The Strand,,Bromsgrove,,B61 8AB,Tel: 01527910483,No ratings yet Rate it yourself - /Services/careproviders/LeaveReview/DefaultView.aspx?id=1-4652126081,0,0,,