Organisation Name,NACS Code,Organisation Type,Address1,Address2,Address3,Address4,Address5,PostCode,Telephone Number,NHS.UK users rating,Value  (NHS.UK users rating),Banding Classification  (NHS.UK users rating),Car parking (Is there car parking at this organisation?),Disabled access (Disabled access)
The Elms,1-19057063158,SCL,The Elms,Upton Snodsbury,,Worcester,,WR7 4NH,Tel: 01873881306,No ratings yet Rate it yourself - /Services/careproviders/LeaveReview/DefaultView.aspx?id=1-19057063158,0,0,,
The Mill House Care Home,1-140361465,SCL,Kington,Flyford Flavell,,Worcester,Worcestershire,WR7 4DG,Tel: 01386793110,No ratings yet Rate it yourself - /Services/careproviders/LeaveReview/DefaultView.aspx?id=1-140361465,0,0,,
Willow Bank House Residential Home,1-118898512,SCL,Willow Bank House,"Tilesford Park, Throckmorton",,Pershore,Worcestershire,WR10 2LA,Tel: 01386556844,No ratings yet Rate it yourself - /Services/careproviders/LeaveReview/DefaultView.aspx?id=1-118898512,0,0,,
Stonebow House Residential Home,1-112765288,SCL,Worcester Road,Peopleton,,Pershore,Worcestershire,WR10 2DY,Tel: 01905840245,No ratings yet Rate it yourself - /Services/careproviders/LeaveReview/DefaultView.aspx?id=1-112765288,0,0,,
Pershore Short Term Breaks,1-147763104,SCL,48 Station Road,,,Pershore,Worcestershire,WR10 1PD,Tel: 01386552978,No ratings yet Rate it yourself - /Services/careproviders/LeaveReview/DefaultView.aspx?id=1-147763104,0,0,,
Radis Community Care (Cherry Orchard House),1-5443182108,SCL,Cherry Orchard,,,Pershore,,WR10 1EZ,Tel: 07841628102,No ratings yet Rate it yourself - /Services/careproviders/LeaveReview/DefaultView.aspx?id=1-5443182108,0,0,,
Norton Hall,1-129942411,SCL,Woodbury Park,Norton,,Worcester,Worcestershire,WR5 2QU,Tel: 01905357766,No ratings yet Rate it yourself - /Services/careproviders/LeaveReview/DefaultView.aspx?id=1-129942411,0,0,,
R & L Healthcare,1-13363730271,SCL,"Unit 7, Offerton Barns Business Centre","Offerton Lane, Hindlip",,Worcester,Worcestershire,WR3 8SX,Tel: 01905455669,No ratings yet Rate it yourself - /Services/careproviders/LeaveReview/DefaultView.aspx?id=1-13363730271,0,0,,
Heathlands Residential Care Home,1-124396166,SCL,Station Road,,,Pershore,Worcestershire,WR10 1NG,Tel: 01386562220,No ratings yet Rate it yourself - /Services/careproviders/LeaveReview/DefaultView.aspx?id=1-124396166,0,0,,
Perry Manor,1-1459306141,SCL,Charles Hastings Way,,,Worcester,Worcestershire,WR5 1ET,Tel: 01905728410,No ratings yet Rate it yourself - /Services/careproviders/LeaveReview/DefaultView.aspx?id=1-1459306141,0,0,,
Monahen Care,1-2445161375,SCL,"Banbury House, Office 4,",Lower Priest Lane,,Pershore,,WR10 1BJ,Tel: 07311358533,No ratings yet Rate it yourself - /Services/careproviders/LeaveReview/DefaultView.aspx?id=1-2445161375,0,0,,
Shared Lives,1-982233179,SCL,G3 County Hall,Spetchley Road,,Worcester,,WR5 2NP,Tel: 01905844264,No ratings yet Rate it yourself - /Services/careproviders/LeaveReview/DefaultView.aspx?id=1-982233179,0,0,,
Reablement Service,1-982233141,SCL,G3 County Hall,Spetchley Road,,Worcester,,WR5 2NP,Tel: 01905843341,No ratings yet Rate it yourself - /Services/careproviders/LeaveReview/DefaultView.aspx?id=1-982233141,0,0,,
TruCARE UK Ltd,1-7216735073,SCL,29 Bridgnorth Row,Berkeley Beverborne,,Worcester,,WR4 0QF,Tel: 07834704945,No ratings yet Rate it yourself - /Services/careproviders/LeaveReview/DefaultView.aspx?id=1-7216735073,0,0,,
Latimer Court,1-592699847,SCL,Darwin Avenue,,,Worcester,Worcestershire,WR5 1SP,Tel: 01905363270,No ratings yet Rate it yourself - /Services/careproviders/LeaveReview/DefaultView.aspx?id=1-592699847,0,0,,
Dimensions Worcestershire Domiciliary Care Office,1-352614727,SCL,"Unit 6A1, Revolution House","Stanier Road, Warndon",,Worcester,Worcestershire,WR4 9FE,Tel: 03003039037,No ratings yet Rate it yourself - /Services/careproviders/LeaveReview/DefaultView.aspx?id=1-352614727,0,0,,
Crookbarrow View,1-11099525152,SCL,3 Gotland Road,Off Whittington Road,,Worcester,,WR5 2GN,Tel: 03701924347,No ratings yet Rate it yourself - /Services/careproviders/LeaveReview/DefaultView.aspx?id=1-11099525152,0,0,,
Radis Community Care (Meadow Court),1-4279578771,SCL,Meadow Court,Darwin Avenue,,Worcester,,WR5 1AP,Tel: 01905353453,No ratings yet Rate it yourself - /Services/careproviders/LeaveReview/DefaultView.aspx?id=1-4279578771,0,0,,
Wyndsor Home Care Ltd,1-388246437,SCL,21 Otley Close,Heron Grange,,Worcester,Worcestershire,WR4 0BJ,Tel: 01905613725,No ratings yet Rate it yourself - /Services/careproviders/LeaveReview/DefaultView.aspx?id=1-388246437,0,0,,
Shaw Red Hill Care Centre,1-8157662470,SCL,229 London Road,,,Worcester,Worcestershire,WR5 2JG,Tel: 01905354000,No ratings yet Rate it yourself - /Services/careproviders/LeaveReview/DefaultView.aspx?id=1-8157662470,0,0,,
Newland Hurst,1-115610691,SCL,Newland Lane,"Newland, Droitwich Spa",,Droitwich,Worcestershire,WR9 7JH,Tel: 01905 773156,No ratings yet Rate it yourself - /Services/careproviders/LeaveReview/DefaultView.aspx?id=1-115610691,0,0,,
Staffing Plus Ltd,1-2482960110,SCL,58 Cherwell Close,,,Worcester,,WR4 9BN,Tel: 01212968416,No ratings yet Rate it yourself - /Services/careproviders/LeaveReview/DefaultView.aspx?id=1-2482960110,0,0,,
Woodland View Care Home,1-14186664916,SCL,Woodland Way,,,Droitwich,,WR9 7GP,Tel: 01905917358,No ratings yet Rate it yourself - /Services/careproviders/LeaveReview/DefaultView.aspx?id=1-14186664916,0,0,,
Richmond Village Wood Norton DCA,1-6605114689,SCL,Evesham Road,Wood Norton,,Evesham,Worcestershire,WR11 4TY,Tel: 01386879399,No ratings yet Rate it yourself - /Services/careproviders/LeaveReview/DefaultView.aspx?id=1-6605114689,0,0,,
Richmond Village Wood Norton,1-6605114621,SCL,Evesham Road,Wood Norton,,Evesham,Worcestershire,WR11 4TY,Tel: 01386879399,No ratings yet Rate it yourself - /Services/careproviders/LeaveReview/DefaultView.aspx?id=1-6605114621,0,0,,
Worcestershire,1-14478954029,SCL,Suite G05,"Oak House, Bridgewater Road",,Worcester,,WR4 9FX,Tel: 07450936311,No ratings yet Rate it yourself - /Services/careproviders/LeaveReview/DefaultView.aspx?id=1-14478954029,0,0,,
Glarm Health Care Services Limited,1-17576806035,SCL,18 Blackthorn Road,,,Worcester,,WR4 9TD,Tel: 07427412381,No ratings yet Rate it yourself - /Services/careproviders/LeaveReview/DefaultView.aspx?id=1-17576806035,0,0,,
Nationwide Care Services Ltd (Worcester),1-2694538733,SCL,Blackpole Business Centre,Blackpole,,Worcester,,WR3 8SQ,Tel: 01905458792,No ratings yet Rate it yourself - /Services/careproviders/LeaveReview/DefaultView.aspx?id=1-2694538733,0,0,,
MJSGBig5RewardsHealthcare Limited,1-2420422302,SCL,"Room 11A1, Blackpole Business Centre",Blackpole Road,,Worcester,,WR3 8SQ,Tel: 01905923356,No ratings yet Rate it yourself - /Services/careproviders/LeaveReview/DefaultView.aspx?id=1-2420422302,0,0,,
Droitwich Mews Care Home,1-9706807476,SCL,Mulberry Tree Hill,,,Droitwich,,WR9 7SS,Tel: 01604675566,No ratings yet Rate it yourself - /Services/careproviders/LeaveReview/DefaultView.aspx?id=1-9706807476,0,0,,
People in Action Domiciliary Care - Worcester,1-111132927,SCL,"Suite 2, Crown House",Blackpole East,,Worcester,Worcestershire,WR3 8SG,Tel: 01905755843,No ratings yet Rate it yourself - /Services/careproviders/LeaveReview/DefaultView.aspx?id=1-111132927,0,0,,
South Hayes Care Home,1-154110564,SCL,101 London Road,,,Worcester,Worcestershire,WR5 2DZ,Tel: 01905357429,No ratings yet Rate it yourself - /Services/careproviders/LeaveReview/DefaultView.aspx?id=1-154110564,0,0,,
Phemacare Ltd,1-1607928970,SCL,78 London Road,,,Worcester,Worcestershire,WR5 2DY,Tel: 01905360105,No ratings yet Rate it yourself - /Services/careproviders/LeaveReview/DefaultView.aspx?id=1-1607928970,0,0,,
Assisted Lives (Worcester),1-9110930808,SCL,Unity House & Community Centre,Stanley Road,,Worcester,,WR5 1BE,Tel: 01527313690,No ratings yet Rate it yourself - /Services/careproviders/LeaveReview/DefaultView.aspx?id=1-9110930808,0,0,,
The Broad Group Ltd,1-4572626217,SCL,12 Astwood Road,,,Worcester,,WR3 8ET,Tel: 01905330602,No ratings yet Rate it yourself - /Services/careproviders/LeaveReview/DefaultView.aspx?id=1-4572626217,0,0,,
Caremark (Wychavon & Wyre Forest),1-12836256485,SCL,Polysec House,"Blackpole Trading Estate West, Hindlip Lane",,Worcester,,WR3 8TJ,Tel: 01562543290,No ratings yet Rate it yourself - /Services/careproviders/LeaveReview/DefaultView.aspx?id=1-12836256485,0,0,,
Caremark (Worcester & Malvern Hills),1-2446245822,SCL,Polysec House,Blackpole Trading Estate West,,Worcester,Worcestershire,WR3 8TJ,Tel: 01905 452595,No ratings yet Rate it yourself - /Services/careproviders/LeaveReview/DefaultView.aspx?id=1-2446245822,0,0,,
Happylife Care,1-2033159442,SCL,Unit 3D,Shrub Hill Industrial Estate,,Worcester,Worcestershire,WR4 9EL,Tel: 07401772572,No ratings yet Rate it yourself - /Services/careproviders/LeaveReview/DefaultView.aspx?id=1-2033159442,0,0,,
Pirton Grange Specialist Services,1-142667700,SCL,Worcester Road,Pirton,,Worcester,Worcestershire,WR8 9EF,,No ratings yet Rate it yourself - /Services/careproviders/LeaveReview/DefaultView.aspx?id=1-142667700,0,0,,
Ignite Health and Home Care Service - Worcester,1-8531329627,SCL,1c Lowesmoor Terrace,,,Worcester,,WR1 2RX,Tel: 01905252718,No ratings yet Rate it yourself - /Services/careproviders/LeaveReview/DefaultView.aspx?id=1-8531329627,0,0,,
The Broad Group - 85 Bath Road,1-109967775,SCL,85 Bath Road,,,Worcester,Worcestershire,WR5 3AE,,No ratings yet Rate it yourself - /Services/careproviders/LeaveReview/DefaultView.aspx?id=1-109967775,0,0,,
The Haven Rest Home,1-115740267,SCL,218 Worcester Road,,,Droitwich,Worcestershire,WR9 8AY,Tel: 01905772240,No ratings yet Rate it yourself - /Services/careproviders/LeaveReview/DefaultView.aspx?id=1-115740267,0,0,,
Home Force Care Worcester,1-14906231910,SCL,8 Edgar Street,,,Worcester,,WR1 2LR,,No ratings yet Rate it yourself - /Services/careproviders/LeaveReview/DefaultView.aspx?id=1-14906231910,0,0,,
Safeharbour (Droitwich),1-118314634,SCL,52 Corbett Avenue,,,Droitwich,Worcestershire,WR9 7BH,Tel: 01905796214,No ratings yet Rate it yourself - /Services/careproviders/LeaveReview/DefaultView.aspx?id=1-118314634,0,0,,
Alliance Care Ltd,1-7939893436,SCL,130 Worcester Road,,,Droitwich,,WR9 8AN,Tel: 01905795086,No ratings yet Rate it yourself - /Services/careproviders/LeaveReview/DefaultView.aspx?id=1-7939893436,0,0,,
Corbett House Nursing Home,1-629935882,SCL,40-42 Corbett Avenue,,,Droitwich,Worcestershire,WR9 7BE,Tel: 01905770572,No ratings yet Rate it yourself - /Services/careproviders/LeaveReview/DefaultView.aspx?id=1-629935882,0,0,,
"Eclipse HomeCare (Worcester, Malvern, Kidderminster & Bromsgrove)",1-122963052,SCL,County House,1 St Mary's Street,,Worcester,Worcestershire,WR1 1HB,Tel: 01905 641070,No ratings yet Rate it yourself - /Services/careproviders/LeaveReview/DefaultView.aspx?id=1-122963052,0,0,,
Touchheart Healthcare Worcester Office,1-12515157010,SCL,County House,St. Marys Street,,Worcester,,WR1 1HB,Tel: 07403680808,No ratings yet Rate it yourself - /Services/careproviders/LeaveReview/DefaultView.aspx?id=1-12515157010,0,0,,
Firstcall 247 Limited (Worcestershire),1-16888189378,SCL,01 Third Floor County House Business Centre,St. Marys Street,,Worcester,,WR1 1HB,Tel: 01905972288,No ratings yet Rate it yourself - /Services/careproviders/LeaveReview/DefaultView.aspx?id=1-16888189378,0,0,,
Evans Healthcare Group - Worcester,1-15712164285,SCL,"T15, County House",St. Marys Street,,Worcester,,WR1 1HB,Tel: 07534663697,No ratings yet Rate it yourself - /Services/careproviders/LeaveReview/DefaultView.aspx?id=1-15712164285,0,0,,
Simply The Best Care Ltd,1-9960242615,SCL,County House,St. Marys Street,,Worcester,,WR1 1HB,Tel: 07710888553,No ratings yet Rate it yourself - /Services/careproviders/LeaveReview/DefaultView.aspx?id=1-9960242615,0,0,,
Nurseplus - Worcester,1-18092255813,SCL,County House,St. Marys Street,,Worcester,,WR1 1HB,Tel: 0190525279,No ratings yet Rate it yourself - /Services/careproviders/LeaveReview/DefaultView.aspx?id=1-18092255813,0,0,,
Spectrum Days,1-940109194,SCL,Old Coach Road,,,Droitwich,Worcestershire,WR9 8BB,Tel: 07972704378,No ratings yet Rate it yourself - /Services/careproviders/LeaveReview/DefaultView.aspx?id=1-940109194,0,0,,
Brindley Manor Nursing Home,1-9983923716,SCL,St. Peters Walk,,,Droitwich,,WR9 8EX,Tel: 01905794506,No ratings yet Rate it yourself - /Services/careproviders/LeaveReview/DefaultView.aspx?id=1-9983923716,0,0,,
Fernhill House,1-5383009245,SCL,Grange Lane,Fernhill Heath,,Worcester,Worcestershire,WR3 7UR,Tel: 01905679300,No ratings yet Rate it yourself - /Services/careproviders/LeaveReview/DefaultView.aspx?id=1-5383009245,0,0,,
Helping Hands Worcester,1-6692732361,SCL,32 Broad Street,,,Worcester,,WR1 3NH,Tel: 01905676981,No ratings yet Rate it yourself - /Services/careproviders/LeaveReview/DefaultView.aspx?id=1-6692732361,0,0,,
Priory Supported Living The Shires,1-10525531173,SCL,Anbrian House,1 The Tything,,Worcester,,WR1 1HD,Tel: 01905611042,No ratings yet Rate it yourself - /Services/careproviders/LeaveReview/DefaultView.aspx?id=1-10525531173,0,0,,
The Belmont,1-11976471025,SCL,John Comyn Drive,,,Worcester,,WR3 7NS,Tel: 01905590012,No ratings yet Rate it yourself - /Services/careproviders/LeaveReview/DefaultView.aspx?id=1-11976471025,0,0,,
Dorset House Nursing Home,1-2188142731,SCL,Blackfriars Avenue,,,Droitwich,Worcestershire,WR9 8DR,Tel: 01905 772710,No ratings yet Rate it yourself - /Services/careproviders/LeaveReview/DefaultView.aspx?id=1-2188142731,0,0,,
Headway Worcestershire,1-359238177,SCL,The Mill,Gregory's Mill Street,,Worcester,Worcestershire,WR3 8BA,Tel: 01905729729,No ratings yet Rate it yourself - /Services/careproviders/LeaveReview/DefaultView.aspx?id=1-359238177,0,0,,
YourLife (Droitwich),1-2213119679,SCL,Horton Mill Court,Hanbury Road,,Droitwich,Worcestershire,WR9 8GD,Tel: 01905770288,No ratings yet Rate it yourself - /Services/careproviders/LeaveReview/DefaultView.aspx?id=1-2213119679,0,0,,
Advance Warwickshire and Worcestershire,1-15112584637,SCL,Kings Court,Worcester Road,,Droitwich,,WR9 8AG,Tel: 01905795899,No ratings yet Rate it yourself - /Services/careproviders/LeaveReview/DefaultView.aspx?id=1-15112584637,0,0,,
Carefour,1-3657527547,SCL,3 Moor Street,,,Worcester,Worcestershire,WR1 3DB,Tel: 01905699699,No ratings yet Rate it yourself - /Services/careproviders/LeaveReview/DefaultView.aspx?id=1-3657527547,0,0,,
North Star Foundation,1-201080733,SCL,8 Old Market Court,High Street,,Droitwich,Worcestershire,WR9 8ES,Tel: 01905772233,No ratings yet Rate it yourself - /Services/careproviders/LeaveReview/DefaultView.aspx?id=1-201080733,0,0,,
Uplifting Lives Services Ltd,1-5600612940,SCL,1a Nellies Yard,High Street,,Droitwich,,WR9 8ES,Tel: 01905954424,No ratings yet Rate it yourself - /Services/careproviders/LeaveReview/DefaultView.aspx?id=1-5600612940,0,0,,
Civicare (Central) Ltd,1-2344181179,SCL,Unit 4A,40 St Andrews House,,Droitwich,Worcestershire,WR9 8HE,Tel: 01905 770110,No ratings yet Rate it yourself - /Services/careproviders/LeaveReview/DefaultView.aspx?id=1-2344181179,0,0,,
Virtuous Business Solutions Limited,1-10587106120,SCL,65 Ombersley Street East,,,Droitwich,,WR9 8QS,Tel: 07960102647,No ratings yet Rate it yourself - /Services/careproviders/LeaveReview/DefaultView.aspx?id=1-10587106120,0,0,,
The Office at Smokey Farm,1-7739132546,SCL,"The Office, Smokey Farm","Smokey Lane, Cropthorne",,Pershore,,WR10 3NF,Tel: 07593011406,No ratings yet Rate it yourself - /Services/careproviders/LeaveReview/DefaultView.aspx?id=1-7739132546,0,0,,
St Stephen's Care Home,1-3583146841,SCL,St Stephens Terrace,Droitwich Road,,Worcester,Worcestershire,WR3 7HU,Tel: 0190529224,No ratings yet Rate it yourself - /Services/careproviders/LeaveReview/DefaultView.aspx?id=1-3583146841,0,0,,
Severn Vale Home Care Worcester,1-12119336784,SCL,"Office F2, New Venture House",Park Boulevard,,Worcester,,WR2 4AY,Tel: 01905950409,No ratings yet Rate it yourself - /Services/careproviders/LeaveReview/DefaultView.aspx?id=1-12119336784,0,0,,
Crossroads Caring for Carers,1-130618228,SCL,Crossroads Caring for Carers (Worcestershire),"Weir Lane, Lower Wick",,Worcester,Worcestershire,WR2 4AY,Tel: 01905729293,No ratings yet Rate it yourself - /Services/careproviders/LeaveReview/DefaultView.aspx?id=1-130618228,0,0,,
The Lawns,1-115758642,SCL,Main Road,Kempsey,,Worcester,Worcestershire,WR5 3NF,Tel: 01905 821388,No ratings yet Rate it yourself - /Services/careproviders/LeaveReview/DefaultView.aspx?id=1-115758642,0,0,,
Home Instead Senior Care,1-377680897,SCL,Suite 5B,"Malvern Gate, Bromwich Road",,Worcester,Worcestershire,WR2 4BN,Tel: 01905420404,No ratings yet Rate it yourself - /Services/careproviders/LeaveReview/DefaultView.aspx?id=1-377680897,0,0,,
Radfield Home Care Worcester,1-5271995588,SCL,6 King Charles Place,St. Johns,,Worcester,,WR2 5AJ,Tel: 01905 427 863,No ratings yet Rate it yourself - /Services/careproviders/LeaveReview/DefaultView.aspx?id=1-5271995588,0,0,,
The Firs Rest Home,1-118565717,SCL,141 Malvern Road,St Johns,,Worcester,Worcestershire,WR2 4LN,Tel: 01905426194,No ratings yet Rate it yourself - /Services/careproviders/LeaveReview/DefaultView.aspx?id=1-118565717,0,0,,
Bethany Lodge,1-120814501,SCL,222 Malvern Road,,,Worcester,Worcestershire,WR2 4PA,Tel: 01905420088,No ratings yet Rate it yourself - /Services/careproviders/LeaveReview/DefaultView.aspx?id=1-120814501,0,0,,
Westmead Residential Care Home,1-124396218,SCL,Westmead Close,Westacre,,Droitwich,Worcestershire,WR9 9LG,Tel: 01905778353,No ratings yet Rate it yourself - /Services/careproviders/LeaveReview/DefaultView.aspx?id=1-124396218,0,0,,
The Willows Care Home,1-5375195863,SCL,2 Tower Road,,,Worcester,Worcestershire,WR3 7AF,Tel: 0190520658,No ratings yet Rate it yourself - /Services/careproviders/LeaveReview/DefaultView.aspx?id=1-5375195863,0,0,,
The Priory Care Home,1-121484291,SCL,Crutch Lane,Dodderhill,,Droitwich,Worcestershire,WR9 0BE,Tel: 01905771595,No ratings yet Rate it yourself - /Services/careproviders/LeaveReview/DefaultView.aspx?id=1-121484291,0,0,,
Bricklehampton Hall,1-118416902,SCL,Bricklehampton,,,Pershore,Worcestershire,WR10 3HQ,Tel: 01386710573,No ratings yet Rate it yourself - /Services/careproviders/LeaveReview/DefaultView.aspx?id=1-118416902,0,0,,
Upper Ford Lodge,1-129855529,SCL,Ford Lane,,,Droitwich,Worcestershire,WR9 0BQ,Tel: 01905779949,No ratings yet Rate it yourself - /Services/careproviders/LeaveReview/DefaultView.aspx?id=1-129855529,0,0,,
95 Bromyard Road,1-304923242,SCL,95 Bromyard Road,St Johns,,Worcester,Worcestershire,WR2 5BZ,Tel: 01905 429527,No ratings yet Rate it yourself - /Services/careproviders/LeaveReview/DefaultView.aspx?id=1-304923242,0,0,,
Regent Residential Care Home,1-124396200,SCL,School Road,St Johns,,Worcester,Worcestershire,WR2 4HF,Tel: 01905337100,No ratings yet Rate it yourself - /Services/careproviders/LeaveReview/DefaultView.aspx?id=1-124396200,0,0,,
Rashwood,1-119255502,SCL,Wychbold,,,Droitwich,Worcestershire,WR9 0BP,Tel: 01527861258,No ratings yet Rate it yourself - /Services/careproviders/LeaveReview/DefaultView.aspx?id=1-119255502,0,0,,
Dependable Home Care Services Limited,1-4207242680,SCL,61 Canada Way,,,Worcester,,WR2 4XA,Tel: 07594683830,No ratings yet Rate it yourself - /Services/careproviders/LeaveReview/DefaultView.aspx?id=1-4207242680,0,0,,
Phoenix House,1-10867338350,SCL,122 Bromyard Road,,,Worcester,,WR2 5DJ,,No ratings yet Rate it yourself - /Services/careproviders/LeaveReview/DefaultView.aspx?id=1-10867338350,0,0,,
Teme Court Residential Care Home,1-113398333,SCL,Old Road,Lower Wick,,Worcester,Worcestershire,WR2 4BU,Tel: 01905972023,No ratings yet Rate it yourself - /Services/careproviders/LeaveReview/DefaultView.aspx?id=1-113398333,0,0,,
Rely Care Agency Limited,1-122138077,SCL,33A Himbleton Road,St Johns,,Worcester,Worcestershire,WR2 6BA,Tel: 01905339331,No ratings yet Rate it yourself - /Services/careproviders/LeaveReview/DefaultView.aspx?id=1-122138077,0,0,,
Greenhill Park Residential Care Home,1-12676066519,SCL,24 Greenhill Park Road,,,Evesham,Worcestershire,WR11 4NL,Tel: 0138640836,No ratings yet Rate it yourself - /Services/careproviders/LeaveReview/DefaultView.aspx?id=1-12676066519,0,0,,
Seco Support (Birmingham),1-15928186846,SCL,Walnut Tree House,"Astwood Lane, Wychbold",,Droitwich,,WR9 0BU,Tel: 07760676109,No ratings yet Rate it yourself - /Services/careproviders/LeaveReview/DefaultView.aspx?id=1-15928186846,0,0,,
Northwick Grange,1-146821579,SCL,19 Old Northwick Lane,,,Worcester,Worcestershire,WR3 7NB,Tel: 01905453916,No ratings yet Rate it yourself - /Services/careproviders/LeaveReview/DefaultView.aspx?id=1-146821579,0,0,,
Henwick Grange,1-326347049,SCL,68 Hallow Road,St Johns,,Worcester,Worcestershire,WR2 6BY,Tel: 01905424705,No ratings yet Rate it yourself - /Services/careproviders/LeaveReview/DefaultView.aspx?id=1-326347049,0,0,,
Full Care Solutions Limited,1-2455790511,SCL,107 High Street,First Floor,,Evesham,,WR11 4EB,Tel: 01386329400,No ratings yet Rate it yourself - /Services/careproviders/LeaveReview/DefaultView.aspx?id=1-2455790511,0,0,,
Salford House,1-116012172,SCL,Salford House,"Station Road, Salford Priors",,Evesham,Worcestershire,WR11 8UX,,No ratings yet Rate it yourself - /Services/careproviders/LeaveReview/DefaultView.aspx?id=1-116012172,0,0,,
Spring Retirement Limited,1-6858108695,SCL,1st Floor,103 High Street,,Evesham,,WR11 4DN,Tel: 01386365001,No ratings yet Rate it yourself - /Services/careproviders/LeaveReview/DefaultView.aspx?id=1-6858108695,0,0,,
ExtraCare Charitable Trust Yates Court,1-120777182,SCL,95-97 High Street,,,Evesham,Worcestershire,WR11 4DN,Tel: 0138640006,No ratings yet Rate it yourself - /Services/careproviders/LeaveReview/DefaultView.aspx?id=1-120777182,0,0,,
Inspire Neurocare Worcester,1-8296451126,SCL,195 Oldbury Road,,,Worcester,,WR2 6AS,Tel: 01905969000,No ratings yet Rate it yourself - /Services/careproviders/LeaveReview/DefaultView.aspx?id=1-8296451126,0,0,,
Cedar Lodge Care Home,1-2252389121,SCL,Main Street,Offenham,,Evesham,Worcestershire,WR11 8RL,Tel: 01386446871,No ratings yet Rate it yourself - /Services/careproviders/LeaveReview/DefaultView.aspx?id=1-2252389121,0,0,,
Helping Hands Evesham and Cotswold,1-8565116813,SCL,39 High Street,,,Evesham,,WR11 4DA,Tel: 01789762121,No ratings yet Rate it yourself - /Services/careproviders/LeaveReview/DefaultView.aspx?id=1-8565116813,0,0,,
Right at Home Bromsgrove,1-15645160278,SCL,4 West Court,"Saxon Business Park, Hanbury Road, Stoke Prior",,Bromsgrove,,B60 4AD,Tel: 015279216070,No ratings yet Rate it yourself - /Services/careproviders/LeaveReview/DefaultView.aspx?id=1-15645160278,0,0,,
Bedwardine House Residential Care Home,1-115230808,SCL,Upper Wick Lane,Rushwick,,Worcester,Worcestershire,WR2 5SU,Tel: 01905425101,No ratings yet Rate it yourself - /Services/careproviders/LeaveReview/DefaultView.aspx?id=1-115230808,0,0,,
Stanfield Nursing Home Limited,1-114409532,SCL,Upper Wick Lane,Rushwick,,Worcester,Worcestershire,WR2 5SU,,No ratings yet Rate it yourself - /Services/careproviders/LeaveReview/DefaultView.aspx?id=1-114409532,0,0,,
Parklands,1-2029305060,SCL,Callow Hill Lane,Callow Hill,,Redditch,Worcestershire,B97 5PU,Tel: 01527 544581,No ratings yet Rate it yourself - /Services/careproviders/LeaveReview/DefaultView.aspx?id=1-2029305060,0,0,,
Sanctuary Home Care Ltd- Worcester,1-2305128804,SCL,Noble House,1 Oak View Way,,Worcester,Worcestershire,WR2 5FH,Tel: 01905676946,No ratings yet Rate it yourself - /Services/careproviders/LeaveReview/DefaultView.aspx?id=1-2305128804,0,0,,
Alina Homecare Bromsgrove,1-130488908,SCL,Harris Business Park,Hanbury Road,,Bromsgrove,Worcestershire,B60 4FG,Tel: 01527 914093,No ratings yet Rate it yourself - /Services/careproviders/LeaveReview/DefaultView.aspx?id=1-130488908,0,0,,