Organisation Name,NACS Code,Organisation Type,Address1,Address2,Address3,Address4,Address5,PostCode,Telephone Number,NHS.UK users rating,Value  (NHS.UK users rating),Banding Classification  (NHS.UK users rating),Car parking (Is there car parking at this organisation?),Disabled access (Disabled access)
Westvale House,1-125863047,SCL,Old Hall Road,Great Sankey,,Warrington,Cheshire,WA5 9PA,Tel: 01925571266,No ratings yet Rate it yourself - /Services/careproviders/LeaveReview/DefaultView.aspx?id=1-125863047,0,0,,
Charlotte House,1-3072747912,SCL,21 Charlotte Grove,Great Sankey,,Warrington,Cheshire,WA5 8GJ,Tel: 01925415073,No ratings yet Rate it yourself - /Services/careproviders/LeaveReview/DefaultView.aspx?id=1-3072747912,0,0,,
Callands Care Home,1-319278933,SCL,Callands Road,Callands,,Warrington,Cheshire,WA5 9TS,Tel: 01925244233,No ratings yet Rate it yourself - /Services/careproviders/LeaveReview/DefaultView.aspx?id=1-319278933,0,0,,
Burton House,1-1497106804,SCL,26 Burtonwood Road,Great Sankey,,Warrington,Cheshire,WA5 3AJ,Tel: 01925415073,No ratings yet Rate it yourself - /Services/careproviders/LeaveReview/DefaultView.aspx?id=1-1497106804,0,0,,
Brookehill Care Ltd,1-17092443350,SCL,36 Berkeley Close,,,Warrington,,WA5 0EP,,No ratings yet Rate it yourself - /Services/careproviders/LeaveReview/DefaultView.aspx?id=1-17092443350,0,0,,
Field view,1-3072862711,SCL,179a Hood Lane North,Great Sankey,,Warrington,Cheshire,WA5 1ET,Tel: 01925415073,No ratings yet Rate it yourself - /Services/careproviders/LeaveReview/DefaultView.aspx?id=1-3072862711,0,0,,
Oak View,1-3072862970,SCL,179b Hood Lane North,Great Sankey,,Warrington,Cheshire,WA5 1ET,Tel: 01925415073,No ratings yet Rate it yourself - /Services/careproviders/LeaveReview/DefaultView.aspx?id=1-3072862970,0,0,,
Bluebird Care (Warrington),1-7509945006,SCL,10 Lovely Lane,,,Warrington,,WA5 1NF,Tel: 01925422940,No ratings yet Rate it yourself - /Services/careproviders/LeaveReview/DefaultView.aspx?id=1-7509945006,0,0,,
Woodleigh,1-1958383565,SCL,Callands Road,Callands,,Warrington,Cheshire,WA5 9RJ,Tel: 01925235237,No ratings yet Rate it yourself - /Services/careproviders/LeaveReview/DefaultView.aspx?id=1-1958383565,0,0,,
U&I Care Limited,1-202465124,SCL,15 Archers Green,Kingswood Westbrook,,Warrington,Cheshire,WA5 1XS,,No ratings yet Rate it yourself - /Services/careproviders/LeaveReview/DefaultView.aspx?id=1-202465124,0,0,,
Dallam Court,1-13950066268,SCL,"PORTAL BUSINESS CENTRES LTD, Dallam Court",Dallam Lane,,Warrington,,WA2 7LT,Tel: 07503975733,No ratings yet Rate it yourself - /Services/careproviders/LeaveReview/DefaultView.aspx?id=1-13950066268,0,0,,
Caring Connections - Warrington,1-15302252580,SCL,"Office 3, Dallam Court",120 Dallam Lane,,Warrington,,WA2 7LT,Tel: 01925563593,No ratings yet Rate it yourself - /Services/careproviders/LeaveReview/DefaultView.aspx?id=1-15302252580,0,0,,
Bridgewater Home Care,1-5597887604,SCL,Portal Business Centre,"Dallam Court, Dallam Lane",,Warrington,,WA2 7LT,Tel: 01925245460,No ratings yet Rate it yourself - /Services/careproviders/LeaveReview/DefaultView.aspx?id=1-5597887604,0,0,,
SHEARWATERS HEALTHCARE & SERVICES LTD,1-18445390705,SCL,6 Summerfield Avenue,,,Warrington,,WA5 0HN,Tel: 01925390456,No ratings yet Rate it yourself - /Services/careproviders/LeaveReview/DefaultView.aspx?id=1-18445390705,0,0,,
Warrington Supported Living,1-15970240302,SCL,8 Bewsey Road,,,Warrington,,WA2 7LW,Tel: 07545507968,No ratings yet Rate it yourself - /Services/careproviders/LeaveReview/DefaultView.aspx?id=1-15970240302,0,0,,
Mayden Support,1-5868835973,SCL,1,Froghall Lane,,Warrington,,WA2 7JJ,Tel: 01925506128,No ratings yet Rate it yourself - /Services/careproviders/LeaveReview/DefaultView.aspx?id=1-5868835973,0,0,,
Hannah's Homecare Ltd,1-1744636916,SCL,"Suite 5a, Gilbert Wakefield House",67 Bewsey Street,,Warrington,Cheshire,WA2 7JQ,Tel: 07778590434,No ratings yet Rate it yourself - /Services/careproviders/LeaveReview/DefaultView.aspx?id=1-1744636916,0,0,,
CARE3SIXTY DOMICILIARY CARE LTD,1-15061844986,SCL,Gilbert Wakefield House,67 Bewsey Street,,Warrington,Cheshire,WA2 7JQ,Tel: 03337721359,No ratings yet Rate it yourself - /Services/careproviders/LeaveReview/DefaultView.aspx?id=1-15061844986,0,0,,
Warrington,1-14421324906,SCL,Gilbert Wakefield House,65 Bewsey Street,,Warrington,,WA2 7JQ,,No ratings yet Rate it yourself - /Services/careproviders/LeaveReview/DefaultView.aspx?id=1-14421324906,0,0,,
Lumina Care Warrington,1-5417290465,SCL,Ribban Court,20 Dallam Lane,,Warrington,,WA2 7NG,Tel: 07393386707,No ratings yet Rate it yourself - /Services/careproviders/LeaveReview/DefaultView.aspx?id=1-5417290465,0,0,,
Benhall Care Warrington,1-13773635055,SCL,The Outset,Sankey Street,,Warrington,,WA1 1NN,Tel: 07780432505,No ratings yet Rate it yourself - /Services/careproviders/LeaveReview/DefaultView.aspx?id=1-13773635055,0,0,,
"AFG Community St Helens, Cheshire & Manchester",1-9603086691,SCL,"Unit 3b, The Outset",Great Sankety Street,,Warrington,,WA1 1NN,Tel: 07824096035,No ratings yet Rate it yourself - /Services/careproviders/LeaveReview/DefaultView.aspx?id=1-9603086691,0,0,,
Heart to Heart Care NW Limited,1-3515206872,SCL,Tannery Court,Tanners Lane,,Warrington,,WA2 7NA,Tel: 01925629919,No ratings yet Rate it yourself - /Services/careproviders/LeaveReview/DefaultView.aspx?id=1-3515206872,0,0,,
Whittle Hall House Care Residence,1-4184362778,SCL,Littledale Road,Great Sankey,,Warrington,Cheshire,WA5 3DX,Tel: 01612330155,No ratings yet Rate it yourself - /Services/careproviders/LeaveReview/DefaultView.aspx?id=1-4184362778,0,0,,
Jevids care Ltd,1-17130863610,SCL,"Ground Floor Unit E, The Boultings",Winwick Street,,Warrington,,WA2 7TT,,No ratings yet Rate it yourself - /Services/careproviders/LeaveReview/DefaultView.aspx?id=1-17130863610,0,0,,
Mayfield Homecare Services Limited,1-112233599,SCL,84 Sankey Street,,,Warrington,Cheshire,WA1 1SG,Tel: 01925245090,No ratings yet Rate it yourself - /Services/careproviders/LeaveReview/DefaultView.aspx?id=1-112233599,0,0,,
Woodville Place,1-5206665743,SCL,9 & 10 Cottesmore Close,Great Sankey,,Warrington,,WA5 3UN,Tel: 01925759162,No ratings yet Rate it yourself - /Services/careproviders/LeaveReview/DefaultView.aspx?id=1-5206665743,0,0,,
Dimensions Warrington Domiciliary Care Office,1-13189396617,SCL,Warrington Deaf Centre,11-13 Wilson Patten Street,,Warrington,,WA1 1PG,Tel: 07979705891,No ratings yet Rate it yourself - /Services/careproviders/LeaveReview/DefaultView.aspx?id=1-13189396617,0,0,,
Lakenheath,1-6649514070,SCL,18 & 20 Lakenheath Crescent,Great Sankey,,Warrington,,WA5 3UE,Tel: 01925939926,No ratings yet Rate it yourself - /Services/careproviders/LeaveReview/DefaultView.aspx?id=1-6649514070,0,0,,
Rivenhall,1-9339612765,SCL,"8,10, 12 Rivenhall Close",Great Sankey,,Warrington,,WA5 3UH,Tel: 01925759162,No ratings yet Rate it yourself - /Services/careproviders/LeaveReview/DefaultView.aspx?id=1-9339612765,0,0,,
U&I Care Limited,1-2440204563,SCL,"Unit G6, Warrington Business Park",Long Lane,,Warrington,Cheshire,WA2 8TX,Tel: 01925415073,No ratings yet Rate it yourself - /Services/careproviders/LeaveReview/DefaultView.aspx?id=1-2440204563,0,0,,
Care at Home Group Warrington,1-120304459,SCL,"Unit W1, Warrington Business Park",Long Lane,,Warrington,,WA2 8TX,Tel: 01925652800,No ratings yet Rate it yourself - /Services/careproviders/LeaveReview/DefaultView.aspx?id=1-120304459,0,0,,
MacIntyre Warrington,1-3113688653,SCL,Warrington Business Park,Long Lane,,Warrington,Cheshire,WA2 8TX,Tel: 01925234443,No ratings yet Rate it yourself - /Services/careproviders/LeaveReview/DefaultView.aspx?id=1-3113688653,0,0,,
Creative Support - Warrington Personalised Services,1-4935916794,SCL,"Flat 1, Birchwood Court",Church Street,,Warrington,,WA1 2SX,Tel: 01925572343,No ratings yet Rate it yourself - /Services/careproviders/LeaveReview/DefaultView.aspx?id=1-4935916794,0,0,,
Cromwell Court,1-8428377980,SCL,76 Church Street,,,Warrington,Cheshire,WA1 2TH,,No ratings yet Rate it yourself - /Services/careproviders/LeaveReview/DefaultView.aspx?id=1-8428377980,0,0,,
Acute Need CIC,1-2054497390,SCL,Unit 1A,"St. James Court, Wilderspool Causeway",,Warrington,,WA4 6PS,Tel: 01744881525,No ratings yet Rate it yourself - /Services/careproviders/LeaveReview/DefaultView.aspx?id=1-2054497390,0,0,,
Radis Community Care (Ryfields Retirement Village),1-9486861456,SCL,Arena Gardens,Norris Street,,Warrington,,WA2 7GB,Tel: 03301008150,No ratings yet Rate it yourself - /Services/careproviders/LeaveReview/DefaultView.aspx?id=1-9486861456,0,0,,
The Mews,1-140511581,SCL,Honiton Way,Penketh,,Warrington,Cheshire,WA5 2EY,Tel: 01925790596,No ratings yet Rate it yourself - /Services/careproviders/LeaveReview/DefaultView.aspx?id=1-140511581,0,0,,
Community Learning Disabilities,1-140511649,SCL,WCL HUB Community Office,"Honiton Way, Penketh",,Warrington,,WA5 2EY,Tel: 01925246870,No ratings yet Rate it yourself - /Services/careproviders/LeaveReview/DefaultView.aspx?id=1-140511649,0,0,,
Heathside,1-140511566,SCL,Honiton Way,Penketh,,Warrington,Cheshire,WA5 2EY,Tel: 01925722109,No ratings yet Rate it yourself - /Services/careproviders/LeaveReview/DefaultView.aspx?id=1-140511566,0,0,,
Florence Mill Care Home,1-12472473355,SCL,Egerton Street,,,Warrington,Cheshire,WA1 2DF,Tel: 01925573772,No ratings yet Rate it yourself - /Services/careproviders/LeaveReview/DefaultView.aspx?id=1-12472473355,0,0,,
4 Cronulla Drive,1-14220825796,SCL,4 Cronulla Drive,Great Sankey,,Warrington,,WA5 3HS,Tel: 01925202380,No ratings yet Rate it yourself - /Services/careproviders/LeaveReview/DefaultView.aspx?id=1-14220825796,0,0,,
Balance Care,1-6953631142,SCL,141 Marsh House Lane,,,Warrington,Cheshire,WA1 3QZ,Tel: 01925552780,No ratings yet Rate it yourself - /Services/careproviders/LeaveReview/DefaultView.aspx?id=1-6953631142,0,0,,
Riverside Point,1-2259093098,SCL,26-29 Kerridge Drive,,,Warrington,Cheshire,WA1 2GN,Tel: 07917898850,No ratings yet Rate it yourself - /Services/careproviders/LeaveReview/DefaultView.aspx?id=1-2259093098,0,0,,
Green Park Care Home,1-2844757712,SCL,Southwold Crescent,Great Sankey,,Warrington,Cheshire,WA5 3JS,Tel: 01423859859,No ratings yet Rate it yourself - /Services/careproviders/LeaveReview/DefaultView.aspx?id=1-2844757712,0,0,,
Helping Hands Warrington,1-4949842457,SCL,"Unit 2, 9 Padgate Lane",,,Warrington,,WA1 3RS,Tel: 01925598205,No ratings yet Rate it yourself - /Services/careproviders/LeaveReview/DefaultView.aspx?id=1-4949842457,0,0,,
Warrington Borough Council Intermediate Care at Home,1-2534543156,SCL,Irwell Road,,,Warrington,Cheshire,WA4 6BB,Tel: 01925443071,No ratings yet Rate it yourself - /Services/careproviders/LeaveReview/DefaultView.aspx?id=1-2534543156,0,0,,
Meadowview Care Home,1-121455526,SCL,Finlay Avenue,Penketh,,Warrington,Cheshire,WA5 2PN,Tel: 01925791180,No ratings yet Rate it yourself - /Services/careproviders/LeaveReview/DefaultView.aspx?id=1-121455526,0,0,,
Gainsborough House,1-278297558,SCL,8 Gainsborough Road,,,Warrington,Cheshire,WA4 6BZ,Tel: 01925 241479,No ratings yet Rate it yourself - /Services/careproviders/LeaveReview/DefaultView.aspx?id=1-278297558,0,0,,
Winwick Park,1-3495667066,SCL,29 Fleming Drive,"Winwick Park, Winwick",,Warrington,Cheshire,WA2 8XP,Tel: 01925232180,No ratings yet Rate it yourself - /Services/careproviders/LeaveReview/DefaultView.aspx?id=1-3495667066,0,0,,
Belong Warrington Care Village,1-1535538406,SCL,Loushers Lane,,,Warrington,Cheshire,WA4 6RX,Tel: 01925593800,No ratings yet Rate it yourself - /Services/careproviders/LeaveReview/DefaultView.aspx?id=1-1535538406,0,0,,
Belong at Home Warrington,1-5622676729,SCL,Loushers Lane,,,Warrington,Cheshire,WA4 6RX,Tel: 01925593800,No ratings yet Rate it yourself - /Services/careproviders/LeaveReview/DefaultView.aspx?id=1-5622676729,0,0,,
Hummingbird Home Care Office,1-3831843687,SCL,Victoria House,490 Knutsford Road,,Warrington,,WA4 1DX,Tel: 01925245049,No ratings yet Rate it yourself - /Services/careproviders/LeaveReview/DefaultView.aspx?id=1-3831843687,0,0,,
St Oswalds,1-12302524129,SCL,12 Golborne Road,Winwick,,Warrington,Cheshire,WA2 8SZ,Tel: 01925656337,No ratings yet Rate it yourself - /Services/careproviders/LeaveReview/DefaultView.aspx?id=1-12302524129,0,0,,
Three Elms,1-123533933,SCL,Station Road,Penketh,,Warrington,Cheshire,WA5 2UG,Tel: 01925723274,No ratings yet Rate it yourself - /Services/careproviders/LeaveReview/DefaultView.aspx?id=1-123533933,0,0,,
The Old Vicarage Nursing and Residential Care Centre,1-700814442,SCL,Fir Tree Lane,Burtonwood,,Warrington,Cheshire,WA5 4NN,Tel: 01925229944,No ratings yet Rate it yourself - /Services/careproviders/LeaveReview/DefaultView.aspx?id=1-700814442,0,0,,
Westleigh,1-1351151560,SCL,109 Walton Road,Stockton Heath,,Warrington,Cheshire,WA4 6NR,Tel: 01925211851,No ratings yet Rate it yourself - /Services/careproviders/LeaveReview/DefaultView.aspx?id=1-1351151560,0,0,,
Padgate House,1-127701694,SCL,Vulcan Close,Padgate,,Warrington,Cheshire,WA2 0HL,Tel: 01925821639,No ratings yet Rate it yourself - /Services/careproviders/LeaveReview/DefaultView.aspx?id=1-127701694,0,0,,
Heath Lodge,1-132341235,SCL,34 Green Lane,Padgate,,Warrington,Cheshire,WA1 4JA,Tel: 01925816702,No ratings yet Rate it yourself - /Services/careproviders/LeaveReview/DefaultView.aspx?id=1-132341235,0,0,,
Warrington - SOS Homecare Ltd,1-15457431925,SCL,"Cambridge House, 16 Walton Road",Stockton Heath,,Warrington,,WA4 6NL,Tel: 01925597891,No ratings yet Rate it yourself - /Services/careproviders/LeaveReview/DefaultView.aspx?id=1-15457431925,0,0,,
Harpers Green,1-10311969518,SCL,"The Reception, Harpers Green","Harpers Road, Padgate",,Warrington,,WA2 0AA,Tel: 01925595162,No ratings yet Rate it yourself - /Services/careproviders/LeaveReview/DefaultView.aspx?id=1-10311969518,0,0,,
Bridgewell House,1-509898627,SCL,82 Ackers Road,Stockton Heath,,Warrington,Cheshire,WA4 2BP,Tel: 01925470996,No ratings yet Rate it yourself - /Services/careproviders/LeaveReview/DefaultView.aspx?id=1-509898627,0,0,,
Arlington House Residential Care Home,1-1728028103,SCL,88 Ackers Road,Stockton Heath,,Warrington,Cheshire,WA4 2EA,Tel: 01925267576,No ratings yet Rate it yourself - /Services/careproviders/LeaveReview/DefaultView.aspx?id=1-1728028103,0,0,,
Westy Hall Residential Care Home,1-2956628281,SCL,Marsden Avenue,Latchford,,Warrington,Cheshire,WA4 1UB,Tel: 01925637948,No ratings yet Rate it yourself - /Services/careproviders/LeaveReview/DefaultView.aspx?id=1-2956628281,0,0,,
Heathfield Residential Home,1-115224949,SCL,20-22 Alexandra Road,Grappenhall,,Warrington,Cheshire,WA4 2EL,Tel: 01925602195,No ratings yet Rate it yourself - /Services/careproviders/LeaveReview/DefaultView.aspx?id=1-115224949,0,0,,
Three Bridges Nursing & Residential Home,1-2622347440,SCL,Nook Lane,Latchford,,Warrington,Cheshire,WA4 1NT,Tel: 01925418059,No ratings yet Rate it yourself - /Services/careproviders/LeaveReview/DefaultView.aspx?id=1-2622347440,0,0,,
Victoria House,1-581494553,SCL,27 Victoria Road,Grappenhall,,Warrington,Cheshire,WA4 2EN,Tel: 07852271290,No ratings yet Rate it yourself - /Services/careproviders/LeaveReview/DefaultView.aspx?id=1-581494553,0,0,,
Summerville Care Home,1-3121937093,SCL,Hill Top Road,Stockton Heath,,Warrington,Cheshire,WA4 2EF,Tel: 033 3321 4735,No ratings yet Rate it yourself - /Services/careproviders/LeaveReview/DefaultView.aspx?id=1-3121937093,0,0,,
Linear Park Residential Care Home,1-120280664,SCL,Bradlegh Road,,,Newton Le Willows,Merseyside,WA12 8RA,Tel: 01925221635,No ratings yet Rate it yourself - /Services/careproviders/LeaveReview/DefaultView.aspx?id=1-120280664,0,0,,
Alexandra Care Home,1-18074215565,SCL,Wargrave Road,,,Newton-le-willows,,WA12 8RP,Tel: 01925220963,No ratings yet Rate it yourself - /Services/careproviders/LeaveReview/DefaultView.aspx?id=1-18074215565,0,0,,
Anderson Close,1-112856872,SCL,6 Anderson Close,Longbarn,,Warrington,Cheshire,WA2 0PG,Tel: 01925819596,No ratings yet Rate it yourself - /Services/careproviders/LeaveReview/DefaultView.aspx?id=1-112856872,0,0,,
Brampton Lodge,1-13054419061,SCL,Bridge Lane,Appleton,,Warrington,Cheshire,WA4 3AH,Tel: 01925606780,No ratings yet Rate it yourself - /Services/careproviders/LeaveReview/DefaultView.aspx?id=1-13054419061,0,0,,
Chrysalis Holidays,1-1320810861,SCL,St Davids Office,Park Road South,,Newton-le-Willows,Merseyside,WA12 8EY,Tel: 01925220179,No ratings yet Rate it yourself - /Services/careproviders/LeaveReview/DefaultView.aspx?id=1-1320810861,0,0,,
Maxi Healthcare Limited (Cheshire and Merseyside),1-18830821749,SCL,Cinnamon House,"Cinnamon Park, Crab Lane, Fearnhead",,Warrington,,WA2 0XP,Tel: 07930144564,No ratings yet Rate it yourself - /Services/careproviders/LeaveReview/DefaultView.aspx?id=1-18830821749,0,0,,
Cinnamon House,1-9906412602,SCL,"Cinnamon Park, Crab Lane",Fearnhead,,Warrington,,WA2 0XP,Tel: 07786461364,No ratings yet Rate it yourself - /Services/careproviders/LeaveReview/DefaultView.aspx?id=1-9906412602,0,0,,
Comprehensive Care LTD,1-14540914029,SCL,Regus Cinnamon Park Office 204e Crab Lane,Fearnhead,,Warrington,,WA2 0XP,,No ratings yet Rate it yourself - /Services/careproviders/LeaveReview/DefaultView.aspx?id=1-14540914029,0,0,,
LeviCare Warrington Head Office,1-15322950193,SCL,"LeviCare Suite, 106-108 REGUS, Cinnamon House","Cinnamon Park, Crab Lane, Fearnhead",,Warrington,,WA2 0XP,Tel: 01612060606,No ratings yet Rate it yourself - /Services/careproviders/LeaveReview/DefaultView.aspx?id=1-15322950193,0,0,,
FAB Social Care Ltd - St Helens Branch,1-18341311444,SCL,Cinnamon House,"Cinnamon Park, Crab Lane, Fearnhead",,Warrington,,WA2 0XP,,No ratings yet Rate it yourself - /Services/careproviders/LeaveReview/DefaultView.aspx?id=1-18341311444,0,0,,
St Mary's Continuing Care,1-1442898828,SCL,St Mary's Care Centre,"Penny Lane, Collins Green",,Warrington,Cheshire,WA5 4DS,Tel: 01925294850,No ratings yet Rate it yourself - /Services/careproviders/LeaveReview/DefaultView.aspx?id=1-1442898828,0,0,,
ICARE SOLUTIONS MERSEYSIDE LTD,1-7746845533,SCL,Unit 29,"Bold Business Centre, Bold Lane",,St. Helens,,WA9 4TX,Tel: 01618820404,No ratings yet Rate it yourself - /Services/careproviders/LeaveReview/DefaultView.aspx?id=1-7746845533,0,0,,
Eclipse Care Solution Ltd,1-6948159536,SCL,Unit 52-54,"Bold Business Centre, Bold Lane",,St. Helens,,WA9 4TX,Tel: 01925390794,No ratings yet Rate it yourself - /Services/careproviders/LeaveReview/DefaultView.aspx?id=1-6948159536,0,0,,
Home Instead Warrington and Lymm,1-16539726062,SCL,Woolston Neighbourhood Hub,"Hall Road, Woolston",,Warrington,,WA1 4PN,Tel: 01925230006,No ratings yet Rate it yourself - /Services/careproviders/LeaveReview/DefaultView.aspx?id=1-16539726062,0,0,,
Rosevilla Residential Home,1-122681170,SCL,Penkford Lane,Collins Green,,Warrington,Cheshire,WA5 4EE,Tel: 01925228637,No ratings yet Rate it yourself - /Services/careproviders/LeaveReview/DefaultView.aspx?id=1-122681170,0,0,,
The Old Rectory Grappenhall Limited,1-475106897,SCL,Church Lane,Grappenhall,,Warrington,Cheshire,WA4 3EP,Tel: 01925604611,No ratings yet Rate it yourself - /Services/careproviders/LeaveReview/DefaultView.aspx?id=1-475106897,0,0,,
Ashwood Care,1-2564652211,SCL,72-74,"Dam Lane, Woolston",,Warrington,,WA1 4EP,Tel: 01925747961,No ratings yet Rate it yourself - /Services/careproviders/LeaveReview/DefaultView.aspx?id=1-2564652211,0,0,,
Woolston House,1-17594857473,SCL,Longbarn Lane,Woolston,,Warrington,Cheshire,WA1 4QB,Tel: 01709565777,No ratings yet Rate it yourself - /Services/careproviders/LeaveReview/DefaultView.aspx?id=1-17594857473,0,0,,
New Day Care LTD,1-4803335454,SCL,Suite 3,"Westway House 42-44, Bridge Street",,Newton-le-willows,,WA12 9QT,Tel: 0330024973,No ratings yet Rate it yourself - /Services/careproviders/LeaveReview/DefaultView.aspx?id=1-4803335454,0,0,,
Grappenhall Manor Care Centre,1-15522953843,SCL,Stockport Road,Grappenhall,,Warrington,,WA4 2WA,Tel: 01925596828,No ratings yet Rate it yourself - /Services/careproviders/LeaveReview/DefaultView.aspx?id=1-15522953843,0,0,,
Natural Networks - Individualised Support Service,1-12700518201,SCL,"2, The Square","710, Birchwood Boulevard, Birchwood,",,Warrington,,WA3 7QY,,No ratings yet Rate it yourself - /Services/careproviders/LeaveReview/DefaultView.aspx?id=1-12700518201,0,0,,
Raglin Care,1-18419055544,SCL,2 The Square,710 Birchwood Boulevard,,Warrington,,WA3 7QY,Tel: 01517082940,No ratings yet Rate it yourself - /Services/careproviders/LeaveReview/DefaultView.aspx?id=1-18419055544,0,0,,
Lifeways Community Care (Cheshire),1-15267120666,SCL,710 Birchwood Boulevard,Birchwood,,Warrington,,WA3 7QY,Tel: 01517070320,No ratings yet Rate it yourself - /Services/careproviders/LeaveReview/DefaultView.aspx?id=1-15267120666,0,0,,
Living Ambitions Chester,1-12701520853,SCL,"2 The Square,","710, Birchwood Boulevard, Birchwood,",,Warrington,,WA3 7QY,,No ratings yet Rate it yourself - /Services/careproviders/LeaveReview/DefaultView.aspx?id=1-12701520853,0,0,,
Lifeways Community Care Limited (West Midlands),1-1702848889,SCL,No. 2 The Square,Birchwood Boulevard,,Warrington,,WA3 7QY,Tel: 01782572000,No ratings yet Rate it yourself - /Services/careproviders/LeaveReview/DefaultView.aspx?id=1-1702848889,0,0,,
Independent Living Alliance Liverpool,1-12783599213,SCL,"2 The Square, 710 Birchwood Boulevard",Birchwood,,Warrington,,WA3 7QY,Tel: 01517082940,No ratings yet Rate it yourself - /Services/careproviders/LeaveReview/DefaultView.aspx?id=1-12783599213,0,0,,
Lifeways Inclusive Lifestyles Limited,1-12918468863,SCL,2 The Square 710 Birchwood Boulevard,Birchwood,,Warrington,,WA3 7QY,,No ratings yet Rate it yourself - /Services/careproviders/LeaveReview/DefaultView.aspx?id=1-12918468863,0,0,,
Lifeways Paragon Limited,1-12783305933,SCL,"2 The Square, 710 Birchwood Boulevard",Birchwood,,Warrington,,WA3 7QY,Tel: 01257246400,No ratings yet Rate it yourself - /Services/careproviders/LeaveReview/DefaultView.aspx?id=1-12783305933,0,0,,
Marlcroft,1-2171922635,SCL,746 Warrington Road,Risley,,Warrington,Cheshire,WA3 6AH,Tel: 01925871026,No ratings yet Rate it yourself - /Services/careproviders/LeaveReview/DefaultView.aspx?id=1-2171922635,0,0,,
Human Support Group Limited - Heald Farm Court,1-6317876872,SCL,28 Sturgess Street,,,Newton-le-willows,,WA12 9HN,Tel: 01925648003,No ratings yet Rate it yourself - /Services/careproviders/LeaveReview/DefaultView.aspx?id=1-6317876872,0,0,,
Lilford Court,1-121516761,SCL,1 Lilford Court,"Havisham Close, Birchwood",,Warrington,Cheshire,WA3 7JZ,Tel: 01925817087,No ratings yet Rate it yourself - /Services/careproviders/LeaveReview/DefaultView.aspx?id=1-121516761,0,0,,
Candour Care Group,1-8685454609,SCL,"Centrix House, Oak 3",26 Crow Lane East,,Newton-le-willows,,WA12 9UY,Tel: 01744775663,No ratings yet Rate it yourself - /Services/careproviders/LeaveReview/DefaultView.aspx?id=1-8685454609,0,0,,
Elm Tree House,1-122460709,SCL,32 Crow Lane West,,,Newton Le Willows,Merseyside,WA12 9YG,Tel: 01925291492,No ratings yet Rate it yourself - /Services/careproviders/LeaveReview/DefaultView.aspx?id=1-122460709,0,0,,
C&D Family Care,1-7012319915,SCL,64 Hamnett Court,Birchwood,,Warrington,,WA3 7AG,Tel: 01925968722,No ratings yet Rate it yourself - /Services/careproviders/LeaveReview/DefaultView.aspx?id=1-7012319915,0,0,,
Halton Supported Housing Network,1-145392072,SCL,45A Moorfield Road,,,Widnes,Cheshire,WA8 3JA,Tel: 01514226300,No ratings yet Rate it yourself - /Services/careproviders/LeaveReview/DefaultView.aspx?id=1-145392072,0,0,,
Human Support Group - Portland House,1-18340006701,SCL,Clarence Street,,,Newton-le-willows,,WA12 9EU,Tel: 01744737861,No ratings yet Rate it yourself - /Services/careproviders/LeaveReview/DefaultView.aspx?id=1-18340006701,0,0,,