Organisation Name,NACS Code,Organisation Type,Address1,Address2,Address3,Address4,Address5,PostCode,Telephone Number,NHS.UK users rating,Value  (NHS.UK users rating),Banding Classification  (NHS.UK users rating),Car parking (Is there car parking at this organisation?),Disabled access (Disabled access)
Winslow Court,1-119959868,SCL,Rowden,,,Bromyard,Herefordshire,HR7 4LS,Tel: 01885 488096,No ratings yet Rate it yourself - /Services/careproviders/LeaveReview/DefaultView.aspx?id=1-119959868,0,0,,
Cedar Lodge,1-2097943890,SCL,West Midlands Learning Campus,Rowden,,Bromyard,Herefordshire,HR7 4LS,Tel: 01885 488096,No ratings yet Rate it yourself - /Services/careproviders/LeaveReview/DefaultView.aspx?id=1-2097943890,0,0,,
Allcare Services and Training Limited,1-2320856620,SCL,1 Rowberry Street,,,Bromyard,Herefordshire,HR7 4DU,Tel: 0190520205,No ratings yet Rate it yourself - /Services/careproviders/LeaveReview/DefaultView.aspx?id=1-2320856620,0,0,,
Park House,1-119959899,SCL,28 Sherford Street,,,Bromyard,Herefordshire,HR7 4DL,Tel: 01885 483935,No ratings yet Rate it yourself - /Services/careproviders/LeaveReview/DefaultView.aspx?id=1-119959899,0,0,,
Froome Bank,1-134889315,SCL,Tower Hill,,,Bromyard,Herefordshire,HR7 4DF,Tel: 080 0902 0092,No ratings yet Rate it yourself - /Services/careproviders/LeaveReview/DefaultView.aspx?id=1-134889315,0,0,,
Highwell House Care Home with Nursing,1-121568260,SCL,32 Highwell Lane,,,Bromyard,Herefordshire,HR7 4DG,Tel: 01885488282,No ratings yet Rate it yourself - /Services/careproviders/LeaveReview/DefaultView.aspx?id=1-121568260,0,0,,
Whitegates,1-121568276,SCL,25 Hereford Road,,,Bromyard,Herefordshire,HR7 4ES,Tel: 01885482437,No ratings yet Rate it yourself - /Services/careproviders/LeaveReview/DefaultView.aspx?id=1-121568276,0,0,,
"Eclipse HomeCare (The Teme Valley, Tenbury & Bromyard)",1-2827219712,SCL,21 Teme Street,21 Teme Street,,Tenbury Wells,Worcestershire,WR15 8BB,Tel: 01905641070,No ratings yet Rate it yourself - /Services/careproviders/LeaveReview/DefaultView.aspx?id=1-2827219712,0,0,,
Haresbrook Park Care Home,1-1935889079,SCL,Haresbrook Lane,,,Tenbury Wells,Worcestershire,WR15 8FD,Tel: 01584811786,No ratings yet Rate it yourself - /Services/careproviders/LeaveReview/DefaultView.aspx?id=1-1935889079,0,0,,
Casa Mia Care Home,1-125686216,SCL,Casa Mia Cleobury Road,Far Forest,,Kidderminster,Worcestershire,DY14 9EH,Tel: 01299266317,No ratings yet Rate it yourself - /Services/careproviders/LeaveReview/DefaultView.aspx?id=1-125686216,0,0,,
Dunley Hall & Ryans Court,1-412499036,SCL,Dunley,,,Stourport-on-Severn,Worcestershire,DY13 0TX,Tel: 01299 822040,No ratings yet Rate it yourself - /Services/careproviders/LeaveReview/DefaultView.aspx?id=1-412499036,0,0,,
Astley Hall Care Home,1-412490546,SCL,Church Lane,Astley,,Stourport-on-Severn,Worcestershire,DY13 0RW,Tel: 01299 827020,No ratings yet Rate it yourself - /Services/careproviders/LeaveReview/DefaultView.aspx?id=1-412490546,0,0,,
Pencombe Hall,1-140403915,SCL,Pencombe,,,Bromyard,Herefordshire,HR7 4RL,Tel: 01885400217,No ratings yet Rate it yourself - /Services/careproviders/LeaveReview/DefaultView.aspx?id=1-140403915,0,0,,
Care 4 Mind Limited,1-15922508034,SCL,131a & 131b Redstone Lane,,,Stourport-on-severn,,DY13 0JN,,No ratings yet Rate it yourself - /Services/careproviders/LeaveReview/DefaultView.aspx?id=1-15922508034,0,0,,
Rutland Villa,1-127549079,SCL,62 Chesshire Avenue,,,Stourport On Severn,Worcestershire,DY13 0EA,Tel: 01299879221,No ratings yet Rate it yourself - /Services/careproviders/LeaveReview/DefaultView.aspx?id=1-127549079,0,0,,
Areley House,1-12257889102,SCL,Areley Lane,,,Stourport-on-severn,,DY13 0AB,Tel: 01299877727,No ratings yet Rate it yourself - /Services/careproviders/LeaveReview/DefaultView.aspx?id=1-12257889102,0,0,,
Woodbury View,1-289659568,SCL,Martley Road,,,Worcester,Worcestershire,WR2 6QG,Tel: 01905641745,No ratings yet Rate it yourself - /Services/careproviders/LeaveReview/DefaultView.aspx?id=1-289659568,0,0,,
Your Elysium Limited,1-3005110455,SCL,"Unit 5b, Top Barn Business Centre,","Worcester Road, Holt Heath",,Worcester,,WR6 6NH,Tel: 01905930699,No ratings yet Rate it yourself - /Services/careproviders/LeaveReview/DefaultView.aspx?id=1-3005110455,0,0,,
Snow Bengal Ltd,1-14907954822,SCL,"Unit 18a, Top Barn Business Centre","Worcester Road, Holt Heath",,Worcester,,WR6 6NH,Tel: 01905954694,No ratings yet Rate it yourself - /Services/careproviders/LeaveReview/DefaultView.aspx?id=1-14907954822,0,0,,
Summerdyne Nursing Home,1-115758590,SCL,Cleobury Road,Wyre Hill,,Bewdley,Worcestershire,DY12 2QQ,Tel: 01299 403260,No ratings yet Rate it yourself - /Services/careproviders/LeaveReview/DefaultView.aspx?id=1-115758590,0,0,,
Doddington Lodge,1-7194606597,SCL,Doddington,Hopton Wafers,,Kidderminster,,DY14 0HJ,Tel: 01584707084,No ratings yet Rate it yourself - /Services/careproviders/LeaveReview/DefaultView.aspx?id=1-7194606597,0,0,,
Worth Crescent,1-147763160,SCL,35 Worth Crescent,,,Stourport on Severn,Worcestershire,DY13 8RR,Tel: 01299822515,No ratings yet Rate it yourself - /Services/careproviders/LeaveReview/DefaultView.aspx?id=1-147763160,0,0,,
Ravenhurst Residential Care Home,1-124396183,SCL,21 Lickhill Road North,,,Stourport On Severn,Worcestershire,DY13 8RU,Tel: 01299825610,No ratings yet Rate it yourself - /Services/careproviders/LeaveReview/DefaultView.aspx?id=1-124396183,0,0,,
Radis Community Care (School Gardens),1-5086855628,SCL,Vernon Road,,,Stourport-on-severn,,DY13 8ES,Tel: 01299669942,No ratings yet Rate it yourself - /Services/careproviders/LeaveReview/DefaultView.aspx?id=1-5086855628,0,0,,
Hernes Nest House,1-117538288,SCL,Herne's Nest,Off Park Lane,,Bewdley,Worcestershire,DY12 2ET,Tel: 01299402136,No ratings yet Rate it yourself - /Services/careproviders/LeaveReview/DefaultView.aspx?id=1-117538288,0,0,,
Stourport Nursing and Homecare Limited,1-130594772,SCL,Hernes Nest House,"7 Hernes Nest, Off Park Lane",,Bewdley,Worcestershire,DY12 2ET,Tel: 01299403353,No ratings yet Rate it yourself - /Services/careproviders/LeaveReview/DefaultView.aspx?id=1-130594772,0,0,,
Riverside Home Care,1-1848974329,SCL,Anglo House,Worcester Road,,Stourport-on-Severn,,DY13 9AW,Tel: 01299823777,No ratings yet Rate it yourself - /Services/careproviders/LeaveReview/DefaultView.aspx?id=1-1848974329,0,0,,
Advantage Health & Social Care,1-4393424020,SCL,Suite 13,"Old Anglo House, Mitton Street",,Stourport-on-severn,,DY13 9AW,Tel: 01299407177,No ratings yet Rate it yourself - /Services/careproviders/LeaveReview/DefaultView.aspx?id=1-4393424020,0,0,,
Agincare Worcester,1-8664685889,SCL,Office 16 & 17,"1st Floor Riverside Business Centre, Worcester Road",,Stourport-on-severn,,DY13 9BZ,Tel: 01299871841,No ratings yet Rate it yourself - /Services/careproviders/LeaveReview/DefaultView.aspx?id=1-8664685889,0,0,,
Waterside Care Centre,1-123533948,SCL,Leigh Sinton,,,Malvern,Worcestershire,WR13 5EQ,Tel: 01886833706,No ratings yet Rate it yourself - /Services/careproviders/LeaveReview/DefaultView.aspx?id=1-123533948,0,0,,
Fairfield House,1-119959929,SCL,Bleathwood,,,Ludlow,Herefordshire,SY8 4LF,Tel: 01584 711878,No ratings yet Rate it yourself - /Services/careproviders/LeaveReview/DefaultView.aspx?id=1-119959929,0,0,,
The Wharf Care Centre,1-7382852438,SCL,76 Minster Road,,,Stourport-on-severn,,DY13 8AP,Tel: 01299393098,No ratings yet Rate it yourself - /Services/careproviders/LeaveReview/DefaultView.aspx?id=1-7382852438,0,0,,
Hamilton House,1-376104650,SCL,Leigh Sinton,,,Malvern,Worcestershire,WR13 5DZ,Tel: 01886832456,No ratings yet Rate it yourself - /Services/careproviders/LeaveReview/DefaultView.aspx?id=1-376104650,0,0,,
Minster Grange Residential Home,1-416979147,SCL,Minster Road,,,Stourport On Severn,Worcestershire,DY13 8AT,Tel: 01299826636,No ratings yet Rate it yourself - /Services/careproviders/LeaveReview/DefaultView.aspx?id=1-416979147,0,0,,
TLC Care at Home Ltd,1-2037345972,SCL,58 Load Street,,,Bewdley,Worcestershire,DY12 2AP,Tel: 01299272897,2 ratings Rate it yourself - /Services/careproviders/LeaveReview/DefaultView.aspx?id=1-2037345972,,,,
Constable House,1-187540626,SCL,6-8 Howard Road,Dines Green,,Worcester,Worcestershire,WR2 5RB,Tel: 01905422150,No ratings yet Rate it yourself - /Services/careproviders/LeaveReview/DefaultView.aspx?id=1-187540626,0,0,,
Northwick Grange,1-146821579,SCL,19 Old Northwick Lane,,,Worcester,Worcestershire,WR3 7NB,Tel: 01905453916,1 rating Rate it yourself - /Services/careproviders/LeaveReview/DefaultView.aspx?id=1-146821579,,,,
Inspire Neurocare Worcester,1-8296451126,SCL,195 Oldbury Road,,,Worcester,,WR2 6AS,Tel: 01905969000,1 rating Rate it yourself - /Services/careproviders/LeaveReview/DefaultView.aspx?id=1-8296451126,,,,
CM Bespoke Care Ltd,1-3872473213,SCL,"Ground Floor Office Suite, Upper Baveney Park",Cleobury Mortimer,,Kidderminster,,DY14 8LF,Tel: 01746718816,No ratings yet Rate it yourself - /Services/careproviders/LeaveReview/DefaultView.aspx?id=1-3872473213,0,0,,
Juniper House Residential Care Home,1-2148344202,SCL,2 Oak View Way,St Johns,,Worcester,Worcestershire,WR2 5FJ,Tel: 01905676950,No ratings yet Rate it yourself - /Services/careproviders/LeaveReview/DefaultView.aspx?id=1-2148344202,0,0,,
Sanctuary Supported Living (Hazel Court),1-2207969105,SCL,3 University Park Drive,,,Worcester,Worcestershire,WR2 5FG,Tel: 01905796561,No ratings yet Rate it yourself - /Services/careproviders/LeaveReview/DefaultView.aspx?id=1-2207969105,0,0,,
Henwick Grange,1-326347049,SCL,68 Hallow Road,St Johns,,Worcester,Worcestershire,WR2 6BY,Tel: 01905424705,No ratings yet Rate it yourself - /Services/careproviders/LeaveReview/DefaultView.aspx?id=1-326347049,0,0,,
Sanctuary Home Care Ltd- Worcester,1-2305128804,SCL,Noble House,1 Oak View Way,,Worcester,Worcestershire,WR2 5FH,Tel: 01905676946,No ratings yet Rate it yourself - /Services/careproviders/LeaveReview/DefaultView.aspx?id=1-2305128804,0,0,,
Shining Star Home Care Limited,1-11058533433,SCL,40 Malvern Oaks Close,Cradley,,Malvern,,WR13 5NE,Tel: 07958591470,No ratings yet Rate it yourself - /Services/careproviders/LeaveReview/DefaultView.aspx?id=1-11058533433,0,0,,
Rely Care Agency Limited,1-122138077,SCL,33A Himbleton Road,St Johns,,Worcester,Worcestershire,WR2 6BA,Tel: 01905339331,No ratings yet Rate it yourself - /Services/careproviders/LeaveReview/DefaultView.aspx?id=1-122138077,0,0,,
The Willows Care Home,1-5375195863,SCL,2 Tower Road,,,Worcester,Worcestershire,WR3 7AF,Tel: 0190520658,3 ratings Rate it yourself - /Services/careproviders/LeaveReview/DefaultView.aspx?id=1-5375195863,,,,
A & M Bewdley Care Services,1-841748157,SCL,Oldington Lane,,,Kidderminster,,DY11 7QN,Tel: 01562750060,No ratings yet Rate it yourself - /Services/careproviders/LeaveReview/DefaultView.aspx?id=1-841748157,0,0,,
Stanfield Nursing Home Limited,1-114409532,SCL,Upper Wick Lane,Rushwick,,Worcester,Worcestershire,WR2 5SU,,No ratings yet Rate it yourself - /Services/careproviders/LeaveReview/DefaultView.aspx?id=1-114409532,0,0,,
Bedwardine House Residential Care Home,1-115230808,SCL,Upper Wick Lane,Rushwick,,Worcester,Worcestershire,WR2 5SU,Tel: 01905425101,No ratings yet Rate it yourself - /Services/careproviders/LeaveReview/DefaultView.aspx?id=1-115230808,0,0,,
St Stephen's Care Home,1-3583146841,SCL,St Stephens Terrace,Droitwich Road,,Worcester,Worcestershire,WR3 7HU,Tel: 0190529224,No ratings yet Rate it yourself - /Services/careproviders/LeaveReview/DefaultView.aspx?id=1-3583146841,0,0,,
Phoenix House,1-10867338350,SCL,122 Bromyard Road,,,Worcester,,WR2 5DJ,,No ratings yet Rate it yourself - /Services/careproviders/LeaveReview/DefaultView.aspx?id=1-10867338350,0,0,,
Woofferton Residential Care Home,1-123567394,SCL,Woofferton,,,Ludlow,Shropshire,SY8 4AL,Tel: 01584711207,No ratings yet Rate it yourself - /Services/careproviders/LeaveReview/DefaultView.aspx?id=1-123567394,0,0,,
Coppice Lodge,1-4749428543,SCL,66-68 Walter Nash Road East,,,Kidderminster,Worcestershire,DY11 7BY,Tel: 01562637665,No ratings yet Rate it yourself - /Services/careproviders/LeaveReview/DefaultView.aspx?id=1-4749428543,0,0,,
95 Bromyard Road,1-304923242,SCL,95 Bromyard Road,St Johns,,Worcester,Worcestershire,WR2 5BZ,Tel: 01905 429527,No ratings yet Rate it yourself - /Services/careproviders/LeaveReview/DefaultView.aspx?id=1-304923242,0,0,,
Regent Residential Care Home,1-124396200,SCL,School Road,St Johns,,Worcester,Worcestershire,WR2 4HF,Tel: 01905337100,No ratings yet Rate it yourself - /Services/careproviders/LeaveReview/DefaultView.aspx?id=1-124396200,0,0,,
Headway Worcestershire,1-359238177,SCL,The Mill,Gregory's Mill Street,,Worcester,Worcestershire,WR3 8BA,Tel: 01905729729,No ratings yet Rate it yourself - /Services/careproviders/LeaveReview/DefaultView.aspx?id=1-359238177,0,0,,
Park House Nursing Home,1-135058018,SCL,Kinlet,,,Bewdley,Shropshire,DY12 3BB,Tel: 01299 660010,No ratings yet Rate it yourself - /Services/careproviders/LeaveReview/DefaultView.aspx?id=1-135058018,0,0,,
Dalvington/The Oaks,1-120634754,SCL,Dalvington,146 Lower Howsell Road,,Malvern,Worcestershire,WR14 1DL,Tel: 01886833424,No ratings yet Rate it yourself - /Services/careproviders/LeaveReview/DefaultView.aspx?id=1-120634754,0,0,,
The Belmont,1-11976471025,SCL,John Comyn Drive,,,Worcester,,WR3 7NS,Tel: 01905590012,No ratings yet Rate it yourself - /Services/careproviders/LeaveReview/DefaultView.aspx?id=1-11976471025,0,0,,
The Woodlands,1-15351658453,SCL,The Woodlands,Rifle Range Road,,Kidderminster,,DY11 7NN,Tel: 0156269525,No ratings yet Rate it yourself - /Services/careproviders/LeaveReview/DefaultView.aspx?id=1-15351658453,0,0,,
Radfield Home Care Worcester,1-5271995588,SCL,6 King Charles Place,St. Johns,,Worcester,,WR2 5AJ,Tel: 01905 427 863,No ratings yet Rate it yourself - /Services/careproviders/LeaveReview/DefaultView.aspx?id=1-5271995588,0,0,,
Carefour,1-3657527547,SCL,3 Moor Street,,,Worcester,Worcestershire,WR1 3DB,Tel: 01905699699,No ratings yet Rate it yourself - /Services/careproviders/LeaveReview/DefaultView.aspx?id=1-3657527547,0,0,,
Priory Supported Living The Shires,1-10525531173,SCL,Anbrian House,1 The Tything,,Worcester,,WR1 1HD,Tel: 01905611042,No ratings yet Rate it yourself - /Services/careproviders/LeaveReview/DefaultView.aspx?id=1-10525531173,0,0,,
Fernhill House,1-5383009245,SCL,Grange Lane,Fernhill Heath,,Worcester,Worcestershire,WR3 7UR,Tel: 01905679300,No ratings yet Rate it yourself - /Services/careproviders/LeaveReview/DefaultView.aspx?id=1-5383009245,0,0,,
The Firs Rest Home,1-118565717,SCL,141 Malvern Road,St Johns,,Worcester,Worcestershire,WR2 4LN,Tel: 01905426194,No ratings yet Rate it yourself - /Services/careproviders/LeaveReview/DefaultView.aspx?id=1-118565717,0,0,,
"Eclipse HomeCare (Worcester, Malvern, Kidderminster & Bromsgrove)",1-122963052,SCL,County House,1 St Mary's Street,,Worcester,Worcestershire,WR1 1HB,Tel: 01905 641070,No ratings yet Rate it yourself - /Services/careproviders/LeaveReview/DefaultView.aspx?id=1-122963052,0,0,,
Touchheart Healthcare Worcester Office,1-12515157010,SCL,County House,St. Marys Street,,Worcester,,WR1 1HB,Tel: 07403680808,No ratings yet Rate it yourself - /Services/careproviders/LeaveReview/DefaultView.aspx?id=1-12515157010,0,0,,
Evans Healthcare Group - Worcester,1-15712164285,SCL,"T15, County House",St. Marys Street,,Worcester,,WR1 1HB,Tel: 07534663697,No ratings yet Rate it yourself - /Services/careproviders/LeaveReview/DefaultView.aspx?id=1-15712164285,0,0,,
Nurseplus - Worcester,1-18092255813,SCL,County House,St. Marys Street,,Worcester,,WR1 1HB,Tel: 0190525279,No ratings yet Rate it yourself - /Services/careproviders/LeaveReview/DefaultView.aspx?id=1-18092255813,0,0,,
Firstcall 247 Limited (Worcestershire),1-16888189378,SCL,01 Third Floor County House Business Centre,St. Marys Street,,Worcester,,WR1 1HB,Tel: 01905972288,No ratings yet Rate it yourself - /Services/careproviders/LeaveReview/DefaultView.aspx?id=1-16888189378,0,0,,
Simply The Best Care Ltd,1-9960242615,SCL,County House,St. Marys Street,,Worcester,,WR1 1HB,Tel: 07710888553,1 rating Rate it yourself - /Services/careproviders/LeaveReview/DefaultView.aspx?id=1-9960242615,,,,
Cleeve House,1-135441632,SCL,49 Hornyold Road,,,Malvern,Worcestershire,WR14 1QH,Tel: 01684564454,No ratings yet Rate it yourself - /Services/careproviders/LeaveReview/DefaultView.aspx?id=1-135441632,0,0,,
Helping Hands Worcester,1-6692732361,SCL,32 Broad Street,,,Worcester,,WR1 3NH,Tel: 01905676981,No ratings yet Rate it yourself - /Services/careproviders/LeaveReview/DefaultView.aspx?id=1-6692732361,0,0,,
Radis Community Care (Clarence Park Village),1-4279579084,SCL,Clarence Park Village,415 Worcester Road,,Malvern,Worcestershire,WR14 1PP,Tel: 01684583010,No ratings yet Rate it yourself - /Services/careproviders/LeaveReview/DefaultView.aspx?id=1-4279579084,0,0,,
Infinity Home Care Ltd,1-2844923462,SCL,62 Summer Road,,,Kidderminster,Worcestershire,DY11 7JS,Tel: 01562 720955,No ratings yet Rate it yourself - /Services/careproviders/LeaveReview/DefaultView.aspx?id=1-2844923462,0,0,,
Berrington Court,1-3515802189,SCL,Felix Baxter Drive,,,Kidderminster,Worcestershire,DY11 7FH,Tel: 01562733134,No ratings yet Rate it yourself - /Services/careproviders/LeaveReview/DefaultView.aspx?id=1-3515802189,0,0,,
Matrixcare,1-3229146212,SCL,369 Worcester Road,,,Malvern,Worcestershire,WR14 1AR,Tel: 01684568097,No ratings yet Rate it yourself - /Services/careproviders/LeaveReview/DefaultView.aspx?id=1-3229146212,0,0,,
Dependable Home Care Services Limited,1-4207242680,SCL,61 Canada Way,,,Worcester,,WR2 4XA,Tel: 07594683830,No ratings yet Rate it yourself - /Services/careproviders/LeaveReview/DefaultView.aspx?id=1-4207242680,0,0,,
Foley Grange,1-11982697817,SCL,Silverwoods Way,,,Kidderminster,,DY11 7DT,Tel: 01562543366,No ratings yet Rate it yourself - /Services/careproviders/LeaveReview/DefaultView.aspx?id=1-11982697817,0,0,,
Bethany Lodge,1-120814501,SCL,222 Malvern Road,,,Worcester,Worcestershire,WR2 4PA,Tel: 01905420088,No ratings yet Rate it yourself - /Services/careproviders/LeaveReview/DefaultView.aspx?id=1-120814501,0,0,,
Teme Court Residential Care Home,1-113398333,SCL,Old Road,Lower Wick,,Worcester,Worcestershire,WR2 4BU,Tel: 01905972023,No ratings yet Rate it yourself - /Services/careproviders/LeaveReview/DefaultView.aspx?id=1-113398333,0,0,,
Springfield House,1-2061660719,SCL,3-5 Ranelagh Road,,,Malvern,Worcestershire,WR14 1BQ,Tel: 01684574248,No ratings yet Rate it yourself - /Services/careproviders/LeaveReview/DefaultView.aspx?id=1-2061660719,0,0,,
The Oaks,1-113493371,SCL,165 Worcester Road,,,Malvern,Worcestershire,WR14 1ET,Tel: 01684572079,No ratings yet Rate it yourself - /Services/careproviders/LeaveReview/DefaultView.aspx?id=1-113493371,0,0,,
West Eaton Nursing and Residential home,1-115758615,SCL,Worcester Road,,,Leominster,Herefordshire,HR6 0QJ,Tel: 01568 610395,No ratings yet Rate it yourself - /Services/careproviders/LeaveReview/DefaultView.aspx?id=1-115758615,0,0,,
Options Bredon House,1-476877271,SCL,Hospital Lane,Powick,,Worcester,,WR2 4SQ,Tel: 01905830234,1 rating Rate it yourself - /Services/careproviders/LeaveReview/DefaultView.aspx?id=1-476877271,,,,
Newlife Care Providers,1-2922803038,SCL,"HDAnywhere, The Haysfield",Spring Lane North,,Malvern,,WR14 1GF,Tel: 07414260226,No ratings yet Rate it yourself - /Services/careproviders/LeaveReview/DefaultView.aspx?id=1-2922803038,0,0,,
The Springs Care Home,1-130120870,SCL,Spring Lane,,,Malvern,Worcestershire,WR14 1AL,Tel: 01684571300,No ratings yet Rate it yourself - /Services/careproviders/LeaveReview/DefaultView.aspx?id=1-130120870,0,0,,
Hollyfields,1-125856154,SCL,Habberley Road,Habberley,,Kidderminster,Worcestershire,DY11 5RJ,Tel: 01562514810,1 rating Rate it yourself - /Services/careproviders/LeaveReview/DefaultView.aspx?id=1-125856154,,,,
Ignite Health and Home Care Service - Worcester,1-8531329627,SCL,1c Lowesmoor Terrace,,,Worcester,,WR1 2RX,Tel: 01905252718,No ratings yet Rate it yourself - /Services/careproviders/LeaveReview/DefaultView.aspx?id=1-8531329627,0,0,,
Home Instead Senior Care,1-377680897,SCL,Suite 5B,"Malvern Gate, Bromwich Road",,Worcester,Worcestershire,WR2 4BN,Tel: 01905420404,No ratings yet Rate it yourself - /Services/careproviders/LeaveReview/DefaultView.aspx?id=1-377680897,0,0,,
Moor Court,1-116682569,SCL,Moor Court Residential Home,Bodenham,,Hereford,Herefordshire,HR1 3HW,Tel: 01568797461,No ratings yet Rate it yourself - /Services/careproviders/LeaveReview/DefaultView.aspx?id=1-116682569,0,0,,
Crossroads Caring for Carers,1-130618228,SCL,Crossroads Caring for Carers (Worcestershire),"Weir Lane, Lower Wick",,Worcester,Worcestershire,WR2 4AY,Tel: 01905729293,No ratings yet Rate it yourself - /Services/careproviders/LeaveReview/DefaultView.aspx?id=1-130618228,0,0,,
Severn Vale Home Care Worcester,1-12119336784,SCL,"Office F2, New Venture House",Park Boulevard,,Worcester,,WR2 4AY,Tel: 01905950409,No ratings yet Rate it yourself - /Services/careproviders/LeaveReview/DefaultView.aspx?id=1-12119336784,0,0,,
Friends of the Elderly Malvern,1-117309799,SCL,148 Graham Road,,,Malvern,Worcestershire,WR14 2HY,Tel: 01684574385,No ratings yet Rate it yourself - /Services/careproviders/LeaveReview/DefaultView.aspx?id=1-117309799,0,0,,
Caremark (Worcester & Malvern Hills),1-2446245822,SCL,Polysec House,Blackpole Trading Estate West,,Worcester,Worcestershire,WR3 8TJ,Tel: 01905 452595,1 rating Rate it yourself - /Services/careproviders/LeaveReview/DefaultView.aspx?id=1-2446245822,,,,
Caremark (Wychavon & Wyre Forest),1-12836256485,SCL,Polysec House,"Blackpole Trading Estate West, Hindlip Lane",,Worcester,,WR3 8TJ,Tel: 01562543290,No ratings yet Rate it yourself - /Services/careproviders/LeaveReview/DefaultView.aspx?id=1-12836256485,0,0,,
The Broad Group Ltd,1-4572626217,SCL,12 Astwood Road,,,Worcester,,WR3 8ET,Tel: 01905330602,No ratings yet Rate it yourself - /Services/careproviders/LeaveReview/DefaultView.aspx?id=1-4572626217,0,0,,
Home Force Care Worcester,1-14906231910,SCL,8 Edgar Street,,,Worcester,,WR1 2LR,,No ratings yet Rate it yourself - /Services/careproviders/LeaveReview/DefaultView.aspx?id=1-14906231910,0,0,,
Happylife Care,1-2033159442,SCL,Unit 3D,Shrub Hill Industrial Estate,,Worcester,Worcestershire,WR4 9EL,Tel: 07401772572,No ratings yet Rate it yourself - /Services/careproviders/LeaveReview/DefaultView.aspx?id=1-2033159442,0,0,,
MJSGBig5RewardsHealthcare Limited,1-2420422302,SCL,"Room 11A1, Blackpole Business Centre",Blackpole Road,,Worcester,,WR3 8SQ,Tel: 01905923356,1 rating Rate it yourself - /Services/careproviders/LeaveReview/DefaultView.aspx?id=1-2420422302,,,,
Nationwide Care Services Ltd (Worcester),1-2694538733,SCL,Blackpole Business Centre,Blackpole,,Worcester,,WR3 8SQ,Tel: 01905458792,1 rating Rate it yourself - /Services/careproviders/LeaveReview/DefaultView.aspx?id=1-2694538733,,,,
People in Action Domiciliary Care - Worcester,1-111132927,SCL,"Suite 2, Crown House",Blackpole East,,Worcester,Worcestershire,WR3 8SG,Tel: 01905755843,No ratings yet Rate it yourself - /Services/careproviders/LeaveReview/DefaultView.aspx?id=1-111132927,0,0,,
Millfields Care Ltd,1-12353191854,SCL,40 Cockshot Road,,,Malvern,,WR14 2TT,Tel: 07515541158,1 rating Rate it yourself - /Services/careproviders/LeaveReview/DefaultView.aspx?id=1-12353191854,,,,
Glarm Health Care Services Limited,1-17576806035,SCL,18 Blackthorn Road,,,Worcester,,WR4 9TD,Tel: 07427412381,No ratings yet Rate it yourself - /Services/careproviders/LeaveReview/DefaultView.aspx?id=1-17576806035,0,0,,
Cheadle Care Ltd,1-11229605290,SCL,Grange Court,Pinsley Road,,Leominster,Herefordshire,HR6 8NL,Tel: 01568701065,No ratings yet Rate it yourself - /Services/careproviders/LeaveReview/DefaultView.aspx?id=1-11229605290,0,0,,