Organisation Name,NACS Code,Organisation Type,Address1,Address2,Address3,Address4,Address5,PostCode,Telephone Number,NHS.UK users rating,Value  (NHS.UK users rating),Banding Classification  (NHS.UK users rating),Car parking (Is there car parking at this organisation?),Disabled access (Disabled access)
5th Floor Hyde Park,1-7745608755,SCL,11 Millington Road,,,Hayes,Middlesex,UB3 4AZ,Tel: 02089823540,No ratings yet Rate it yourself - /Services/careproviders/LeaveReview/DefaultView.aspx?id=1-7745608755,0,0,,
K5K Limited t/a Tezlom,1-18067082393,SCL,Access Self Storage,1 Nestles Avenue,,Hayes,,UB3 4UZ,Tel: 08455481247,No ratings yet Rate it yourself - /Services/careproviders/LeaveReview/DefaultView.aspx?id=1-18067082393,0,0,,
Somcare Agency Limited,1-4718246247,SCL,46-50 Station Road,,,Hayes,Middlesex,UB3 4DD,Tel: 02086173050,No ratings yet Rate it yourself - /Services/careproviders/LeaveReview/DefaultView.aspx?id=1-4718246247,0,0,,
Flourish Community Homecare Limited ,1-13220572129,SCL,"Unit 4, 2nd Floor",46-50 Station Road,,Hayes,,UB3 4DD,Tel: 07585181115,No ratings yet Rate it yourself - /Services/careproviders/LeaveReview/DefaultView.aspx?id=1-13220572129,0,0,,
Joyous Limited,1-14907846233,SCL,27-37,Station Road,,Hayes,,UB3 4DX,Tel: 07400249697,No ratings yet Rate it yourself - /Services/careproviders/LeaveReview/DefaultView.aspx?id=1-14907846233,0,0,,
Hayes,1-13937115647,SCL,"Office 15, 27-37 Station Road",,,Hayes,,UB3 4DX,Tel: 07471934203,No ratings yet Rate it yourself - /Services/careproviders/LeaveReview/DefaultView.aspx?id=1-13937115647,0,0,,
Unity Care Agency Ltd,1-13166419627,SCL,"Suite 46, The Winning Box, Aquis House",27-37 Station Road,,Hayes,,UB3 4DX,Tel: 07944559790,No ratings yet Rate it yourself - /Services/careproviders/LeaveReview/DefaultView.aspx?id=1-13166419627,0,0,,
Saint Lucian,1-16862957470,SCL,Aquis House 27-37,Station Road,,Hayes,,UB3 4DX,Tel: 02080588005,No ratings yet Rate it yourself - /Services/careproviders/LeaveReview/DefaultView.aspx?id=1-16862957470,0,0,,
Rightway Care Ltd,1-11342240335,SCL,27-37,Station Road,,Hayes,,UB3 4DX,Tel: 02080902086,No ratings yet Rate it yourself - /Services/careproviders/LeaveReview/DefaultView.aspx?id=1-11342240335,0,0,,
Marigold Home Care Ltd,1-15062281333,SCL,Auqis House,27-37 Station Road,,Hayes,,UB3 4DX,Tel: 020 3152 7194,1 rating Rate it yourself - /Services/careproviders/LeaveReview/DefaultView.aspx?id=1-15062281333,,,,
The Winning Box,1-8611648511,SCL,27-37,Station Road,,Hayes,,UB3 4DX,Tel: 02038766916,1 rating Rate it yourself - /Services/careproviders/LeaveReview/DefaultView.aspx?id=1-8611648511,,,,
KANSSAS HOME CARE - HAYES,1-8585166199,SCL,Unit 27 The Winning Box,27-37 Station Road,,Hayes,,UB3 4DX,,No ratings yet Rate it yourself - /Services/careproviders/LeaveReview/DefaultView.aspx?id=1-8585166199,0,0,,
LOYALTY HEALTHCARE LIMITED,1-18274205400,SCL,35 Glamis Crescent,,,Hayes,,UB3 1QA,Tel: 07930910934,No ratings yet Rate it yourself - /Services/careproviders/LeaveReview/DefaultView.aspx?id=1-18274205400,0,0,,
Quest Recovery Services Limited,1-4730987699,SCL,Unit F,"Britannia Trading Estate, Printing House Lane",,Hayes,Middlesex,UB3 1AP,,4 ratings Rate it yourself - /Services/careproviders/LeaveReview/DefaultView.aspx?id=1-4730987699,,,,
Excellent Health Care,1-3581710542,SCL,Westminster Business Centre,Printing House Lane,,Hayes,,UB3 1AP,Tel: 02071830739,No ratings yet Rate it yourself - /Services/careproviders/LeaveReview/DefaultView.aspx?id=1-3581710542,0,0,,
Metro Homecare Ltd,1-7024426052,SCL,50C Coldharbour Lane,,,Hayes,Middlesex,UB3 3EP,Tel: 02037940697,No ratings yet Rate it yourself - /Services/careproviders/LeaveReview/DefaultView.aspx?id=1-7024426052,0,0,,
Sahan Cares C.I.C,1-280686795,SCL,Sahan Cares C.I.C,18-20 East Avenue,,Hayes,Middlesex,UB3 2HP,Tel: 02088481380,1 rating Rate it yourself - /Services/careproviders/LeaveReview/DefaultView.aspx?id=1-280686795,,,,
Care Outlook (Hillingdon),1-12539535002,SCL,"Office 2.22, Regus 6-9 The Square",Stockley Park,,Uxbridge,,UB11 1FW,Tel: 02085618295,No ratings yet Rate it yourself - /Services/careproviders/LeaveReview/DefaultView.aspx?id=1-12539535002,0,0,,
Tada Healthcare Services Ltd,1-18694795491,SCL,6-9,Stockley Park,,Uxbridge,,UB11 1FW,Tel: 07767266483,No ratings yet Rate it yourself - /Services/careproviders/LeaveReview/DefaultView.aspx?id=1-18694795491,0,0,,
Pinnacle Support Services,1-16369252298,SCL,"Office 2.59, 6-9 The Square",Stockley Park,,Uxbridge,,UB11 1FW,Tel: 07879348614,No ratings yet Rate it yourself - /Services/careproviders/LeaveReview/DefaultView.aspx?id=1-16369252298,0,0,,
London Homecarers Ltd,1-14976963258,SCL,99 Coldharbour Lane,,,Hayes,,UB3 3EF,Tel: 07432843495,No ratings yet Rate it yourself - /Services/careproviders/LeaveReview/DefaultView.aspx?id=1-14976963258,0,0,,
First Choice Carers Ltd,1-14913220470,SCL,West London Somaliland Community Centre,80 East Avenue,,Hayes,,UB3 2HR,Tel: 07383691514,No ratings yet Rate it yourself - /Services/careproviders/LeaveReview/DefaultView.aspx?id=1-14913220470,0,0,,
City Home Care Limited,1-5516168760,SCL,90/B East Avenue,,,Hayes,,UB3 2HR,Tel: 02081278240,1 rating Rate it yourself - /Services/careproviders/LeaveReview/DefaultView.aspx?id=1-5516168760,,,,
Triscott House,1-14771757975,SCL,"CCS Home Care Services Ltd, Triscott House",Avondale Drive,,Hayes,,UB3 3PE,Tel: 02088483477,No ratings yet Rate it yourself - /Services/careproviders/LeaveReview/DefaultView.aspx?id=1-14771757975,0,0,,
Glenister Gardens,1-1640975970,SCL,31 Glenister Gardens,,,Hayes,Middlesex,UB3 3FA,Tel: 02085737828,No ratings yet Rate it yourself - /Services/careproviders/LeaveReview/DefaultView.aspx?id=1-1640975970,0,0,,
Screened Personnel Limited - Main Office,1-18123611202,SCL,4 Longwalk Road,Stockley Park,,Uxbridge,,UB11 1FE,Tel: 03335771813,No ratings yet Rate it yourself - /Services/careproviders/LeaveReview/DefaultView.aspx?id=1-18123611202,0,0,,
Lalis Direct Care - Hillingdon,1-11932156874,SCL,"Hayes Business Studios, College Way",Coldharbour Lane,,Hayes,,UB3 3BB,Tel: 02081547610,No ratings yet Rate it yourself - /Services/careproviders/LeaveReview/DefaultView.aspx?id=1-11932156874,0,0,,
Panacea Care,1-519002719,SCL,13 Wood End Green Road,,,Hayes,Middlesex,UB3 2SB,,No ratings yet Rate it yourself - /Services/careproviders/LeaveReview/DefaultView.aspx?id=1-519002719,0,0,,
Envico Supported Living LTD,1-9710388534,SCL,59 Commonwealth Avenue,,,Hayes,,UB3 2PN,Tel: 07861359677,No ratings yet Rate it yourself - /Services/careproviders/LeaveReview/DefaultView.aspx?id=1-9710388534,0,0,,
Grassy Meadow Court,1-18132846509,SCL,CCS Home Care Services,"Grassy Meadow Court, Grange Road",,Hayes,,UB3 2UF,Tel: 02085736712,No ratings yet Rate it yourself - /Services/careproviders/LeaveReview/DefaultView.aspx?id=1-18132846509,0,0,,
Hayes Cottage Nursing Home,1-110015991,SCL,Grange Road,,,London,,UB3 2RR,Tel: 020 8573 2052,3 ratings Rate it yourself - /Services/careproviders/LeaveReview/DefaultView.aspx?id=1-110015991,,,,
Avid Care Ltd,1-12572195033,SCL,460-466 Uxbridge Road,3.038 Uxbridge House,,Hayes,,UB4 0SD,,No ratings yet Rate it yourself - /Services/careproviders/LeaveReview/DefaultView.aspx?id=1-12572195033,0,0,,
Churchill Health Care (Ealing),1-13006092706,SCL,464 Uxbridge Road,,,Hayes,Middlesex,UB4 0SD,Tel: 02087589998,No ratings yet Rate it yourself - /Services/careproviders/LeaveReview/DefaultView.aspx?id=1-13006092706,0,0,,
Hillingdon,1-2421169871,SCL,"Uxbridge House, 460-469",Uxbridge Road,,Hayes,,UB4 0SD,Tel: 02085738838,No ratings yet Rate it yourself - /Services/careproviders/LeaveReview/DefaultView.aspx?id=1-2421169871,0,0,,
Bridgewater House,1-2698546877,SCL,"Ground Floor, Bridgewater House",866-868 Uxbridge Road,,Hayes,,UB4 0RR,Tel: 02079988180,No ratings yet Rate it yourself - /Services/careproviders/LeaveReview/DefaultView.aspx?id=1-2698546877,0,0,,
Drayton Village Care Centre,1-3511571857,SCL,1 Spring Promenade,,,West Drayton,Middlesex,UB7 9GL,Tel: 01895430955,2 ratings Rate it yourself - /Services/careproviders/LeaveReview/DefaultView.aspx?id=1-3511571857,,,,
Hanover Supported Living,1-2208482776,SCL,55 Hanover Circle,,,Hayes,Middlesex,UB3 2TL,Tel: 02036020450,No ratings yet Rate it yourself - /Services/careproviders/LeaveReview/DefaultView.aspx?id=1-2208482776,0,0,,
Scotts Road,1-2145877356,SCL,79A Scotts Road,,,Southall,Middlesex,UB2 5DF,Tel: 02036204639,No ratings yet Rate it yourself - /Services/careproviders/LeaveReview/DefaultView.aspx?id=1-2145877356,0,0,,
Uxbridge Road,1-9672527217,SCL,623 Uxbridge Road,,,Hayes,Middlesex,UB4 8HR,Tel: 02088480869,No ratings yet Rate it yourself - /Services/careproviders/LeaveReview/DefaultView.aspx?id=1-9672527217,0,0,,
Gledwood Care Homes,1-183566734,SCL,63 Gledwood Gardens,,,Hayes,Middlesex,UB4 0AU,Tel: 02085811488,No ratings yet Rate it yourself - /Services/careproviders/LeaveReview/DefaultView.aspx?id=1-183566734,0,0,,
Aston House Care Home,1-329236881,SCL,26 Angel Lane,,,Hayes,Middlesex,UB3 2QX,Tel: 02085691499,No ratings yet Rate it yourself - /Services/careproviders/LeaveReview/DefaultView.aspx?id=1-329236881,0,0,,
Micado Homes - Drayton Lodge,1-120609594,SCL,47 West Drayton Road,,,Uxbridge,Middlesex,UB8 3LB,Tel: 02087073803,No ratings yet Rate it yourself - /Services/careproviders/LeaveReview/DefaultView.aspx?id=1-120609594,0,0,,
Ashwood Care Centre,1-4122336825,SCL,1a Derwent Drive,,,London,,UB4 8DR,Tel: 020 8573 1313,No ratings yet Rate it yourself - /Services/careproviders/LeaveReview/DefaultView.aspx?id=1-4122336825,0,0,,
Infinity Care Services Limited,1-3850333552,SCL,32 Sussex Road,,,Southall,,UB2 5EQ,Tel: 02030923250,No ratings yet Rate it yourself - /Services/careproviders/LeaveReview/DefaultView.aspx?id=1-3850333552,0,0,,
Eeze Care London,1-11022465421,SCL,184 Beaconsfield Road,,,Southall,,UB1 1EA,Tel: 02085712809,2 ratings Rate it yourself - /Services/careproviders/LeaveReview/DefaultView.aspx?id=1-11022465421,,,,
4 Firs Drive,1-14306064460,SCL,4 Firs Drive,,,Hounslow,,TW5 9TD,Tel: 07730010324,No ratings yet Rate it yourself - /Services/careproviders/LeaveReview/DefaultView.aspx?id=1-14306064460,0,0,,
Park View Court,1-15198802632,SCL,Farrier Close,,,Uxbridge,,UB8 3XG,Tel: 01895277954,No ratings yet Rate it yourself - /Services/careproviders/LeaveReview/DefaultView.aspx?id=1-15198802632,0,0,,
Kingsley Court Care Home,1-2046973911,SCL,855 Uxbridge Road,,,Hayes,Middlesex,UB4 8HZ,Tel: 02085616681,1 rating Rate it yourself - /Services/careproviders/LeaveReview/DefaultView.aspx?id=1-2046973911,,,,
Hillingdon Shared Lives,1-135213915,SCL,3 Merrimans House,West Drayton Road,,Hillingdon,Middlesex,UB8 3JZ,Tel: 01895277025,No ratings yet Rate it yourself - /Services/careproviders/LeaveReview/DefaultView.aspx?id=1-135213915,0,0,,
Merrimans Respite Care Unit,1-135213974,SCL,3 Merrimans House,West Drayton Road,,Hillingdon,Middlesex,UB8 3JZ,Tel: 01895277584,No ratings yet Rate it yourself - /Services/careproviders/LeaveReview/DefaultView.aspx?id=1-135213974,0,0,,
Destiny Care Health Ltd,1-15912983817,SCL,2 Kings Road,,,West Drayton,,UB7 9EE,Tel: 01895347026,No ratings yet Rate it yourself - /Services/careproviders/LeaveReview/DefaultView.aspx?id=1-15912983817,0,0,,
Swanage Lodge,1-118080220,SCL,22-24 Swanage Waye,,,Hayes,Middlesex,UB4 0NY,Tel: 02085821616,No ratings yet Rate it yourself - /Services/careproviders/LeaveReview/DefaultView.aspx?id=1-118080220,0,0,,
Blandford Lodge,1-2861042045,SCL,4A Blandford Waye,,,Hayes,Middlesex,UB4 0PB,Tel: 02085730129,No ratings yet Rate it yourself - /Services/careproviders/LeaveReview/DefaultView.aspx?id=1-2861042045,0,0,,
Dominion Centre,1-450239400,SCL,112 The Green,,,Southall,Middlesex,UB2 4BQ,,2 ratings Rate it yourself - /Services/careproviders/LeaveReview/DefaultView.aspx?id=1-450239400,,,,
Sitara Haven,1-115690734,SCL,23 Hambrough Road,,,Southall,Middlesex,UB1 1HZ,Tel: 02088679590,No ratings yet Rate it yourself - /Services/careproviders/LeaveReview/DefaultView.aspx?id=1-115690734,0,0,,
Heathfield House,1-126402537,SCL,10 Heath Road,Hillingdon,,Uxbridge,Middlesex,UB10 0SL,Tel: 02085732981,No ratings yet Rate it yourself - /Services/careproviders/LeaveReview/DefaultView.aspx?id=1-126402537,0,0,,
Care Beside You Ltd,1-17591346163,SCL,First Floor,157 The Broadway,,Southall,,UB1 1LP,Tel: 02036896951,No ratings yet Rate it yourself - /Services/careproviders/LeaveReview/DefaultView.aspx?id=1-17591346163,0,0,,
London Borough of Ealing,1-15066065535,SCL,8-12,Lancaster Road,,Southall,,UB1 1NW,,No ratings yet Rate it yourself - /Services/careproviders/LeaveReview/DefaultView.aspx?id=1-15066065535,0,0,,
Albert Road,1-4119121384,SCL,66 Albert Road,,,West Drayton,Middlesex,UB7 8ES,Tel: 02037440144,No ratings yet Rate it yourself - /Services/careproviders/LeaveReview/DefaultView.aspx?id=1-4119121384,0,0,,
Salisbury Support 4 Autism,1-15833581616,SCL,"Suite 3, Liddall House","66 Albert Road, Yiewsley",,West Drayton,,UB7 8ES,Tel: 08003689433,No ratings yet Rate it yourself - /Services/careproviders/LeaveReview/DefaultView.aspx?id=1-15833581616,0,0,,
Lowdell Close,1-10970132725,SCL,186-188 Lowdell Close,Yiewsley,,West Drayton,Middlesex,UB7 8RA,Tel: 01895434697,No ratings yet Rate it yourself - /Services/careproviders/LeaveReview/DefaultView.aspx?id=1-10970132725,0,0,,
Forward Care,1-14375744618,SCL,58 Pield Heath Road,,,Uxbridge,,UB8 3NQ,Tel: 01895349655,1 rating Rate it yourself - /Services/careproviders/LeaveReview/DefaultView.aspx?id=1-14375744618,,,,
The Willows Nursing Home,1-135306607,SCL,31/35 Osterley Park Road,,,London,,UB2 4BN,Tel: 020 8574 1795,2 ratings Rate it yourself - /Services/careproviders/LeaveReview/DefaultView.aspx?id=1-135306607,,,,
Conrad Darare Ltd,1-14451815174,SCL,80 Larch Crescent,,,Hayes,,UB4 9DR,,No ratings yet Rate it yourself - /Services/careproviders/LeaveReview/DefaultView.aspx?id=1-14451815174,0,0,,
Caremark (Hillingdon),1-1034083748,SCL,6 Marlborough Parade,Uxbridge Road,,Uxbridge,Middlesex,UB10 0LR,Tel: 01895230430,No ratings yet Rate it yourself - /Services/careproviders/LeaveReview/DefaultView.aspx?id=1-1034083748,0,0,,
Pranam Care Centre,1-2093659452,SCL,49-53 Northcote Avenue,,,Southall,Middlesex,UB1 2AY,Tel: 02085749138,1 rating Rate it yourself - /Services/careproviders/LeaveReview/DefaultView.aspx?id=1-2093659452,,,,
Franklin House,1-1228095928,SCL,The Green,,,West Drayton,Middlesex,UB7 7PW,Tel: 01895452480,No ratings yet Rate it yourself - /Services/careproviders/LeaveReview/DefaultView.aspx?id=1-1228095928,0,0,,
Avant Homecare - Ealing,1-2528192228,SCL,Vista Business Centre,"6th Floor, Block B",,London,,UB1 2AU,Tel: 020 3805 0610,3 ratings Rate it yourself - /Services/careproviders/LeaveReview/DefaultView.aspx?id=1-2528192228,,,,
Hatton Grove,1-135213987,SCL,4 Hatton Grove,,,West Drayton,Middlesex,UB7 7AU,Tel: 01895556989,No ratings yet Rate it yourself - /Services/careproviders/LeaveReview/DefaultView.aspx?id=1-135213987,0,0,,
Imperial Lodge,1-362972767,SCL,268 Lansbury Drive,,,Hayes,Middlesex,UB4 8SN,Tel: 02085812510,No ratings yet Rate it yourself - /Services/careproviders/LeaveReview/DefaultView.aspx?id=1-362972767,0,0,,
"Unit 4, Bentinck Court",1-866812427,SCL,Bentinck Road,,,West Drayton,Middlesex,UB7 7RQ,Tel: 01895431675,No ratings yet Rate it yourself - /Services/careproviders/LeaveReview/DefaultView.aspx?id=1-866812427,0,0,,
CTRC CIC,1-1405004765,SCL,"Network House, 1 Bentinck Court",Bentinck Road,,West Drayton,Middlesex,UB7 7RQ,Tel: 01895440831,No ratings yet Rate it yourself - /Services/careproviders/LeaveReview/DefaultView.aspx?id=1-1405004765,0,0,,
The Burroughs,1-139859210,SCL,Mill Road,,,West Drayton,Middlesex,UB7 7EQ,Tel: 01895435610,No ratings yet Rate it yourself - /Services/careproviders/LeaveReview/DefaultView.aspx?id=1-139859210,0,0,,
Roshini Care Home,1-5555940030,SCL,25-26 Villiers Road,,,Southall,Middlesex,UB1 3BS,Tel: 02085743663,No ratings yet Rate it yourself - /Services/careproviders/LeaveReview/DefaultView.aspx?id=1-5555940030,0,0,,
Objective Care Limited,1-713334175,SCL,77 West Avenue,,,Southall,Middlesex,UB1 2AR,Tel: 02085719855,No ratings yet Rate it yourself - /Services/careproviders/LeaveReview/DefaultView.aspx?id=1-713334175,0,0,,
Priory Supported Living London & Home Counties,1-3746259064,SCL,"GHL Aviation House Ltd, The Lodge & Annex","Harmondsworth Lane, Harmondsworth",,West Drayton,,UB7 0LQ,Tel: 07885881040,No ratings yet Rate it yourself - /Services/careproviders/LeaveReview/DefaultView.aspx?id=1-3746259064,0,0,,
Martin House,1-8367088873,SCL,1 Swift Road,,,Southall,Middlesex,UB2 4RP,Tel: 02039885050,No ratings yet Rate it yourself - /Services/careproviders/LeaveReview/DefaultView.aspx?id=1-8367088873,0,0,,
Shackleton Medical Centre,1-2977346964,SCL,Shackleton Road,,,Southall,Middlesex,UB1 2QH,Tel: 02030061840,No ratings yet Rate it yourself - /Services/careproviders/LeaveReview/DefaultView.aspx?id=1-2977346964,0,0,,
Fairlawn First Floor Office,1-7974718723,SCL,Fairlawn,High Street,,Southall,,UB1 3HB,Tel: 02038024114,No ratings yet Rate it yourself - /Services/careproviders/LeaveReview/DefaultView.aspx?id=1-7974718723,0,0,,
The Peaches Healthcare Limited,1-4897944586,SCL,339 Vicarage Farm Road,,,Hounslow,,TW5 0DZ,Tel: 02079987950,No ratings yet Rate it yourself - /Services/careproviders/LeaveReview/DefaultView.aspx?id=1-4897944586,0,0,,
Southall Business Centre,1-13502451330,SCL,Town Hall,High Street,,Southall,Middlesex,UB1 3HA,,No ratings yet Rate it yourself - /Services/careproviders/LeaveReview/DefaultView.aspx?id=1-13502451330,0,0,,
Jemis Care,1-8570944950,SCL,1  High Street,"Unit F8, First Floor",,Southall,,UB1 3HA,,No ratings yet Rate it yourself - /Services/careproviders/LeaveReview/DefaultView.aspx?id=1-8570944950,0,0,,
Extreme Care Services Limited,1-14291773242,SCL,"Unit G9, 1 High Street",,,Southall,,UB1 3HA,Tel: 02081769389,No ratings yet Rate it yourself - /Services/careproviders/LeaveReview/DefaultView.aspx?id=1-14291773242,0,0,,
Colham Road,1-135214001,SCL,3 Colham Road,,,Uxbridge,,UB8 3UR,Tel: 01895556713,1 rating Rate it yourself - /Services/careproviders/LeaveReview/DefaultView.aspx?id=1-135214001,,,,
Alvina Lodge,1-2909310199,SCL,22 Hoppner Road,,,Hayes,Middlesex,UB4 8PY,Tel: 02085815760,No ratings yet Rate it yourself - /Services/careproviders/LeaveReview/DefaultView.aspx?id=1-2909310199,0,0,,
Geneva Quality Care Ltd,1-14855956265,SCL,82 Wraysbury Drive,Yiewsley,,West Drayton,,UB7 7FL,Tel: 07539478653,No ratings yet Rate it yourself - /Services/careproviders/LeaveReview/DefaultView.aspx?id=1-14855956265,0,0,,
Parkfield House Nursing Home,1-146799046,SCL,Charville Lane West,,,London,,UB10 0BY,Tel: 01895 811199,No ratings yet Rate it yourself - /Services/careproviders/LeaveReview/DefaultView.aspx?id=1-146799046,0,0,,
Heston Care Services Ltd,1-2851013974,SCL,16 Walnut Tree Road,,,Hounslow,Middlesex,TW5 0LR,Tel: 02085817027,No ratings yet Rate it yourself - /Services/careproviders/LeaveReview/DefaultView.aspx?id=1-2851013974,0,0,,
Procare Team Ltd,1-14185571909,SCL,Vista Business Centre,50 Salisbury Road,,Hounslow,Middlesex,TW4 6JQ,Tel: 02038839058,No ratings yet Rate it yourself - /Services/careproviders/LeaveReview/DefaultView.aspx?id=1-14185571909,0,0,,
Immaculate Care Limited,1-9861340170,SCL,50 Salisbury Road,,,Hounslow,Middlesex,TW4 6JQ,Tel: 07856857807,1 rating Rate it yourself - /Services/careproviders/LeaveReview/DefaultView.aspx?id=1-9861340170,,,,
Firex Domiciliary Care Limited,1-14634271723,SCL,Vista Business Centre,50 Salisbury Road,,Hounslow,Middlesex,TW4 6JQ,Tel: 07555649019,No ratings yet Rate it yourself - /Services/careproviders/LeaveReview/DefaultView.aspx?id=1-14634271723,0,0,,
Angelic Health Ltd,1-14589226000,SCL,Vista Centre,50 Salisbury Road,,Hounslow,,TW4 6JQ,,No ratings yet Rate it yourself - /Services/careproviders/LeaveReview/DefaultView.aspx?id=1-14589226000,0,0,,
Passion Recruitment Agency,1-5613933002,SCL,Vista Business Centre,50 Salisbury Road,,Hounslow,Middlesex,TW4 6JQ,Tel: 03330115817,No ratings yet Rate it yourself - /Services/careproviders/LeaveReview/DefaultView.aspx?id=1-5613933002,0,0,,
Vector Care Supported Living,1-15776512461,SCL,Vista Office Centre,50 Salisbury Road,,Hounslow,Middlesex,TW4 6JQ,Tel: 07460840032,No ratings yet Rate it yourself - /Services/careproviders/LeaveReview/DefaultView.aspx?id=1-15776512461,0,0,,
Eleada Care Services,1-14484222050,SCL,"A1:41, Vista Business Centre",50 Salisbury Road,,Hounslow,,TW4 6JQ,Tel: 02085380100,No ratings yet Rate it yourself - /Services/careproviders/LeaveReview/DefaultView.aspx?id=1-14484222050,0,0,,
Avant Homecare - Hillingdon,1-2936868235,SCL,Vista Centre,6th Floor,,London,,TW4 6JQ,Tel: 020 3805 0610,6 ratings Rate it yourself - /Services/careproviders/LeaveReview/DefaultView.aspx?id=1-2936868235,,,,
"Medinova Healthcare Ltd,",1-12568187321,SCL,B2-14 Vista Centre,50 Salisbury Road,,Hounslow,,TW4 6JQ,Tel: 02035398638,No ratings yet Rate it yourself - /Services/careproviders/LeaveReview/DefaultView.aspx?id=1-12568187321,0,0,,
"Kheyr Healthcare Ltd - The Vista Centre, Suite A3:08B, 3rd Floor, 50 Salisbury Road",1-18444455609,SCL,"The Vista Centre, Suite A3:08B, 3rd Floor",50 Salisbury Road,,Hounslow,,TW4 6JQ,Tel: 03330508929,No ratings yet Rate it yourself - /Services/careproviders/LeaveReview/DefaultView.aspx?id=1-18444455609,0,0,,
Avant Homecare - Hounslow,1-2528221468,SCL,Vista Business Centre,"6th Floor, Block B",,London,,TW4 6JQ,Tel: 020 3805 0610,6 ratings Rate it yourself - /Services/careproviders/LeaveReview/DefaultView.aspx?id=1-2528221468,,,,
Schreiber Care UK - London,1-13579832179,SCL,Vista Business Centre,50 Salisbury Road,,Hounslow,Middlesex,TW4 6JQ,Tel: 02071014143,No ratings yet Rate it yourself - /Services/careproviders/LeaveReview/DefaultView.aspx?id=1-13579832179,0,0,,
Visiting Angels - South Middlesex,1-10803041642,SCL,"Vista Centre,Suite 2A, Floor 6, Block B",50 Salisbury Road,,Hounslow,,TW4 6JQ,Tel: 02031435056,No ratings yet Rate it yourself - /Services/careproviders/LeaveReview/DefaultView.aspx?id=1-10803041642,0,0,,
Silverdale Care Limited,1-6447271635,SCL,"Suite 2A, 10 Vista Office Centre",50 Salisbury Road,,Hounslow,,TW4 6JQ,Tel: 07951999553,No ratings yet Rate it yourself - /Services/careproviders/LeaveReview/DefaultView.aspx?id=1-6447271635,0,0,,
Jeremys Carebuddies Limited,1-3698739561,SCL,Vista Office Centre,50 Salisbury Road,,Hounslow,Middlesex,TW4 6JQ,Tel: 02085380127,No ratings yet Rate it yourself - /Services/careproviders/LeaveReview/DefaultView.aspx?id=1-3698739561,0,0,,
Goodluck Care Limited - Hounslow,1-2703145341,SCL,Vista Business Centre,50 Salisbury Road,,Hounslow,Middlesex,TW4 6JQ,Tel: 020 3011 2119,No ratings yet Rate it yourself - /Services/careproviders/LeaveReview/DefaultView.aspx?id=1-2703145341,0,0,,
Care Plus More,1-4576665555,SCL,Care Plus More LTD,"HEAD OFFICE, A1 42, The Vista Centre",,Hounslow,Middlesex,TW4 6JQ,Tel: 07956054109,No ratings yet Rate it yourself - /Services/careproviders/LeaveReview/DefaultView.aspx?id=1-4576665555,0,0,,
Vista Business Centre,1-2778133165,SCL,50 Salisbury Road,,,Hounslow,Middlesex,TW4 6JQ,Tel: 02071835355,No ratings yet Rate it yourself - /Services/careproviders/LeaveReview/DefaultView.aspx?id=1-2778133165,0,0,,
The Mayfair,1-7413157450,SCL,139 Vicarage Farm Road,,,Hounslow,Middlesex,TW5 0AA,,No ratings yet Rate it yourself - /Services/careproviders/LeaveReview/DefaultView.aspx?id=1-7413157450,0,0,,
Vicarage Farm Nursing Home,1-495374249,SCL,139 Vicarage Farm Road,,,Hounslow,Middlesex,TW5 0AA,Tel: 02085774000,No ratings yet Rate it yourself - /Services/careproviders/LeaveReview/DefaultView.aspx?id=1-495374249,0,0,,
Marian House Care Home,1-6706295842,SCL,100 Kingston Lane,,,Uxbridge,Middlesex,UB8 3PW,Tel: 01895253299,No ratings yet Rate it yourself - /Services/careproviders/LeaveReview/DefaultView.aspx?id=1-6706295842,0,0,,