Organisation Name,NACS Code,Organisation Type,Address1,Address2,Address3,Address4,Address5,PostCode,Telephone Number,NHS.UK users rating,Value  (NHS.UK users rating),Banding Classification  (NHS.UK users rating),Car parking (Is there car parking at this organisation?),Disabled access (Disabled access)
Your Life (Royston),1-310598811,SCL,Goodes Court,Baldock Road,,Royston,Hertfordshire,SG8 5FF,Tel: 01763256810,No ratings yet Rate it yourself - /Services/careproviders/LeaveReview/DefaultView.aspx?id=1-310598811,0,0,,
Richard Cox House,1-118542165,SCL,Dog Kennel Lane,,,Royston,Hertfordshire,SG8 7AB,Tel: 01763249111,No ratings yet Rate it yourself - /Services/careproviders/LeaveReview/DefaultView.aspx?id=1-118542165,0,0,,
St George's Nursing Home,1-13082303046,SCL,42 Kneesworth Street,,,Royston,Hertfordshire,SG8 5AQ,Tel: 01763242243,No ratings yet Rate it yourself - /Services/careproviders/LeaveReview/DefaultView.aspx?id=1-13082303046,0,0,,
Wholehearted Home Care,1-14500136449,SCL,6 Pightle Close,,,Royston,,SG8 5AZ,Tel: 07365068797,No ratings yet Rate it yourself - /Services/careproviders/LeaveReview/DefaultView.aspx?id=1-14500136449,0,0,,
Hardy Drive,1-119188078,SCL,23 Hardy Drive,,,Royston,Hertfordshire,SG8 5LZ,Tel: 01763243684,No ratings yet Rate it yourself - /Services/careproviders/LeaveReview/DefaultView.aspx?id=1-119188078,0,0,,
Exclusive Care Ltd,1-6510507259,SCL,"Suite F, 15 Royston Road",,,Baldock,,SG7 6NW,Tel: 01438310108,No ratings yet Rate it yourself - /Services/careproviders/LeaveReview/DefaultView.aspx?id=1-6510507259,0,0,,
Providence Court,1-118542149,SCL,Providence Way,,,Baldock,Hertfordshire,SG7 6TT,Tel: 01462490870,No ratings yet Rate it yourself - /Services/careproviders/LeaveReview/DefaultView.aspx?id=1-118542149,0,0,,
YourLife (Baldock),1-17974116889,SCL,Norton Place,74 Icknield Way,,Baldock,,SG7 5AN,,No ratings yet Rate it yourself - /Services/careproviders/LeaveReview/DefaultView.aspx?id=1-17974116889,0,0,,
ICRIT Healthcare Limited (Herts),1-15102913711,SCL,"Office 9, Units 11 -12,","Baldock Industrial Estate, London Road",,Baldock,,SG7 6NG,Tel: 07943739379,No ratings yet Rate it yourself - /Services/careproviders/LeaveReview/DefaultView.aspx?id=1-15102913711,0,0,,
Osbourne Court,1-16524203997,SCL,Park Drive,,,Baldock,Hertfordshire,SG7 6EN,Tel: 01462896966,No ratings yet Rate it yourself - /Services/careproviders/LeaveReview/DefaultView.aspx?id=1-16524203997,0,0,,
Baldock - The Rowans,1-10042502639,SCL,2 The Rowans,,,Baldock,,SG7 6HJ,Tel: 01462490634,No ratings yet Rate it yourself - /Services/careproviders/LeaveReview/DefaultView.aspx?id=1-10042502639,0,0,,
Margaret House,1-132000034,SCL,Church End,Barley,,Royston,Cambridgeshire,SG8 8JS,Tel: 01763 848272,No ratings yet Rate it yourself - /Services/careproviders/LeaveReview/DefaultView.aspx?id=1-132000034,0,0,,
Burleigh House Residential Home,1-125098165,SCL,Burleigh House,41 Letchworth Road,,Baldock,Hertfordshire,SG7 6AA,Tel: 01462 893216,No ratings yet Rate it yourself - /Services/careproviders/LeaveReview/DefaultView.aspx?id=1-125098165,0,0,,
Buntingford,1-1829473970,SCL,62 Vicarage Road,,,Buntingford,Hertfordshire,SG9 9BA,Tel: 01763273191,No ratings yet Rate it yourself - /Services/careproviders/LeaveReview/DefaultView.aspx?id=1-1829473970,0,0,,
DX Caring Services,1-9676435907,SCL,"608 Jubilee Trading Estate, Jubilee Road",,,Letchworth Garden City,,SG6 1NE,Tel: 01462677770,No ratings yet Rate it yourself - /Services/careproviders/LeaveReview/DefaultView.aspx?id=1-9676435907,0,0,,
Hales Group Limited - Letchworth,1-1209416896,SCL,608 Jubilee Trading Estate,"Jubilee Road, Letchworth",,Letchworth Garden City,,SG6 1NE,Tel: 01438765715,No ratings yet Rate it yourself - /Services/careproviders/LeaveReview/DefaultView.aspx?id=1-1209416896,0,0,,
Holistic Healthcare Hertfordshire,1-18949308982,SCL,608 Jubilee Trading Estate,Jubilee Road,,Letchworth Garden City,,SG6 1NE,Tel: 07838702816,No ratings yet Rate it yourself - /Services/careproviders/LeaveReview/DefaultView.aspx?id=1-18949308982,0,0,,
Trembaths,1-117976837,SCL,Talbot Way,,,Letchworth Garden City,Hertfordshire,SG6 1UA,Tel: 01462481694,No ratings yet Rate it yourself - /Services/careproviders/LeaveReview/DefaultView.aspx?id=1-117976837,0,0,,
Melbourn Springs Care Home,1-8740102925,SCL,Hyacinth Drive,Melbourn,,Royston,,SG8 6FY,Tel: 01763261974,2 ratings Rate it yourself - /Services/careproviders/LeaveReview/DefaultView.aspx?id=1-8740102925,,,,
Bluebird Care (Stevenage & North Herts),1-2929389277,SCL,"Venture House, Office 6",Fifth Avenue,,Letchworth Garden City,Hertfordshire,SG6 2HW,Tel: 01462676555,No ratings yet Rate it yourself - /Services/careproviders/LeaveReview/DefaultView.aspx?id=1-2929389277,0,0,,
Home Instead Senior Care (Stevenage & North Herts),1-2371987179,SCL,Venture House,Fifth Avenue,,Letchworth Garden City,Hertfordshire,SG6 2HW,Tel: 01462 600462,No ratings yet Rate it yourself - /Services/careproviders/LeaveReview/DefaultView.aspx?id=1-2371987179,0,0,,
Southwell Court,1-6825580794,SCL,Hinkins Close,Melbourn,,Royston,Cambridgeshire,SG8 6JL,Tel: 01763750006,No ratings yet Rate it yourself - /Services/careproviders/LeaveReview/DefaultView.aspx?id=1-6825580794,0,0,,
CHS Homecare (Domiciliary Care Agency),1-123050589,SCL,Moorlands Court,The Moor,,Melbourn,Hertfordshire,SG8 6FH,Tel: 01763260564,No ratings yet Rate it yourself - /Services/careproviders/LeaveReview/DefaultView.aspx?id=1-123050589,0,0,,
Multi-Care Community Services North Hertfordshire Ltd,1-12586250040,SCL,Devonshire Business Centre,Works Road,,Letchworth Garden City,Hertfordshire,SG6 1GJ,Tel: 01462488225,No ratings yet Rate it yourself - /Services/careproviders/LeaveReview/DefaultView.aspx?id=1-12586250040,0,0,,
Hand in Hands,1-1724411627,SCL,"Unit 5, Devonshire Business Centre",Works Road,,Letchworth,Hertfordshire,SG6 1GJ,Tel: 01462222400,No ratings yet Rate it yourself - /Services/careproviders/LeaveReview/DefaultView.aspx?id=1-1724411627,0,0,,
Compassion PLUS Healthcare,1-5937564351,SCL,Devonshire Business Centre,Works Road,,Letchworth Garden City,Hertfordshire,SG6 1GJ,Tel: 01462416101,No ratings yet Rate it yourself - /Services/careproviders/LeaveReview/DefaultView.aspx?id=1-5937564351,0,0,,
Abacus Care & Support,1-8809577412,SCL,"Head Office, Devonshire Business Centre",Works Road,,Letchworth Garden City,,SG6 1GJ,Tel: 02071001680,No ratings yet Rate it yourself - /Services/careproviders/LeaveReview/DefaultView.aspx?id=1-8809577412,0,0,,
The Doting Carers Ltd,1-12154814465,SCL,Devonshire Business Centre,Works Road,,Letchworth Garden City,Hertfordshire,SG6 1GJ,Tel: 01462488215,1 rating Rate it yourself - /Services/careproviders/LeaveReview/DefaultView.aspx?id=1-12154814465,,,,
Bramley Avenue,1-2964143860,SCL,73 Bramley Avenue,Melbourn,,Royston,Hertfordshire,SG8 6HG,Tel: 01763261682,No ratings yet Rate it yourself - /Services/careproviders/LeaveReview/DefaultView.aspx?id=1-2964143860,0,0,,
Maycroft Care Home,1-393307254,SCL,73 High Street,Meldreth,,Royston,Cambridgeshire,SG8 6LB,Tel: 01763260217,No ratings yet Rate it yourself - /Services/careproviders/LeaveReview/DefaultView.aspx?id=1-393307254,0,0,,
Lannock Manor Mental Health Ltd,1-2432492683,SCL,Lannock Manor,Hitchin Road,,Hitchin,Hertfordshire,SG4 7EE,Tel: 01462 790850,No ratings yet Rate it yourself - /Services/careproviders/LeaveReview/DefaultView.aspx?id=1-2432492683,0,0,,
Aurora Orchard Manor Transition Service,1-17882727358,SCL,Manor Road,Meldreth,,Royston,Hertfordshire,SG8 6LG,Tel: 01763268000,No ratings yet Rate it yourself - /Services/careproviders/LeaveReview/DefaultView.aspx?id=1-17882727358,0,0,,
Caremark (North Herts & Stevenage),1-708980096,SCL,A(2) Arden Press House,Arden Press Way,,Letchworth Garden City,Hertfordshire,SG6 1LH,Tel: 01462708714,No ratings yet Rate it yourself - /Services/careproviders/LeaveReview/DefaultView.aspx?id=1-708980096,0,0,,
Garden City Court,1-2238558165,SCL,Whiteway,,,Letchworth Garden City,Hertfordshire,SG6 2PP,Tel: 01462473100,No ratings yet Rate it yourself - /Services/careproviders/LeaveReview/DefaultView.aspx?id=1-2238558165,0,0,,
The White House Care Home,1-14239622698,SCL,Gillison Close,,,Letchworth Garden City,Hertfordshire,SG6 1QL,Tel: 01462533777,No ratings yet Rate it yourself - /Services/careproviders/LeaveReview/DefaultView.aspx?id=1-14239622698,0,0,,
Turning Point - Brickfields Cottage,1-132794758,SCL,Hare Street Road,,,Buntingford,Hertfordshire,SG9 0AB,Tel: 01763289230,No ratings yet Rate it yourself - /Services/careproviders/LeaveReview/DefaultView.aspx?id=1-132794758,0,0,,
Windmill Lodge Ltd,1-11856580467,SCL,"2 Windmill Hill,",London Road,,Buntingford,,SG9 9JP,Tel: 01763273935,No ratings yet Rate it yourself - /Services/careproviders/LeaveReview/DefaultView.aspx?id=1-11856580467,0,0,,
Layston Grove Care Home,1-13693158947,SCL,Keen Avenue,,,Buntingford,Hertfordshire,SG9 9SU,Tel: 01763274327,No ratings yet Rate it yourself - /Services/careproviders/LeaveReview/DefaultView.aspx?id=1-13693158947,0,0,,
Baycroft Fairfield,1-17708769137,SCL,Baycroft Fairfield,"Hitchin Road, Fairfield",,Hitchin,,SG5 4SW,Tel: 02084214190,No ratings yet Rate it yourself - /Services/careproviders/LeaveReview/DefaultView.aspx?id=1-17708769137,0,0,,
Helping Hands Letchworth,1-6903991121,SCL,9,Leys Avenue,,Letchworth Garden City,,SG6 3EA,Tel: 01462530924,No ratings yet Rate it yourself - /Services/careproviders/LeaveReview/DefaultView.aspx?id=1-6903991121,0,0,,
St Catherine's Nursing Home,1-115044576,SCL,Spring Road,,,Letchworth Garden City,Hertfordshire,SG6 3PR,Tel: 01462 678888,No ratings yet Rate it yourself - /Services/careproviders/LeaveReview/DefaultView.aspx?id=1-115044576,0,0,,
Guysfield Residential Home,1-128579475,SCL,Willian Road,Willian,,Letchworth Garden City,Hertfordshire,SG6 2AB,Tel: 080 8223 5509,No ratings yet Rate it yourself - /Services/careproviders/LeaveReview/DefaultView.aspx?id=1-128579475,0,0,,
Avenues Healthcare Ltd,1-12363025954,SCL,31 Finbracks,,,Stevenage,,SG1 6HB,Tel: 07555775206,No ratings yet Rate it yourself - /Services/careproviders/LeaveReview/DefaultView.aspx?id=1-12363025954,0,0,,
Chase House Limited,1-141541186,SCL,House Lane,,,Arlesey,Bedfordshire,SG15 6YA,Tel: 01462731276,1 rating Rate it yourself - /Services/careproviders/LeaveReview/DefaultView.aspx?id=1-141541186,,,,
Stevenage,1-11295712832,SCL,27 Brimstone Drive,,,Stevenage,,SG1 4FX,Tel: 07919382837,No ratings yet Rate it yourself - /Services/careproviders/LeaveReview/DefaultView.aspx?id=1-11295712832,0,0,,
Lily Healthcare & Supported Living Limited,1-14567398596,SCL,55 Manchester Close,,,Stevenage,,SG1 4TQ,Tel: 07713912907,No ratings yet Rate it yourself - /Services/careproviders/LeaveReview/DefaultView.aspx?id=1-14567398596,0,0,,
Halcyon Days,1-3616698021,SCL,The Old Rectory,Church Lane,,Hitchin,Hertfordshire,SG4 7LU,Tel: 01438 315588,No ratings yet Rate it yourself - /Services/careproviders/LeaveReview/DefaultView.aspx?id=1-3616698021,0,0,,
Mantles Court,1-11910770257,SCL,115 London Road,,,Biggleswade,,SG18 8EF,Tel: 01767304701,No ratings yet Rate it yourself - /Services/careproviders/LeaveReview/DefaultView.aspx?id=1-11910770257,0,0,,
Riversands Healthcare Ltd,1-15927260955,SCL,34 High Street,Sutton,,Sandy,,SG19 2NE,Tel: 01767835365,No ratings yet Rate it yourself - /Services/careproviders/LeaveReview/DefaultView.aspx?id=1-15927260955,0,0,,
GJU Services Limited,1-9828547712,SCL,79 Sefton Road,,,Stevenage,,SG1 5RL,Tel: 02080902741,No ratings yet Rate it yourself - /Services/careproviders/LeaveReview/DefaultView.aspx?id=1-9828547712,0,0,,
Penrose Court,1-5810948543,SCL,Delius Road,,,Biggleswade,,SG18 8UA,Tel: 01767777000,No ratings yet Rate it yourself - /Services/careproviders/LeaveReview/DefaultView.aspx?id=1-5810948543,0,0,,
HF Trust - Hollycroft,1-120702231,SCL,90 Church Street,,,Langford,Bedfordshire,SG18 9QA,Tel: 01462701273,No ratings yet Rate it yourself - /Services/careproviders/LeaveReview/DefaultView.aspx?id=1-120702231,0,0,,
Martins House,1-3616995796,SCL,Jessop Road,Pin Green,,Stevenage,Hertfordshire,SG1 5LL,Tel: 01438 351056,No ratings yet Rate it yourself - /Services/careproviders/LeaveReview/DefaultView.aspx?id=1-3616995796,0,0,,
Wisden Court,1-131482054,SCL,Wisden Road,,,Stevenage,Hertfordshire,SG1 5JD,Tel: 01438354933,No ratings yet Rate it yourself - /Services/careproviders/LeaveReview/DefaultView.aspx?id=1-131482054,0,0,,
The Limes Care Home,1-14935070064,SCL,85 High Street,,,Henlow,Bedfordshire,SG16 6AB,Tel: 01462811028,No ratings yet Rate it yourself - /Services/careproviders/LeaveReview/DefaultView.aspx?id=1-14935070064,0,0,,
Sagecare (Biggleswade),1-113531639,SCL,"Ground Floor Office, 1 Connections House",Station Road,,Biggleswade,,SG18 8AL,Tel: 01767317311,No ratings yet Rate it yourself - /Services/careproviders/LeaveReview/DefaultView.aspx?id=1-113531639,0,0,,
2 Crab Lane,1-13936924815,SCL,2 Crab Lane,,,Biggleswade,,SG18 0LN,Tel: 07971106629,No ratings yet Rate it yourself - /Services/careproviders/LeaveReview/DefaultView.aspx?id=1-13936924815,0,0,,
Potton House Care Home,1-137524320,SCL,Potton Road,,,Biggleswade,Bedfordshire,SG18 0EL,Tel: 01767 317289,No ratings yet Rate it yourself - /Services/careproviders/LeaveReview/DefaultView.aspx?id=1-137524320,0,0,,
Care 4 You Direct Limited,1-11092209660,SCL,"Wicked House, Office 2",56 Wilbury Way,,Hitchin,,SG4 0TP,Tel: 01462539497,No ratings yet Rate it yourself - /Services/careproviders/LeaveReview/DefaultView.aspx?id=1-11092209660,0,0,,
Laniwyn Care Services Ltd (Homecare),1-4389856886,SCL,54 Wilbury Way,,,Hitchin,Hertfordshire,SG4 0TP,Tel: 074 9626 5471,No ratings yet Rate it yourself - /Services/careproviders/LeaveReview/DefaultView.aspx?id=1-4389856886,0,0,,
Domcare24 Ltd,1-14716040826,SCL,"Suite 7, 34-35  Wilbury Way,",Intech House,,Hitchin,,SG4 0TP,,No ratings yet Rate it yourself - /Services/careproviders/LeaveReview/DefaultView.aspx?id=1-14716040826,0,0,,
Pinelodge Care Home,1-200144942,SCL,Graveley Road,,,Stevenage,Hertfordshire,SG1 4YS,Tel: 01438721417,3 ratings Rate it yourself - /Services/careproviders/LeaveReview/DefaultView.aspx?id=1-200144942,,,,
Lead Care,1-3878200753,SCL,"10 A, B Knowl Piece Business Centre",Wilbury Way,,Hitchin,,SG4 0TY,Tel: 01462453332,1 rating Rate it yourself - /Services/careproviders/LeaveReview/DefaultView.aspx?id=1-3878200753,,,,
Crossroads Care Hertfordshire North,1-140103335,SCL,"Suite 5, Intech House",Wilbury Way,,Hitchin,Hertfordshire,SG4 0TW,Tel: 01462 455578,No ratings yet Rate it yourself - /Services/careproviders/LeaveReview/DefaultView.aspx?id=1-140103335,0,0,,
Empress Social Care,1-9293460558,SCL,"Intech House, Suite 3B",Wilbury Way,,Hitchin,,SG4 0TW,Tel: 08000096432,No ratings yet Rate it yourself - /Services/careproviders/LeaveReview/DefaultView.aspx?id=1-9293460558,0,0,,
Knightingles Healthcare Bedfordshire Limited,1-4606227639,SCL,Bridge House,27-29 High Street,,Biggleswade,Bedfordshire,SG18 0JE,Tel: 07717064436,1 rating Rate it yourself - /Services/careproviders/LeaveReview/DefaultView.aspx?id=1-4606227639,,,,
LSR Care Recruitment Ltd,1-15886145809,SCL,"Suite 1, Second Floor, Alexander House",40A Wilbury Way,,Hitchin,,SG4 0AP,Tel: 01462337112,No ratings yet Rate it yourself - /Services/careproviders/LeaveReview/DefaultView.aspx?id=1-15886145809,0,0,,
Carer Centricity Ltd T/A Visiting Angels North Hertfordshire,1-16863056830,SCL,"Thrifty House (Suite Y), First Floor Offices,","Unit 4 Bilton Road, Cadwell Lane,",,Hitchin,,SG4 0SB,Tel: 07872333276,No ratings yet Rate it yourself - /Services/careproviders/LeaveReview/DefaultView.aspx?id=1-16863056830,0,0,,
Beaumont Park Nursing and Residential Home,1-121919707,SCL,Shortmead Street,,,Biggleswade,Bedfordshire,SG18 0AT,Tel: 01767313131,1 rating Rate it yourself - /Services/careproviders/LeaveReview/DefaultView.aspx?id=1-121919707,,,,
Wymondley Nursing & Residential Care Home,1-110500111,SCL,Stevenage Road,Little Wymondley,,Hitchin,Hertfordshire,SG4 7HT,Tel: 01438312434,No ratings yet Rate it yourself - /Services/careproviders/LeaveReview/DefaultView.aspx?id=1-110500111,0,0,,
Jubilee Court,1-436913248,SCL,Hayward Close,Lonsdale Road,,Stevenage,Hertfordshire,SG1 5BS,Tel: 01438730000,No ratings yet Rate it yourself - /Services/careproviders/LeaveReview/DefaultView.aspx?id=1-436913248,0,0,,
HF Trust - Bedfordshire & Cambridgeshire DCA,1-773370856,SCL,72a Broad Street,Clifton,,Shefford,Bedfordshire,SG17 5RP,Tel: 01462817235,No ratings yet Rate it yourself - /Services/careproviders/LeaveReview/DefaultView.aspx?id=1-773370856,0,0,,
HF Trust - Clifton View,1-659695293,SCL,72A Broad Street,Clifton,,Shefford,Bedfordshire,SG17 5RP,,No ratings yet Rate it yourself - /Services/careproviders/LeaveReview/DefaultView.aspx?id=1-659695293,0,0,,
Benslow Nursing Home,1-108391794,SCL,Benslow Rise,,,Hitchin,Hertfordshire,SG4 9QY,Tel: 01462459773,No ratings yet Rate it yourself - /Services/careproviders/LeaveReview/DefaultView.aspx?id=1-108391794,0,0,,
Libury Hall,1-1114048863,SCL,Great Munden,,,Ware,Hertfordshire,SG11 1JD,Tel: 01920438224,No ratings yet Rate it yourself - /Services/careproviders/LeaveReview/DefaultView.aspx?id=1-1114048863,0,0,,
Anchusa Care,1-3054977719,SCL,Suite D Gloverside,23-25 Bury Mead Road,,Hitchin,,SG5 1RT,Tel: 01462338343,1 rating Rate it yourself - /Services/careproviders/LeaveReview/DefaultView.aspx?id=1-3054977719,,,,
Walkern Lodge,1-4053879325,SCL,14A Walkern Road,,,Stevenage,Hertfordshire,SG1 3QX,Tel: 01438749301,No ratings yet Rate it yourself - /Services/careproviders/LeaveReview/DefaultView.aspx?id=1-4053879325,0,0,,
Joy Caring Services Limited,1-2057631160,SCL,"Suite B, Mindenhall Court","R/017 High Street, Old Town",,Stevenage,Hertfordshire,SG1 3BG,Tel: 01438311704,1 rating Rate it yourself - /Services/careproviders/LeaveReview/DefaultView.aspx?id=1-2057631160,,,,
Care Fully Limited,1-2276468236,SCL,11 Broadview,,,Stevenage,Hertfordshire,SG1 3TT,Tel: 01438722665,No ratings yet Rate it yourself - /Services/careproviders/LeaveReview/DefaultView.aspx?id=1-2276468236,0,0,,
Active Support Clifton Ltd,1-12082875382,SCL,Cedar Court,"Church Street, Clifton",,Shefford,,SG17 5ET,,No ratings yet Rate it yourself - /Services/careproviders/LeaveReview/DefaultView.aspx?id=1-12082875382,0,0,,
Julians House,1-1080115563,SCL,6 Julians Road,,,Stevenage,Hertfordshire,SG1 3ES,Tel: 01438751366,No ratings yet Rate it yourself - /Services/careproviders/LeaveReview/DefaultView.aspx?id=1-1080115563,0,0,,
Pemdale,1-252073648,SCL,26A Nursery Close,,,Potton,Bedfordshire,SG19 2QE,Tel: 01767262515,No ratings yet Rate it yourself - /Services/careproviders/LeaveReview/DefaultView.aspx?id=1-252073648,0,0,,
Highbury Rise,1-108422511,SCL,6 Highbury Road,,,Hitchin,Hertfordshire,SG4 9RW,Tel: 01462437495,No ratings yet Rate it yourself - /Services/careproviders/LeaveReview/DefaultView.aspx?id=1-108422511,0,0,,
Eagles Wings24 Care,1-19060267389,SCL,47 Furzedown,,,Stevenage,,SG2 9EL,Tel: 07711810441,No ratings yet Rate it yourself - /Services/careproviders/LeaveReview/DefaultView.aspx?id=1-19060267389,0,0,,
Woodlands View Care Home,1-3154638209,SCL,Magpie Crescent,,,Stevenage,Hertfordshire,SG2 9RZ,Tel: 01438740230,No ratings yet Rate it yourself - /Services/careproviders/LeaveReview/DefaultView.aspx?id=1-3154638209,0,0,,
17 Walsworth Road,1-129460371,SCL,Hitchin,,,Hitchin,Hertfordshire,SG4 9SP,Tel: 01462420019,No ratings yet Rate it yourself - /Services/careproviders/LeaveReview/DefaultView.aspx?id=1-129460371,0,0,,
Knightingles Healthcare Limited,1-4606227581,SCL,2a,Letchmore Road,,Stevenage,,SG1 3HU,Tel: 07717064436,No ratings yet Rate it yourself - /Services/careproviders/LeaveReview/DefaultView.aspx?id=1-4606227581,0,0,,
Potton View,1-5683394335,SCL,"Mill Hill, Potton Road",Gamlingay,,Sandy,,SG19 3LW,Tel: 01767654866,No ratings yet Rate it yourself - /Services/careproviders/LeaveReview/DefaultView.aspx?id=1-5683394335,0,0,,
Vincent Place,1-9140100470,SCL,Flat 42 Vincent Place,42 Townsend Mews,,Stevenage,,SG1 3AT,Tel: 01438729845,No ratings yet Rate it yourself - /Services/careproviders/LeaveReview/DefaultView.aspx?id=1-9140100470,0,0,,
SENSE Jenny Chapman House,1-120444864,SCL,167 Shephall View,,,Stevenage,Hertfordshire,SG1 1RR,Tel: 01438749013,No ratings yet Rate it yourself - /Services/careproviders/LeaveReview/DefaultView.aspx?id=1-120444864,0,0,,
Serve Homecare,1-9182754117,SCL,The Old Bank,162 High Street,,Stevenage,,SG1 3LL,Tel: 01438576789,No ratings yet Rate it yourself - /Services/careproviders/LeaveReview/DefaultView.aspx?id=1-9182754117,0,0,,
Alina Homecare - Hitchin & Letchworth,1-8956729958,SCL,Suite 2 First Floor,109 Bancroft,,Hitchin,,SG5 1NB,Tel: 01462341922,No ratings yet Rate it yourself - /Services/careproviders/LeaveReview/DefaultView.aspx?id=1-8956729958,0,0,,
Scarborough House,1-145991950,SCL,395 Scarborough Avenue,,,Stevenage,Hertfordshire,SG1 2QA,Tel: 01438361196,No ratings yet Rate it yourself - /Services/careproviders/LeaveReview/DefaultView.aspx?id=1-145991950,0,0,,
Agincare UK - Fred Millard Court,1-14576359372,SCL,"Fred Millard Court, Cuttys Lane",,,Stevenage,,SG1 1UQ,Tel: 07458111802,No ratings yet Rate it yourself - /Services/careproviders/LeaveReview/DefaultView.aspx?id=1-14576359372,0,0,,
Ashwood Place,1-133436119,SCL,Sunnyside Close,,,Hitchin,Hertfordshire,SG4 9JG,,No ratings yet Rate it yourself - /Services/careproviders/LeaveReview/DefaultView.aspx?id=1-133436119,0,0,,
Three Little Angels Ltd,1-13485732346,SCL,61 Roundmead,,,Stevenage,,SG2 9PQ,Tel: 07497628122,No ratings yet Rate it yourself - /Services/careproviders/LeaveReview/DefaultView.aspx?id=1-13485732346,0,0,,
Elmside,1-117965520,SCL,Elmside Walk,,,Hitchin,Hertfordshire,SG5 1HB,Tel: 01462451737,No ratings yet Rate it yourself - /Services/careproviders/LeaveReview/DefaultView.aspx?id=1-117965520,0,0,,
Archers Court,1-117977074,SCL,Elmside Walk,,,Hitchin,Hertfordshire,SG5 1HB,Tel: 01462423852,No ratings yet Rate it yourself - /Services/careproviders/LeaveReview/DefaultView.aspx?id=1-117977074,0,0,,
Authum Care Ltd,1-8780688477,SCL,7 Paynes Park,,,Hitchin,Hertfordshire,SG5 1EH,Tel: 01462341160,No ratings yet Rate it yourself - /Services/careproviders/LeaveReview/DefaultView.aspx?id=1-8780688477,0,0,,
Premium Staff - Hitchin,1-6842501125,SCL,Eastway Enterprise Centre,Paynes Park,,Hitchin,,SG5 1EH,Tel: 01462429716,No ratings yet Rate it yourself - /Services/careproviders/LeaveReview/DefaultView.aspx?id=1-6842501125,0,0,,
Alina Homecare Specialist Care - Hertfordshire,1-5842997881,SCL,"6a Meadway Court,",Rutherford Close,,Stevenage,,SG1 2EF,Tel: 01707443933,No ratings yet Rate it yourself - /Services/careproviders/LeaveReview/DefaultView.aspx?id=1-5842997881,0,0,,
Partners in Support,1-455374011,SCL,11 Meadway Court,Rutherford Close,,Stevenage,Hertfordshire,SG1 2EF,Tel: 01438746243,No ratings yet Rate it yourself - /Services/careproviders/LeaveReview/DefaultView.aspx?id=1-455374011,0,0,,
Alina Homecare Stevenage,1-115230109,SCL,6a Meadway Court,Rutherford Close,,Stevenage,Hertfordshire,SG1 2EF,Tel: 01438 904059,No ratings yet Rate it yourself - /Services/careproviders/LeaveReview/DefaultView.aspx?id=1-115230109,0,0,,
Westbourne Care Home,1-115211515,SCL,Westbourne,9 Bedford Road,,Hitchin,Hertfordshire,SG5 2TP,Tel: 01462459954,No ratings yet Rate it yourself - /Services/careproviders/LeaveReview/DefaultView.aspx?id=1-115211515,0,0,,
Destiny Support Care,1-4335364871,SCL,Quadrant Lodge,The Quadrant,,Stevenage,Hertfordshire,SG1 1ER,Tel: 01438488110,1 rating Rate it yourself - /Services/careproviders/LeaveReview/DefaultView.aspx?id=1-4335364871,,,,
Your Life (Hitchin),1-2110622780,SCL,Park House,Old Park Lane,,Hitchin,Hertfordshire,SG5 2JR,Tel: 01462442297,No ratings yet Rate it yourself - /Services/careproviders/LeaveReview/DefaultView.aspx?id=1-2110622780,0,0,,