Organisation Name,NACS Code,Organisation Type,Address1,Address2,Address3,Address4,Address5,PostCode,Telephone Number,NHS.UK users rating,Value  (NHS.UK users rating),Banding Classification  (NHS.UK users rating),Car parking (Is there car parking at this organisation?),Disabled access (Disabled access)
Autumn Vale Care Centre,1-3616904814,SCL,Danesbury Park Road,,,Welwyn,Hertfordshire,AL6 9SN,Tel: 01438 714491,No ratings yet Rate it yourself - /Services/careproviders/LeaveReview/DefaultView.aspx?id=1-3616904814,0,0,,
Heath Lodge,1-3616859231,SCL,Danesbury Park Road,,,Welwyn,Hertfordshire,AL6 9SN,Tel: 01438 716180,No ratings yet Rate it yourself - /Services/careproviders/LeaveReview/DefaultView.aspx?id=1-3616859231,0,0,,
Three Oaks Care Home Limited,1-110041505,SCL,14 Gwynfa Close,,,Welwyn Garden City,Hertfordshire,AL6 0PR,Tel: 01438712939,No ratings yet Rate it yourself - /Services/careproviders/LeaveReview/DefaultView.aspx?id=1-110041505,0,0,,
YourLife (Knebworth),1-9375977559,SCL,Lowe House,London Raod,,Knebworth,,SG3 6EU,Tel: 01202362305,No ratings yet Rate it yourself - /Services/careproviders/LeaveReview/DefaultView.aspx?id=1-9375977559,0,0,,
Monread Lodge,1-127075331,SCL,London Road,Woolmer Green,,Knebworth,Hertfordshire,SG3 6HG,Tel: 01438817466,No ratings yet Rate it yourself - /Services/careproviders/LeaveReview/DefaultView.aspx?id=1-127075331,0,0,,
Helpers Homecare Limited,1-497770846,SCL,"Offices 5-8, Lok’n’Store",Whittle Way,,Stevenage,,SG1 2GX,Tel: 01462896853,No ratings yet Rate it yourself - /Services/careproviders/LeaveReview/DefaultView.aspx?id=1-497770846,0,0,,
Living Well Homecare,1-7979304012,SCL,"1st Floor, Unit 8, Arlington Court","Arlington Business Park, Whittle Way",,Stevenage,,SG1 2FS,Tel: 01438300360,No ratings yet Rate it yourself - /Services/careproviders/LeaveReview/DefaultView.aspx?id=1-7979304012,0,0,,
Broadview,1-1077251016,SCL,8 Great North Road,,,Welwyn,Hertfordshire,AL6 0PL,Tel: 01438718929,No ratings yet Rate it yourself - /Services/careproviders/LeaveReview/DefaultView.aspx?id=1-1077251016,0,0,,
Hillcrest,1-1107048559,SCL,10 Great North Road,,,Welwyn,Hertfordshire,AL6 0PL,Tel: 01438718081,No ratings yet Rate it yourself - /Services/careproviders/LeaveReview/DefaultView.aspx?id=1-1107048559,0,0,,
Homeside,1-1107111859,SCL,6 Great North Road,,,Welwyn,Hertfordshire,AL6 0PL,Tel: 01438716442,No ratings yet Rate it yourself - /Services/careproviders/LeaveReview/DefaultView.aspx?id=1-1107111859,0,0,,
Roebuck Nursing Home,1-110192736,SCL,London Road,,,Stevenage,Hertfordshire,SG2 8DS,Tel: 01438 740234,1 rating Rate it yourself - /Services/careproviders/LeaveReview/DefaultView.aspx?id=1-110192736,,,,
Knebworth Care Home,1-4657440585,SCL,59 London Road,Woolmer Green,,Knebworth,Hertfordshire,SG3 6JE,Tel: 03333218602,No ratings yet Rate it yourself - /Services/careproviders/LeaveReview/DefaultView.aspx?id=1-4657440585,0,0,,
Domiciliary Care Service,1-145992032,SCL,SFAR008 Farnham House,6 Hills Way,,Stevenage,Hertfordshire,SG1 2FQ,Tel: 01438843575,No ratings yet Rate it yourself - /Services/careproviders/LeaveReview/DefaultView.aspx?id=1-145992032,0,0,,
Gombards,1-123018011,SCL,6 London Road,,,Welwyn Garden City,Hertfordshire,AL6 9EL,Tel: 01483712892,No ratings yet Rate it yourself - /Services/careproviders/LeaveReview/DefaultView.aspx?id=1-123018011,0,0,,
Devoted Home Care Services,1-18721398365,SCL,Unit 22,Caxton Way,,Stevenage,,SG1 2XU,Tel: 07830703176,No ratings yet Rate it yourself - /Services/careproviders/LeaveReview/DefaultView.aspx?id=1-18721398365,0,0,,
Priority Plus Care Ltd,1-18687969493,SCL,13 Caxton Point Business Centre,Caxton Way,,Stevenage,,SG1 2XU,Tel: 01438553105,No ratings yet Rate it yourself - /Services/careproviders/LeaveReview/DefaultView.aspx?id=1-18687969493,0,0,,
Bridgecare Solutions Ltd,1-12105644620,SCL,Caxton Point Business Centre,Caxton Way,,Stevenage,,SG1 2XU,,No ratings yet Rate it yourself - /Services/careproviders/LeaveReview/DefaultView.aspx?id=1-12105644620,0,0,,
Devoted Supported Living - Main Office,1-12636867005,SCL,"37, Caxton Point",Caxton Way,,Stevenage,,SG1 2XU,Tel: 01438900376,No ratings yet Rate it yourself - /Services/careproviders/LeaveReview/DefaultView.aspx?id=1-12636867005,0,0,,
Sandton Healthcare Limited,1-12637866785,SCL,Unit 41 Caxton Point,Caxton Way,,Stevenage,,SG1 2XU,Tel: 07983615783,No ratings yet Rate it yourself - /Services/careproviders/LeaveReview/DefaultView.aspx?id=1-12637866785,0,0,,
Rainbow Care Solutions (Hertfordshire),1-10563621162,SCL,Suite 30 Caxton Point Business Centre,Caxton Way,,Stevenage,,SG1 2XU,Tel: 01438419490,No ratings yet Rate it yourself - /Services/careproviders/LeaveReview/DefaultView.aspx?id=1-10563621162,0,0,,
Fortis Care Hertfordshire,1-5234926702,SCL,"Fortis Care, Caxton Point",Caxton Way,,Stevenage,,SG1 2XU,Tel: 01438487270,3 ratings Rate it yourself - /Services/careproviders/LeaveReview/DefaultView.aspx?id=1-5234926702,,,,
Connections Healthcare Ltd,1-11774881590,SCL,4b Caxton Point,Caxton Way,,Stevenage,,SG1 2XU,,No ratings yet Rate it yourself - /Services/careproviders/LeaveReview/DefaultView.aspx?id=1-11774881590,0,0,,
Subtle Healthcare Limited,1-17584931465,SCL,"Suite 232, Kings Court",London Road,,Stevenage,,SG1 2NG,Tel: 07404705080,No ratings yet Rate it yourself - /Services/careproviders/LeaveReview/DefaultView.aspx?id=1-17584931465,0,0,,
Brimchalk Healthcare Ltd,1-15070453304,SCL,Kings Court,London Road,,Stevenage,,SG1 2NG,Tel: 07834895009,No ratings yet Rate it yourself - /Services/careproviders/LeaveReview/DefaultView.aspx?id=1-15070453304,0,0,,
Options Health Care Services,1-2047021873,SCL,241 Kings Court,London Road,,Stevenage,,SG1 2NG,Tel: 01438314840,No ratings yet Rate it yourself - /Services/careproviders/LeaveReview/DefaultView.aspx?id=1-2047021873,0,0,,
Taks Healthcare Services,1-10687707953,SCL,Kings Court Business Centre,London Road,,Stevenage,,SG1 2NG,Tel: 01438964439,No ratings yet Rate it yourself - /Services/careproviders/LeaveReview/DefaultView.aspx?id=1-10687707953,0,0,,
Stevenage,1-6548524060,SCL,Kings Court,London Road,,Stevenage,,SG1 2NG,Tel: 01438 878 742,No ratings yet Rate it yourself - /Services/careproviders/LeaveReview/DefaultView.aspx?id=1-6548524060,0,0,,
Winnett Cottage,1-115998344,SCL,111 Hertford Road,,,Stevenage,Hertfordshire,SG2 8SH,Tel: 01438813915,No ratings yet Rate it yourself - /Services/careproviders/LeaveReview/DefaultView.aspx?id=1-115998344,0,0,,
Lead Care Services Limited,1-3727275725,SCL,Business & Technology Centre,Bessemer Drive,,Stevenage,Hertfordshire,SG1 2DX,Tel: 01438419888,No ratings yet Rate it yourself - /Services/careproviders/LeaveReview/DefaultView.aspx?id=1-3727275725,0,0,,
Greenleaves Homecare Services Limited,1-7880997150,SCL,"Business & Technology Centre, Office G31",Bessemer Drive,,Stevenage,,SG1 2DX,Tel: 01438310068,No ratings yet Rate it yourself - /Services/careproviders/LeaveReview/DefaultView.aspx?id=1-7880997150,0,0,,
Blossom Healthcare Solutions Hertfordshire Limited,1-10565393746,SCL,Business & Technology Centre,Bessemer Drive,,Stevenage,Hertfordshire,SG1 2DX,Tel: 07903206719,No ratings yet Rate it yourself - /Services/careproviders/LeaveReview/DefaultView.aspx?id=1-10565393746,0,0,,
Hertfordshire Domiciliary Care Agency,1-1434679286,SCL,Business & Technology Centre,Bessemer Drive,,Stevenage,Hertfordshire,SG1 2DX,Tel: 01438310083,No ratings yet Rate it yourself - /Services/careproviders/LeaveReview/DefaultView.aspx?id=1-1434679286,0,0,,
"Right at Home Stevenage, Letchworth & Hitchin",1-15273551505,SCL,Business & Technology Centre,Bessemer Drive,,Stevenage,Hertfordshire,SG1 2DX,Tel: 01462559159,No ratings yet Rate it yourself - /Services/careproviders/LeaveReview/DefaultView.aspx?id=1-15273551505,0,0,,
Turning Point Hertfordshire MH Carers Support,1-16056464746,SCL,SO8 Business & Technology Centre,Bessemer Drive,,Stevenage,,SG1 2DX,Tel: 01438211185,No ratings yet Rate it yourself - /Services/careproviders/LeaveReview/DefaultView.aspx?id=1-16056464746,0,0,,
Heriitage Care Ltd,1-9514312389,SCL,Business & Technology Centre,Bessemer Drive,,Stevenage,Hertfordshire,SG1 2DX,Tel: 01438310186,No ratings yet Rate it yourself - /Services/careproviders/LeaveReview/DefaultView.aspx?id=1-9514312389,0,0,,
Elixonn Healthcare Ltd,1-17077800815,SCL,Bessemer Drive,,,Stevenage,,SG1 2DX,,No ratings yet Rate it yourself - /Services/careproviders/LeaveReview/DefaultView.aspx?id=1-17077800815,0,0,,
Hertfordshire and Bedfordshire Domiciliary Care Services,1-17127798225,SCL,Business & Technology Centre,Bessemer Drive,,Stevenage,Hertfordshire,SG1 2DX,Tel: 07947560421,No ratings yet Rate it yourself - /Services/careproviders/LeaveReview/DefaultView.aspx?id=1-17127798225,0,0,,
New Hope Community Healthcare,1-6715233778,SCL,Business & Technology Centre,Bessemer Drive,,Stevenage,Hertfordshire,SG1 2DX,Tel: 01438310000,No ratings yet Rate it yourself - /Services/careproviders/LeaveReview/DefaultView.aspx?id=1-6715233778,0,0,,
Maiden Care Services Limited,1-2622450479,SCL,Business And Technology Centre,Bessemer Drive,,Stevenage,Hertfordshire,SG1 2DX,Tel: 01438310034,No ratings yet Rate it yourself - /Services/careproviders/LeaveReview/DefaultView.aspx?id=1-2622450479,0,0,,
Real Care Solutions,1-2718368680,SCL,Business & Technology Centre,Bessemer Drive,,Stevenage,Hertfordshire,SG1 2DX,Tel: 07942930800,No ratings yet Rate it yourself - /Services/careproviders/LeaveReview/DefaultView.aspx?id=1-2718368680,0,0,,
SureCare North Herts & Stevenage,1-12719491113,SCL,Business & Technology Centre,Bessemer Drive,,Stevenage,Hertfordshire,SG1 2DX,Tel: 01438587268,No ratings yet Rate it yourself - /Services/careproviders/LeaveReview/DefaultView.aspx?id=1-12719491113,0,0,,
Head office,1-3006365797,SCL,Business And Technology Centre,Bessemer Drive,,Stevenage,Hertfordshire,SG1 2DX,Tel: 01438537444,No ratings yet Rate it yourself - /Services/careproviders/LeaveReview/DefaultView.aspx?id=1-3006365797,0,0,,
Remiz Care & Recruitment Services Ltd,1-18844588296,SCL,"Unit G49, Business & Technology Centre",Bessemer Drive,,Stevenage,,SG1 2DX,Tel: 07807887351,No ratings yet Rate it yourself - /Services/careproviders/LeaveReview/DefaultView.aspx?id=1-18844588296,0,0,,
Stagenhoe Park,1-17128344133,SCL,St Pauls,St. Pauls Walden,,Hitchin,,SG4 8BY,Tel: 01438871215,No ratings yet Rate it yourself - /Services/careproviders/LeaveReview/DefaultView.aspx?id=1-17128344133,0,0,,
London Paramount Care Community Support,1-15162596998,SCL,"Second Floor, 3 and 4 Viewpoint Office Village","Hyatt Trading Estate, Babbage Road",,Stevenage,,SG1 2EQ,Tel: 07988810861,No ratings yet Rate it yourself - /Services/careproviders/LeaveReview/DefaultView.aspx?id=1-15162596998,0,0,,
Destiny Support Care,1-4335364871,SCL,Quadrant Lodge,The Quadrant,,Stevenage,Hertfordshire,SG1 1ER,Tel: 01438488110,1 rating Rate it yourself - /Services/careproviders/LeaveReview/DefaultView.aspx?id=1-4335364871,,,,
Manor View,1-15659136862,SCL,45 Manor View,,,Stevenage,Hertfordshire,SG2 8PF,Tel: 07988810861,No ratings yet Rate it yourself - /Services/careproviders/LeaveReview/DefaultView.aspx?id=1-15659136862,0,0,,
Look Ahead Domiciliary Care (Hertfordshire),1-294441934,SCL,Oak View,64-66 Hydean Way,,Stevenage,Hertfordshire,SG2 9XL,Tel: 01438740096,No ratings yet Rate it yourself - /Services/careproviders/LeaveReview/DefaultView.aspx?id=1-294441934,0,0,,
Agincare UK - Fred Millard Court,1-14576359372,SCL,"Fred Millard Court, Cuttys Lane",,,Stevenage,,SG1 1UQ,Tel: 07458111802,No ratings yet Rate it yourself - /Services/careproviders/LeaveReview/DefaultView.aspx?id=1-14576359372,0,0,,
Alina Homecare Stevenage,1-115230109,SCL,6a Meadway Court,Rutherford Close,,Stevenage,Hertfordshire,SG1 2EF,Tel: 01438 904059,No ratings yet Rate it yourself - /Services/careproviders/LeaveReview/DefaultView.aspx?id=1-115230109,0,0,,
Alina Homecare Specialist Care - Hertfordshire,1-5842997881,SCL,"6a Meadway Court,",Rutherford Close,,Stevenage,,SG1 2EF,Tel: 01707443933,No ratings yet Rate it yourself - /Services/careproviders/LeaveReview/DefaultView.aspx?id=1-5842997881,0,0,,
Partners in Support,1-455374011,SCL,11 Meadway Court,Rutherford Close,,Stevenage,Hertfordshire,SG1 2EF,Tel: 01438746243,No ratings yet Rate it yourself - /Services/careproviders/LeaveReview/DefaultView.aspx?id=1-455374011,0,0,,
Serve Homecare,1-9182754117,SCL,The Old Bank,162 High Street,,Stevenage,,SG1 3LL,Tel: 01438576789,No ratings yet Rate it yourself - /Services/careproviders/LeaveReview/DefaultView.aspx?id=1-9182754117,0,0,,
Vincent Place,1-9140100470,SCL,Flat 42 Vincent Place,42 Townsend Mews,,Stevenage,,SG1 3AT,Tel: 01438729845,No ratings yet Rate it yourself - /Services/careproviders/LeaveReview/DefaultView.aspx?id=1-9140100470,0,0,,
SENSE Jenny Chapman House,1-120444864,SCL,167 Shephall View,,,Stevenage,Hertfordshire,SG1 1RR,Tel: 01438749013,No ratings yet Rate it yourself - /Services/careproviders/LeaveReview/DefaultView.aspx?id=1-120444864,0,0,,
Knightingles Healthcare Limited,1-4606227581,SCL,2a,Letchmore Road,,Stevenage,,SG1 3HU,Tel: 07717064436,No ratings yet Rate it yourself - /Services/careproviders/LeaveReview/DefaultView.aspx?id=1-4606227581,0,0,,
Scarborough House,1-145991950,SCL,395 Scarborough Avenue,,,Stevenage,Hertfordshire,SG1 2QA,Tel: 01438361196,No ratings yet Rate it yourself - /Services/careproviders/LeaveReview/DefaultView.aspx?id=1-145991950,0,0,,
Care Fully Limited,1-2276468236,SCL,11 Broadview,,,Stevenage,Hertfordshire,SG1 3TT,Tel: 01438722665,No ratings yet Rate it yourself - /Services/careproviders/LeaveReview/DefaultView.aspx?id=1-2276468236,0,0,,
Homecare Living Ltd,1-18396761545,SCL,4 Hitherway,,,Welwyn Garden City,,AL8 7RG,Tel: 07899272450,No ratings yet Rate it yourself - /Services/careproviders/LeaveReview/DefaultView.aspx?id=1-18396761545,0,0,,
Eagles Wings24 Care,1-19060267389,SCL,47 Furzedown,,,Stevenage,,SG2 9EL,Tel: 07711810441,No ratings yet Rate it yourself - /Services/careproviders/LeaveReview/DefaultView.aspx?id=1-19060267389,0,0,,
Three Little Angels Ltd,1-13485732346,SCL,61 Roundmead,,,Stevenage,,SG2 9PQ,Tel: 07497628122,No ratings yet Rate it yourself - /Services/careproviders/LeaveReview/DefaultView.aspx?id=1-13485732346,0,0,,
Joy Caring Services Limited,1-2057631160,SCL,"Suite B, Mindenhall Court","R/017 High Street, Old Town",,Stevenage,Hertfordshire,SG1 3BG,Tel: 01438311704,1 rating Rate it yourself - /Services/careproviders/LeaveReview/DefaultView.aspx?id=1-2057631160,,,,
Walkern Lodge,1-4053879325,SCL,14A Walkern Road,,,Stevenage,Hertfordshire,SG1 3QX,Tel: 01438749301,No ratings yet Rate it yourself - /Services/careproviders/LeaveReview/DefaultView.aspx?id=1-4053879325,0,0,,
Julians House,1-1080115563,SCL,6 Julians Road,,,Stevenage,Hertfordshire,SG1 3ES,Tel: 01438751366,No ratings yet Rate it yourself - /Services/careproviders/LeaveReview/DefaultView.aspx?id=1-1080115563,0,0,,
Jubilee Court,1-436913248,SCL,Hayward Close,Lonsdale Road,,Stevenage,Hertfordshire,SG1 5BS,Tel: 01438730000,No ratings yet Rate it yourself - /Services/careproviders/LeaveReview/DefaultView.aspx?id=1-436913248,0,0,,
Sewells,1-10970925192,SCL,6a Sewells,,,Welwyn Garden City,Hertfordshire,AL8 7AQ,Tel: 01707321344,No ratings yet Rate it yourself - /Services/careproviders/LeaveReview/DefaultView.aspx?id=1-10970925192,0,0,,
Woodlands View Care Home,1-3154638209,SCL,Magpie Crescent,,,Stevenage,Hertfordshire,SG2 9RZ,Tel: 01438740230,No ratings yet Rate it yourself - /Services/careproviders/LeaveReview/DefaultView.aspx?id=1-3154638209,0,0,,
Vinea Care Limited,1-12390544741,SCL,53 The Vineyard,,,Welwyn Garden City,,AL8 7PY,,No ratings yet Rate it yourself - /Services/careproviders/LeaveReview/DefaultView.aspx?id=1-12390544741,0,0,,
My Homecare Hertfordshire,1-6726093990,SCL,Unit 2,"Falcon Gate, Falcon Way, Shire Park",,Welwyn Garden City,,AL7 1TW,Tel: 01707909066,No ratings yet Rate it yourself - /Services/careproviders/LeaveReview/DefaultView.aspx?id=1-6726093990,0,0,,
Homecare 360 LTD,1-12370434038,SCL,2 Falcon Gate,"Regus, Shire Park",,Welwyn Garden City,,AL7 1TW,Tel: 01707909033,No ratings yet Rate it yourself - /Services/careproviders/LeaveReview/DefaultView.aspx?id=1-12370434038,0,0,,
Three Clover Care - Main Office,1-13400008538,SCL,Unit 2,"Falcon Way, Shire Park",,Welwyn Garden City,Hertfordshire,AL7 1TW,Tel: 01707929301,1 rating Rate it yourself - /Services/careproviders/LeaveReview/DefaultView.aspx?id=1-13400008538,,,,
The Inclusion Project,1-4606306855,SCL,"Office Regus, Unit 2, Falcon Gate","Falcon Way, Shire Park",,Welwyn Garden City,,AL7 1TW,Tel: 07526243571,No ratings yet Rate it yourself - /Services/careproviders/LeaveReview/DefaultView.aspx?id=1-4606306855,0,0,,
Shadz Care,1-9017766332,SCL,Unit 2,"Falcon Gate, Falcon Way, Shire Park",,Welwyn Garden City,,AL7 1TW,Tel: 07792748972,No ratings yet Rate it yourself - /Services/careproviders/LeaveReview/DefaultView.aspx?id=1-9017766332,0,0,,
Stella Care Solutions - Main Office,1-13069999667,SCL,"Shire Park, 2 Falcon Gate",Falcon Gate,,Welwyn Garden City,,AL7 1TW,Tel: 01707929123,No ratings yet Rate it yourself - /Services/careproviders/LeaveReview/DefaultView.aspx?id=1-13069999667,0,0,,
Welwyn Garden City,1-11608364948,SCL,2 Falcon Gate,Shire Park,,Welwyn Garden City,,AL7 1TW,Tel: 07920391969,No ratings yet Rate it yourself - /Services/careproviders/LeaveReview/DefaultView.aspx?id=1-11608364948,0,0,,
Etrum Healthcare Services Ltd,1-13090141860,SCL,Unit 2,"Falcon Gate, Falcon Way, Shire Park",,Welwyn Garden City,,AL7 1TW,,No ratings yet Rate it yourself - /Services/careproviders/LeaveReview/DefaultView.aspx?id=1-13090141860,0,0,,
ENA Hourly Care Limited,1-5134955370,SCL,"Suite 2, Wentworth Lodge",Great North Road,,Welwyn Garden City,Hertfordshire,AL8 7SR,Tel: 01707383034,No ratings yet Rate it yourself - /Services/careproviders/LeaveReview/DefaultView.aspx?id=1-5134955370,0,0,,
European Nursing Agency Limited,1-475571880,SCL,"Suite 2, Wentworth Lodge",Great North Road,,Welwyn Garden City,Hertfordshire,AL8 7SR,Tel: 01707333700,2 ratings Rate it yourself - /Services/careproviders/LeaveReview/DefaultView.aspx?id=1-475571880,,,,
St Andrews Care Home,1-125573665,SCL,Great North Road,,,Welwyn Garden City,Hertfordshire,AL8 7SR,Tel: 01707324208,1 rating Rate it yourself - /Services/careproviders/LeaveReview/DefaultView.aspx?id=1-125573665,,,,
Wisden Court,1-131482054,SCL,Wisden Road,,,Stevenage,Hertfordshire,SG1 5JD,Tel: 01438354933,No ratings yet Rate it yourself - /Services/careproviders/LeaveReview/DefaultView.aspx?id=1-131482054,0,0,,
Your Life (Welwyn Garden City),1-901394320,SCL,Peel Court,The Campus,,Welwyn Garden City,Hertfordshire,AL8 6DG,Tel: 01707328220,No ratings yet Rate it yourself - /Services/careproviders/LeaveReview/DefaultView.aspx?id=1-901394320,0,0,,
Next Steps Hertfordshire,1-526075269,SCL,10 Parkway,,,Welwyn Garden City,Hertfordshire,AL8 6HG,Tel: 01707332404,No ratings yet Rate it yourself - /Services/careproviders/LeaveReview/DefaultView.aspx?id=1-526075269,0,0,,
Station Road,1-119129442,SCL,1 Station Road,Wheathampstead,,St Albans,Hertfordshire,AL4 8BU,Tel: 01582833957,No ratings yet Rate it yourself - /Services/careproviders/LeaveReview/DefaultView.aspx?id=1-119129442,0,0,,
Martins House,1-3616995796,SCL,Jessop Road,Pin Green,,Stevenage,Hertfordshire,SG1 5LL,Tel: 01438 351056,No ratings yet Rate it yourself - /Services/careproviders/LeaveReview/DefaultView.aspx?id=1-3616995796,0,0,,
Pinelodge Care Home,1-200144942,SCL,Graveley Road,,,Stevenage,Hertfordshire,SG1 4YS,Tel: 01438721417,3 ratings Rate it yourself - /Services/careproviders/LeaveReview/DefaultView.aspx?id=1-200144942,,,,
Daisy Chain Care Team Ltd,1-4491564007,SCL,2 Brownfields Court,,,Welwyn Garden City,Hertfordshire,AL7 1AJ,Tel: 01438553463,No ratings yet Rate it yourself - /Services/careproviders/LeaveReview/DefaultView.aspx?id=1-4491564007,0,0,,
Total Care and Compliance Services,1-13675882876,SCL,26 Bridge Road East,,,Welwyn Garden City,,AL7 1HL,Tel: 07576745894,No ratings yet Rate it yourself - /Services/careproviders/LeaveReview/DefaultView.aspx?id=1-13675882876,0,0,,
GJU Services Limited,1-9828547712,SCL,79 Sefton Road,,,Stevenage,,SG1 5RL,Tel: 02080902741,No ratings yet Rate it yourself - /Services/careproviders/LeaveReview/DefaultView.aspx?id=1-9828547712,0,0,,
Goldleaf Homecare,1-1252056797,SCL,Unit 16,"Martinfield Business Centre, Martinfield",,Welwyn Garden City,Hertfordshire,AL7 1HG,Tel: 01707800523,1 rating Rate it yourself - /Services/careproviders/LeaveReview/DefaultView.aspx?id=1-1252056797,,,,
Wymondley Nursing & Residential Care Home,1-110500111,SCL,Stevenage Road,Little Wymondley,,Hitchin,Hertfordshire,SG4 7HT,Tel: 01438312434,No ratings yet Rate it yourself - /Services/careproviders/LeaveReview/DefaultView.aspx?id=1-110500111,0,0,,
Visiting Angels,1-12809061588,SCL,62 Bridge Road East,,,Welwyn Garden City,,AL7 1JU,Tel: 01707585888,No ratings yet Rate it yourself - /Services/careproviders/LeaveReview/DefaultView.aspx?id=1-12809061588,0,0,,
Jubilee Domiciliary Care Agency,1-199595897,SCL,"Ground Floor, Suite 2, 6 Silver Court",,,Welwyn Garden City,,AL7 1LT,Tel: 01707390107,No ratings yet Rate it yourself - /Services/careproviders/LeaveReview/DefaultView.aspx?id=1-199595897,0,0,,
Poplar Care Agency Ltd,1-17716011055,SCL,2 New Wood,,,Welwyn Garden City,,AL7 2DR,Tel: 01707694752,1 rating Rate it yourself - /Services/careproviders/LeaveReview/DefaultView.aspx?id=1-17716011055,,,,
Lily Healthcare & Supported Living Limited,1-14567398596,SCL,55 Manchester Close,,,Stevenage,,SG1 4TQ,Tel: 07713912907,No ratings yet Rate it yourself - /Services/careproviders/LeaveReview/DefaultView.aspx?id=1-14567398596,0,0,,
Stevenage,1-11295712832,SCL,27 Brimstone Drive,,,Stevenage,,SG1 4FX,Tel: 07919382837,No ratings yet Rate it yourself - /Services/careproviders/LeaveReview/DefaultView.aspx?id=1-11295712832,0,0,,
Home Instead (Welwyn & Hatfield),1-591360223,SCL,Weltech Business Centre,Ridgeway,,Welwyn Garden City,Hertfordshire,AL7 2AA,Tel: 01707 250650,No ratings yet Rate it yourself - /Services/careproviders/LeaveReview/DefaultView.aspx?id=1-591360223,0,0,,
"Right at Home Welwyn, Hatfield & St Albans",1-4830219332,SCL,Unit 21,Weltech Centre,,Welwyn Garden City,Hertfordshire,AL7 2AA,Tel: 01707682100,No ratings yet Rate it yourself - /Services/careproviders/LeaveReview/DefaultView.aspx?id=1-4830219332,0,0,,
Care Herts Limited,1-2387435288,SCL,Unit 22b,"20, Weltech Business Centre",,Welwyn Garden City,Hertfordshire,AL7 2AA,Tel: 01707 386106,5 ratings Rate it yourself - /Services/careproviders/LeaveReview/DefaultView.aspx?id=1-2387435288,,,,
Hartwig Care (Hertfordshire),1-18319072022,SCL,Unit 27a,"Weltech Business Centre, Ridgeway",,Welwyn Garden City,,AL7 2AA,Tel: 01707954225,No ratings yet Rate it yourself - /Services/careproviders/LeaveReview/DefaultView.aspx?id=1-18319072022,0,0,,
Sloe Hill Residential Home,1-14224596855,SCL,Mill Lane,St. Ippolyts,,Hitchin,,SG4 7NN,Tel: 01462439040,No ratings yet Rate it yourself - /Services/careproviders/LeaveReview/DefaultView.aspx?id=1-14224596855,0,0,,
The Meadows Short Break Centre,1-112258276,SCL,19-21 Grove Meadow,,,Welwyn Garden City,Hertfordshire,AL7 2BE,Tel: 01707373759,No ratings yet Rate it yourself - /Services/careproviders/LeaveReview/DefaultView.aspx?id=1-112258276,0,0,,
St Michaels House,1-2577035235,SCL,71 Holwell Road,,,Welwyn Garden City,Hertfordshire,AL7 3SF,,No ratings yet Rate it yourself - /Services/careproviders/LeaveReview/DefaultView.aspx?id=1-2577035235,0,0,,
Halcyon Days,1-3616698021,SCL,The Old Rectory,Church Lane,,Hitchin,Hertfordshire,SG4 7LU,Tel: 01438 315588,No ratings yet Rate it yourself - /Services/careproviders/LeaveReview/DefaultView.aspx?id=1-3616698021,0,0,,