Organisation Name,NACS Code,Organisation Type,Address1,Address2,Address3,Address4,Address5,PostCode,Telephone Number,NHS.UK users rating,Value  (NHS.UK users rating),Banding Classification  (NHS.UK users rating),Car parking (Is there car parking at this organisation?),Disabled access (Disabled access)
Arch West Midlands,1-12427547986,SCL,55 Cherry Tree Avenue,,,Walsall,,WS5 4JN,Tel: 01217140500,No ratings yet Rate it yourself - /Services/careproviders/LeaveReview/DefaultView.aspx?id=1-12427547986,0,0,,
AMC Healthcare Solutions Ltd,1-18639125791,SCL,"The Office, 30 Poppy Drive",,,Walsall,,WS5 4RB,,No ratings yet Rate it yourself - /Services/careproviders/LeaveReview/DefaultView.aspx?id=1-18639125791,0,0,,
Housing 21 - Deighton Court,1-265470229,SCL,Brockhurst Cresent,Delves,,Walsall,West Midlands,WS5 4PW,Tel: 03701924687,No ratings yet Rate it yourself - /Services/careproviders/LeaveReview/DefaultView.aspx?id=1-265470229,0,0,,
Delves Court Care Home,1-8517919494,SCL,2 Walstead Road,,,Walsall,West Midlands,WS5 4NZ,Tel: 01922722722,No ratings yet Rate it yourself - /Services/careproviders/LeaveReview/DefaultView.aspx?id=1-8517919494,0,0,,
Highgate Lodge Care Home,1-12801966335,SCL,66 Highgate Road,,,Walsall,West Midlands,WS1 3JE,Tel: 01922 218626,No ratings yet Rate it yourself - /Services/careproviders/LeaveReview/DefaultView.aspx?id=1-12801966335,0,0,,
Gorway House,1-112445420,SCL,40 Gorway Road,,,Walsall,West Midlands,WS1 3BG,Tel: 01922615515,No ratings yet Rate it yourself - /Services/careproviders/LeaveReview/DefaultView.aspx?id=1-112445420,0,0,,
Highgate Road,1-129544222,SCL,91 Highgate Road,,,Walsall,West Midlands,WS1 3JA,Tel: 01922474336,No ratings yet Rate it yourself - /Services/careproviders/LeaveReview/DefaultView.aspx?id=1-129544222,0,0,,
Hawabu House,1-9152129979,SCL,46 Sandwell Street,,,Walsall,,WS1 3EB,Tel: 01922636674,No ratings yet Rate it yourself - /Services/careproviders/LeaveReview/DefaultView.aspx?id=1-9152129979,0,0,,
Tosnade Ltd,1-18233232133,SCL,The Old Foundry,Bath Street,,Walsall,,WS1 3BZ,,No ratings yet Rate it yourself - /Services/careproviders/LeaveReview/DefaultView.aspx?id=1-18233232133,0,0,,
West Midlands Domiciliary Care Service,1-10752924675,SCL,Flat 3,29-31 Lysways Street,,Walsall,,WS1 3AG,Tel: 01922723860,No ratings yet Rate it yourself - /Services/careproviders/LeaveReview/DefaultView.aspx?id=1-10752924675,0,0,,
SentriCare,1-123516630,SCL,"1st Floor, Old Blake House",150 Bath Street,,Walsall,West Midlands,WS1 3BX,Tel: 01922722939,No ratings yet Rate it yourself - /Services/careproviders/LeaveReview/DefaultView.aspx?id=1-123516630,0,0,,
45 Hall Green Road,1-129459141,SCL,Hall Green,Hall Green Road,,West Bromwich,West Midlands,B71 3JS,Tel: 01215884560,No ratings yet Rate it yourself - /Services/careproviders/LeaveReview/DefaultView.aspx?id=1-129459141,0,0,,
Solutions 4 Care Limited,1-3493266185,SCL,Office H - Limes Business Centre,5 Birmingham Road,,Walsall,West Midlands,WS1 2LT,Tel: 01922270600,No ratings yet Rate it yourself - /Services/careproviders/LeaveReview/DefaultView.aspx?id=1-3493266185,0,0,,
South Street,1-119188814,SCL,17 South Street,Coldmore,,Walsall,West Midlands,WS1 4HE,Tel: 01922642057,No ratings yet Rate it yourself - /Services/careproviders/LeaveReview/DefaultView.aspx?id=1-119188814,0,0,,
Hall Green Care Home,1-759019756,SCL,107 Hall Green Road,,,West Bromwich,West Midlands,B71 3JT,Tel: 01215670020,No ratings yet Rate it yourself - /Services/careproviders/LeaveReview/DefaultView.aspx?id=1-759019756,0,0,,
Lonsdale Midlands Limited - 290 Newton Road,1-131378014,SCL,290 Newton Road,Great Barr,,Birmingham,West Midlands,B43 6QU,,No ratings yet Rate it yourself - /Services/careproviders/LeaveReview/DefaultView.aspx?id=1-131378014,0,0,,
Maaya Care,1-18446210535,SCL,"Flat 106, Caldmore Road",,,Walsall,,WS1 3PD,Tel: 01922661466,No ratings yet Rate it yourself - /Services/careproviders/LeaveReview/DefaultView.aspx?id=1-18446210535,0,0,,
Grove Terrace,1-13363493821,SCL,3-4 Grove Terrace,,,Walsall,,WS1 2NE,Tel: 07800989097,No ratings yet Rate it yourself - /Services/careproviders/LeaveReview/DefaultView.aspx?id=1-13363493821,0,0,,
Care XY,1-507487946,SCL,"Grove House, Suite 2",Grove Terrace,,Walsall,West Midlands,WS1 2NE,Tel: 01215440175,3 ratings Rate it yourself - /Services/careproviders/LeaveReview/DefaultView.aspx?id=1-507487946,,,,
Bluebird Care (Walsall),1-3033429057,SCL,28 Willows Road,,,Walsall,West Midlands,WS1 2DR,Tel: 01922 622722 (ext. 7958529129),No ratings yet Rate it yourself - /Services/careproviders/LeaveReview/DefaultView.aspx?id=1-3033429057,0,0,,
Just Samaritan Homecare,1-5468921950,SCL,22 Red House Park Road,,,Birmingham,,B43 6ND,Tel: 07757739571,No ratings yet Rate it yourself - /Services/careproviders/LeaveReview/DefaultView.aspx?id=1-5468921950,0,0,,
Breakthru Care Ltd,1-4844306850,SCL,Office No 1,63a Hillary Street,,Walsall,,WS2 9BP,Tel: 03333660746,No ratings yet Rate it yourself - /Services/careproviders/LeaveReview/DefaultView.aspx?id=1-4844306850,0,0,,
The Willows,1-109974403,SCL,170 Newton Road,Great Barr,,Birmingham,West Midlands,B43 6BU,Tel: 01213570124,No ratings yet Rate it yourself - /Services/careproviders/LeaveReview/DefaultView.aspx?id=1-109974403,0,0,,
55 Bowstoke Road,1-2280337989,SCL,55 Bowstoke Road,,,Birmingham,West Midlands,B43 5DJ,Tel: 01214484863,No ratings yet Rate it yourself - /Services/careproviders/LeaveReview/DefaultView.aspx?id=1-2280337989,0,0,,
Mech Healthcare Limited,1-12324929900,SCL,19-20 Vicarage Place (Mwanaka Shop),,,Walsall,,WS1 3NA,Tel: 07402168788,No ratings yet Rate it yourself - /Services/careproviders/LeaveReview/DefaultView.aspx?id=1-12324929900,0,0,,
The Grand Cedars Nursing Home,1-17761912785,SCL,83-89 Bescot Road,,,Walsall,West Midlands,WS2 9DG,Tel: 01922641869,No ratings yet Rate it yourself - /Services/careproviders/LeaveReview/DefaultView.aspx?id=1-17761912785,0,0,,
Brunswick House,1-428633344,SCL,1 James Watt Drive,,,Wednesbury,West Midlands,WS10 0PQ,Tel: 01215056933,No ratings yet Rate it yourself - /Services/careproviders/LeaveReview/DefaultView.aspx?id=1-428633344,0,0,,
Brunswick Mews,1-1043708006,SCL,70 Brunswick Park Road,,,Wednesbury,,WS10 9QR,Tel: 01214480501,No ratings yet Rate it yourself - /Services/careproviders/LeaveReview/DefaultView.aspx?id=1-1043708006,0,0,,
Bescot Lodge Care Home,1-5593212074,SCL,76-78,Bescot Road,,Walsall,,WS2 9AE,Tel: 01922648917,No ratings yet Rate it yourself - /Services/careproviders/LeaveReview/DefaultView.aspx?id=1-5593212074,0,0,,
Halle Healthcare Limited,1-13747057266,SCL,50 Bradford Street,,,Walsall,,WS1 3QD,Tel: 03333050696,No ratings yet Rate it yourself - /Services/careproviders/LeaveReview/DefaultView.aspx?id=1-13747057266,0,0,,
Care 2 U Limited,1-127932362,SCL,26-28 Goodall Street,26-28 Goodall Street,,Walsall,West Midlands,WS1 1QL,Tel: 0333 456 0500,7 ratings Rate it yourself - /Services/careproviders/LeaveReview/DefaultView.aspx?id=1-127932362,,,,
Lincoln Road,1-5179341609,SCL,3 Lincoln Road,,,Walsall,,WS1 2EA,Tel: 01922643036,No ratings yet Rate it yourself - /Services/careproviders/LeaveReview/DefaultView.aspx?id=1-5179341609,0,0,,
Helping Hands Walsall,1-12673023409,SCL,60 Bridge Street,,,Walsall,,WS1 1JG,Tel: 01922660758,No ratings yet Rate it yourself - /Services/careproviders/LeaveReview/DefaultView.aspx?id=1-12673023409,0,0,,
Revolutionary Quality Care Solutions Ltd,1-13939954343,SCL,61a,Jayshaw Avenue,,Birmingham,,B43 5SB,Tel: 07452810647,No ratings yet Rate it yourself - /Services/careproviders/LeaveReview/DefaultView.aspx?id=1-13939954343,0,0,,
Allerton Court,1-123515235,SCL,234 Hydes Road,,,West Bromwich,West Midlands,B71 2ED,Tel: 01215885494,1 rating Rate it yourself - /Services/careproviders/LeaveReview/DefaultView.aspx?id=1-123515235,,,,
My Pillar Limited,1-3584279621,SCL,77 Bridge Street,,,Walsall,,WS1 1JQ,,No ratings yet Rate it yourself - /Services/careproviders/LeaveReview/DefaultView.aspx?id=1-3584279621,0,0,,
JAC Community Care,1-306368602,SCL,192 Prince Street,,,Walsall,West Midlands,WS2 9JG,Tel: 01902651595,No ratings yet Rate it yourself - /Services/careproviders/LeaveReview/DefaultView.aspx?id=1-306368602,0,0,,
The Shrubbery,1-311720178,SCL,33 Woodgreen Road,,,Wednesbury,West Midlands,WS10 9QL,Tel: 01215568899,1 rating Rate it yourself - /Services/careproviders/LeaveReview/DefaultView.aspx?id=1-311720178,,,,
Wood Green Nursing Home,1-247711742,SCL,27 Wood Green Road,,,Wednesbury,West Midlands,WS10 9AX,Tel: 01215560381,No ratings yet Rate it yourself - /Services/careproviders/LeaveReview/DefaultView.aspx?id=1-247711742,0,0,,
Amplelime Healthcare Limited,1-4160607880,SCL,130 A Lichfield Street,,,Walsall,West Midlands,WS1 1SY,Tel: 01922622221,No ratings yet Rate it yourself - /Services/careproviders/LeaveReview/DefaultView.aspx?id=1-4160607880,0,0,,
Kelvedon House,1-1290507859,SCL,10 Clarkson Road,,,Wednesbury,West Midlands,WS10 9AY,Tel: 0121 505 7775,No ratings yet Rate it yourself - /Services/careproviders/LeaveReview/DefaultView.aspx?id=1-1290507859,0,0,,
Mediservices Care Ltd,1-13938633149,SCL,5J Townend House,,,Walsall,,WS1 1NS,Tel: 07928635455,No ratings yet Rate it yourself - /Services/careproviders/LeaveReview/DefaultView.aspx?id=1-13938633149,0,0,,
MK Executive Care Midlands,1-8821157299,SCL,"7th Floor, Townend House",Park Street,,Walsall,,WS1 1NS,Tel: 07931359586,No ratings yet Rate it yourself - /Services/careproviders/LeaveReview/DefaultView.aspx?id=1-8821157299,0,0,,
 GA Olive Ltd,1-18863045777,SCL,"Office K 3rd Floor, Townend House",Wisemore,,Walsall,,WS1 1NS,Tel: 07868674714,No ratings yet Rate it yourself - /Services/careproviders/LeaveReview/DefaultView.aspx?id=1-18863045777,0,0,,
Dickson Care Ltd,1-18693213986,SCL,Townend House,Park Street,,Walsall,,WS1 1NS,Tel: 07961037909,No ratings yet Rate it yourself - /Services/careproviders/LeaveReview/DefaultView.aspx?id=1-18693213986,0,0,,
Kinver Care Ltd,1-6857717176,SCL,"Townend House, 4th Floor North",Park Street,,Walsall,,WS1 1NS,Tel: 01902238777,6 ratings Rate it yourself - /Services/careproviders/LeaveReview/DefaultView.aspx?id=1-6857717176,,,,
Dignus Support,1-2823384014,SCL,10 Hatherton Road,,,Walsall,,WS1 1XS,Tel: 01213575049,No ratings yet Rate it yourself - /Services/careproviders/LeaveReview/DefaultView.aspx?id=1-2823384014,0,0,,
GTG Care Nursing - 112a Lichfield Street,1-118411994,SCL,112a Lichfield Street,,,Walsall,West Midlands,WS1 1SZ,Tel: 01922615900,No ratings yet Rate it yourself - /Services/careproviders/LeaveReview/DefaultView.aspx?id=1-118411994,0,0,,
Harmony Revival Supported Living Services Limited,1-12815736066,SCL,"The Rock Centre, 27-31 Lichfield House",Lichfield Street,,Walsall,,WS1 1TJ,Tel: 07805219843,1 rating Rate it yourself - /Services/careproviders/LeaveReview/DefaultView.aspx?id=1-12815736066,,,,
CHAREY CARE UK LTD,1-15520381141,SCL,"The Rock House, Lichfield House",27-31 Lichfield Street,,Walsall,,WS1 1TJ,Tel: 01922276973,No ratings yet Rate it yourself - /Services/careproviders/LeaveReview/DefaultView.aspx?id=1-15520381141,0,0,,
Inmind community Support Services Limited,1-4704543143,SCL,The Rock Center,27-31 Lichfield Street,,Walsall,West Midlands,WS1 1TJ,Tel: 01922611315,No ratings yet Rate it yourself - /Services/careproviders/LeaveReview/DefaultView.aspx?id=1-4704543143,0,0,,
ECHO Supported Living Services Limited,1-8026516958,SCL,Suite 117 The Rock Centre,27-31 Lichfield Street,,Walsall,,WS1 1TJ,,2 ratings Rate it yourself - /Services/careproviders/LeaveReview/DefaultView.aspx?id=1-8026516958,,,,
Essence Health Ltd,1-5208790400,SCL,Lichfield House 27-31,Lichfield Street,,Walsall,,WS1 1TJ,Tel: 01922640333,No ratings yet Rate it yourself - /Services/careproviders/LeaveReview/DefaultView.aspx?id=1-5208790400,0,0,,
Hilton Rose Retirement Home Ltd,1-287111921,SCL,30 Broadway North,,,Walsall,West Midlands,WS1 2AJ,Tel: 01922622778,No ratings yet Rate it yourself - /Services/careproviders/LeaveReview/DefaultView.aspx?id=1-287111921,0,0,,
Carolann House,1-11017809169,SCL,902 Walsall Road,Great Barr,,Birmingham,,B42 1TG,Tel: 01213577600,No ratings yet Rate it yourself - /Services/careproviders/LeaveReview/DefaultView.aspx?id=1-11017809169,0,0,,
Homecare With Caring Angels Ltd,1-15776716571,SCL,39 Jerome Road,,,Walsall,,WS2 9SU,Tel: 01922351351,No ratings yet Rate it yourself - /Services/careproviders/LeaveReview/DefaultView.aspx?id=1-15776716571,0,0,,
Bessie Care Solutions Ltd,1-13679828846,SCL,58 Pembroke Road,,,West Bromwich,,B71 2NN,Tel: 07446077856,No ratings yet Rate it yourself - /Services/careproviders/LeaveReview/DefaultView.aspx?id=1-13679828846,0,0,,
Churchfield Court,1-115795220,SCL,236 All Saints Way,,,West Bromwich,West Midlands,B71 1RR,Tel: 01215885450,No ratings yet Rate it yourself - /Services/careproviders/LeaveReview/DefaultView.aspx?id=1-115795220,0,0,,
Caring Care Limited,1-977486813,SCL,Units 4 & 5 Hatherton Court,22 Hatherton Street,,Walsall,,WS4 2LA,Tel: 01922642119,1 rating Rate it yourself - /Services/careproviders/LeaveReview/DefaultView.aspx?id=1-977486813,,,,
Mulberry House,1-10752923981,SCL,70 Lichfield Street,,,Walsall,West Midlands,WS4 2BY,Tel: 01922615218,No ratings yet Rate it yourself - /Services/careproviders/LeaveReview/DefaultView.aspx?id=1-10752923981,0,0,,
The Hargreaves,1-18143481395,SCL,44 Butts Street,,,Walsall,,WS4 2BJ,Tel: 07800989097,No ratings yet Rate it yourself - /Services/careproviders/LeaveReview/DefaultView.aspx?id=1-18143481395,0,0,,
Stanbrook Care Home,1-11844803268,SCL,Manor Road Precinct,,,Walsall,West Midlands,WS2 8RF,Tel: 01922633219,1 rating Rate it yourself - /Services/careproviders/LeaveReview/DefaultView.aspx?id=1-11844803268,,,,
Leofric Villa,1-10918672400,SCL,6 The Beeches,Brunswick Terrace,,Wednesbury,,WS10 9FB,Tel: 01212729007,No ratings yet Rate it yourself - /Services/careproviders/LeaveReview/DefaultView.aspx?id=1-10918672400,0,0,,
The Lodge,1-198023491,SCL,Beebee Road,,,Wednesbury,West Midlands,WS10 9RX,Tel: 01215264612,No ratings yet Rate it yourself - /Services/careproviders/LeaveReview/DefaultView.aspx?id=1-198023491,0,0,,
Head Office,1-7186695179,SCL,12 Bank Street,,,West Bromwich,,B71 1HF,Tel: 07306449402,No ratings yet Rate it yourself - /Services/careproviders/LeaveReview/DefaultView.aspx?id=1-7186695179,0,0,,
MSA Care Walsall,1-7662174907,SCL,Uplands House,5 Lichfield Road,,Walsall,,WS4 2HT,,1 rating Rate it yourself - /Services/careproviders/LeaveReview/DefaultView.aspx?id=1-7662174907,,,,
Total Love Healthcare Limited,1-18838009865,SCL,11 Scafell Way,,,West Bromwich,,B71 1DN,Tel: 01215171610,No ratings yet Rate it yourself - /Services/careproviders/LeaveReview/DefaultView.aspx?id=1-18838009865,0,0,,
Awarding Care Ltd,1-2289800479,SCL,59 Bridge Street,,,Wednesbury,West Midlands,WS10 0AH,Tel: 01215056104,1 rating Rate it yourself - /Services/careproviders/LeaveReview/DefaultView.aspx?id=1-2289800479,,,,
Wellcroft House,1-6615555153,SCL,11 Wellcroft Street,,,Wednesbury,West Midlands,WS10 7HU,,No ratings yet Rate it yourself - /Services/careproviders/LeaveReview/DefaultView.aspx?id=1-6615555153,0,0,,
Hawley House,1-14355057935,SCL,19 Hawley Close,,,Walsall,,WS4 2JF,,No ratings yet Rate it yourself - /Services/careproviders/LeaveReview/DefaultView.aspx?id=1-14355057935,0,0,,
Lonsdale House,1-3310772193,SCL,8 Lichfield Road,,,Walsall,West Midlands,WS4 2DH,Tel: 01922721566,1 rating Rate it yourself - /Services/careproviders/LeaveReview/DefaultView.aspx?id=1-3310772193,,,,
The Hollies,1-18928541385,SCL,10 Lichfield Road,,,Walsall,,WS4 2DH,Tel: 07922506751,No ratings yet Rate it yourself - /Services/careproviders/LeaveReview/DefaultView.aspx?id=1-18928541385,0,0,,
JayasCare,1-14143157178,SCL,6 Comsey Road,,,Birmingham,,B43 7RG,Tel: 07493878610,No ratings yet Rate it yourself - /Services/careproviders/LeaveReview/DefaultView.aspx?id=1-14143157178,0,0,,
Fallings Heath,1-122285524,SCL,5 Fallings Heath Close,Darlaston,,Walsall,West Midlands,WS10 8BT,Tel: 01215686176,No ratings yet Rate it yourself - /Services/careproviders/LeaveReview/DefaultView.aspx?id=1-122285524,0,0,,
Hilltop View,1-15979200422,SCL,23 Barncroft Street,,,West Bromwich,,B70 0QJ,,No ratings yet Rate it yourself - /Services/careproviders/LeaveReview/DefaultView.aspx?id=1-15979200422,0,0,,
Bartholamew Lodge Nursing Home Limited,1-116745623,SCL,1 Trouse Lane,,,Wednesbury,West Midlands,WS10 7HR,Tel: 01215021606,No ratings yet Rate it yourself - /Services/careproviders/LeaveReview/DefaultView.aspx?id=1-116745623,0,0,,
Jaytee Care Demi House,1-10495633645,SCL,205 Walsall Road,,,Wednesbury,,WS10 9SW,Tel: 01218206400,No ratings yet Rate it yourself - /Services/careproviders/LeaveReview/DefaultView.aspx?id=1-10495633645,0,0,,
Sadlers Place,1-1783234682,SCL,40 Rowland Street,,,Walsall,West Midlands,WS2 8SU,Tel: 01922611352,No ratings yet Rate it yourself - /Services/careproviders/LeaveReview/DefaultView.aspx?id=1-1783234682,0,0,,
Lyndon Hall Nursing Home,1-320351055,SCL,Malvern Close,off All Saints Way,,West Bromwich,West Midlands,B71 1PP,Tel: 01215005777,No ratings yet Rate it yourself - /Services/careproviders/LeaveReview/DefaultView.aspx?id=1-320351055,0,0,,
Supreme Care Solutions,1-15295823917,SCL,7 Southmead Way,,,Walsall,,WS2 8JD,Tel: 07956656730,No ratings yet Rate it yourself - /Services/careproviders/LeaveReview/DefaultView.aspx?id=1-15295823917,0,0,,
Hill Top Lodge,1-125711848,SCL,93-95 Hill Top,,,West Bromwich,West Midlands,B70 0PX,Tel: 01215563322,No ratings yet Rate it yourself - /Services/careproviders/LeaveReview/DefaultView.aspx?id=1-125711848,0,0,,
156 Tyndale Crescent,1-15084140959,SCL,156 Tyndale Crescent,,,Birmingham,,B43 7HU,Tel: 07886916441,No ratings yet Rate it yourself - /Services/careproviders/LeaveReview/DefaultView.aspx?id=1-15084140959,0,0,,
5 Care Services Limited,1-219868345,SCL,The Enterprise Hub,34 Green Lane,,Walsall,West Midlands,WS2 8HB,Tel: 01922626064,No ratings yet Rate it yourself - /Services/careproviders/LeaveReview/DefaultView.aspx?id=1-219868345,0,0,,
Sevacare - Wednesbury,1-3705249936,SCL,Isis House,Smith Road,,Wednesbury,West Midlands,WS10 0PB,Tel: 01218200076,2 ratings Rate it yourself - /Services/careproviders/LeaveReview/DefaultView.aspx?id=1-3705249936,,,,
The Arbury,1-14977410675,SCL,2 Arbury Grove,,,Walsall,,WS3 1TF,Tel: 07946253488,No ratings yet Rate it yourself - /Services/careproviders/LeaveReview/DefaultView.aspx?id=1-14977410675,0,0,,
Home Address,1-18936674240,SCL,45 Fowlmere Road,,,Birmingham,,B42 2DZ,Tel: 07854794339,No ratings yet Rate it yourself - /Services/careproviders/LeaveReview/DefaultView.aspx?id=1-18936674240,0,0,,
67 Ruskin Street,1-6905534263,SCL,67 Ruskin Street,,,West Bromwich,,B71 1LR,Tel: 01215531465,No ratings yet Rate it yourself - /Services/careproviders/LeaveReview/DefaultView.aspx?id=1-6905534263,0,0,,
Dovedale Court,1-319476674,SCL,Holyhead Road,,,Wednesbury,West Midlands,WS10 7PZ,Tel: 01215026444,3 ratings Rate it yourself - /Services/careproviders/LeaveReview/DefaultView.aspx?id=1-319476674,,,,
Housing 21 - Oakley Gardens,1-2249132614,SCL,82 Oakley Gardens,Dial Lane,,West Bromwich,West Midlands,B70 0EH,Tel: 03701924000,No ratings yet Rate it yourself - /Services/careproviders/LeaveReview/DefaultView.aspx?id=1-2249132614,0,0,,
Rubery Court,1-2396350652,SCL,55-57 Walsall Road,Darlaston,,Walsall,West Midlands,WS10 9JS,Tel: 01212851171,4 ratings Rate it yourself - /Services/careproviders/LeaveReview/DefaultView.aspx?id=1-2396350652,,,,
Carters Green Healthcare Services Limited,1-12688847140,SCL,Parkview House,Woodward Street,,West Bromwich,,B71 4AP,Tel: 07708764993,No ratings yet Rate it yourself - /Services/careproviders/LeaveReview/DefaultView.aspx?id=1-12688847140,0,0,,
Forever Care,1-8687203641,SCL,228 Lichfield Road,Rushall,,Walsall,,WS4 1SA,Tel: 01922642777,No ratings yet Rate it yourself - /Services/careproviders/LeaveReview/DefaultView.aspx?id=1-8687203641,0,0,,
Sandwell Shared Lives,1-403742589,SCL,Summer Street,,,West Bromwich,West Midlands,B71 4JA,Tel: 01215694467,No ratings yet Rate it yourself - /Services/careproviders/LeaveReview/DefaultView.aspx?id=1-403742589,0,0,,
Crestar Healthcare,1-2106265434,SCL,Grenville House,New Swan Lane,,West Bromwich,West Midlands,B70 0NS,Tel: 01215720043,No ratings yet Rate it yourself - /Services/careproviders/LeaveReview/DefaultView.aspx?id=1-2106265434,0,0,,
Ashmill Residential Care Home,1-1597646991,SCL,141 Millfield Road,,,Birmingham,West Midlands,B20 1EA,Tel: 01213586280,No ratings yet Rate it yourself - /Services/careproviders/LeaveReview/DefaultView.aspx?id=1-1597646991,0,0,,
Step-forward support services,1-2931295389,SCL,129 Millfield Road,,,Birmingham,West Midlands,B20 1EA,Tel: 07411381412,No ratings yet Rate it yourself - /Services/careproviders/LeaveReview/DefaultView.aspx?id=1-2931295389,0,0,,
Orlando Care Homes LTD,1-14380731854,SCL,Old Bank Innovation Centre,"35-37 King Street, Darlaston",,Wednesbury,,WS10 8DE,Tel: 07727124128,No ratings yet Rate it yourself - /Services/careproviders/LeaveReview/DefaultView.aspx?id=1-14380731854,0,0,,
SD Home Care Ltd,1-6710182324,SCL,37 King Street,Darlaston,,Wednesbury,,WS10 8DE,Tel: 01922324088,No ratings yet Rate it yourself - /Services/careproviders/LeaveReview/DefaultView.aspx?id=1-6710182324,0,0,,
Blue Skies Healthcare,1-11768254081,SCL,"Suite F10, Old Bank Innovation Centre","35-37 King Street, Darlaston",,Wednesbury,,WS10 8DE,Tel: 01217961931,1 rating Rate it yourself - /Services/careproviders/LeaveReview/DefaultView.aspx?id=1-11768254081,,,,
Silverbirch Home,1-248286112,SCL,14 - 16 Beauchamp Avenue,Handsworth Wood,,Birmingham,West Midlands,B20 1DR,Tel: 01212412376,No ratings yet Rate it yourself - /Services/careproviders/LeaveReview/DefaultView.aspx?id=1-248286112,0,0,,
Health Matters,1-2828593075,SCL,Office at Health Matters,14-16 Beauchamp Avenue,,Birmingham,,B20 1DR,,No ratings yet Rate it yourself - /Services/careproviders/LeaveReview/DefaultView.aspx?id=1-2828593075,0,0,,
A & A Services West Midlands,1-13928160047,SCL,1 Church Street,Darlaston,,Wednesbury,,WS10 8DS,Tel: 01922333019,No ratings yet Rate it yourself - /Services/careproviders/LeaveReview/DefaultView.aspx?id=1-13928160047,0,0,,
Lonsdale Midlands Ltd - New Street North,1-131378000,SCL,1-5 New Street North,,,West Bromwich,West Midlands,B71 4AQ,Tel: 01215531755,No ratings yet Rate it yourself - /Services/careproviders/LeaveReview/DefaultView.aspx?id=1-131378000,0,0,,
Arboretum Nursing Home,1-10392924945,SCL,Forest Lane,,,Walsall,West Midlands,WS2 7AF,Tel: 01922725276,No ratings yet Rate it yourself - /Services/careproviders/LeaveReview/DefaultView.aspx?id=1-10392924945,0,0,,
Bush Rest Home,1-429405828,SCL,37-39 Bush Street,,,Wednesbury,West Midlands,WS10 8LE,Tel: 01215265914,No ratings yet Rate it yourself - /Services/careproviders/LeaveReview/DefaultView.aspx?id=1-429405828,0,0,,
Newday Healthcare Links Ltd,1-18580518245,SCL,27 Birchover Road,,,Walsall,,WS2 8TU,Tel: 07886977469,No ratings yet Rate it yourself - /Services/careproviders/LeaveReview/DefaultView.aspx?id=1-18580518245,0,0,,
QUALITY LIVING CARE LIMITED,1-13586930697,SCL,101 Hamstead Hall Road,,,Birmingham,,B20 1JA,Tel: 07852252480,No ratings yet Rate it yourself - /Services/careproviders/LeaveReview/DefaultView.aspx?id=1-13586930697,0,0,,
Houghton Care Limited,1-16875152428,SCL,6a,Whateley Road,,Walsall,,WS3 1QZ,Tel: 07490127052,No ratings yet Rate it yourself - /Services/careproviders/LeaveReview/DefaultView.aspx?id=1-16875152428,0,0,,
Saving Care Ltd,1-18786931447,SCL,43-45,"Church Street, Darlaston",,Wednesbury,,WS10 8DU,Tel: 07732957574,No ratings yet Rate it yourself - /Services/careproviders/LeaveReview/DefaultView.aspx?id=1-18786931447,0,0,,
Ruchare  Ltd,1-18034311998,SCL,Old Bank Business Centre,"43 - 45 Church Street,",,Wednesbury,,WS10 8DU,Tel: 07403392047,No ratings yet Rate it yourself - /Services/careproviders/LeaveReview/DefaultView.aspx?id=1-18034311998,0,0,,