Organisation Name,NACS Code,Organisation Type,Address1,Address2,Address3,Address4,Address5,PostCode,Telephone Number,NHS.UK users rating,Value  (NHS.UK users rating),Banding Classification  (NHS.UK users rating),Car parking (Is there car parking at this organisation?),Disabled access (Disabled access)
Woodfields Residential Home,1-154529743,SCL,Old Hill,Tettenhall,,Wolverhampton,West Midlands,WV6 8QB,Tel: 01902753221,No ratings yet Rate it yourself - /Services/careproviders/LeaveReview/DefaultView.aspx?id=1-154529743,0,0,,
British Elderly Care Wolverhampton,1-18096263780,SCL,53 Newbridge Crescent,,,Wolverhampton,,WV6 0LH,Tel: 01902921475,No ratings yet Rate it yourself - /Services/careproviders/LeaveReview/DefaultView.aspx?id=1-18096263780,0,0,,
Newbridge House,1-190404213,SCL,261 Tettenhall Road,,,Wolverhampton,West Midlands,WV6 0DE,Tel: 01902751092,No ratings yet Rate it yourself - /Services/careproviders/LeaveReview/DefaultView.aspx?id=1-190404213,0,0,,
Coton Grange,1-583217505,SCL,Stockwell End,Tettenhall,,Wolverhampton,West Midlands,WV6 9PH,Tel: 01902757785,No ratings yet Rate it yourself - /Services/careproviders/LeaveReview/DefaultView.aspx?id=1-583217505,0,0,,
Your Life (Tettenhall),1-5262076614,SCL,"Thorneycroft, Wood Road",Tettenhall,,Wolverhampton,,WV6 8PR,Tel: 01902753456,No ratings yet Rate it yourself - /Services/careproviders/LeaveReview/DefaultView.aspx?id=1-5262076614,0,0,,
Inspirations,1-737924032,SCL,171 Tettenhall Road,Tettenhall,,Wolverhampton,West Midlands,WV6 0BZ,Tel: 01902710938,No ratings yet Rate it yourself - /Services/careproviders/LeaveReview/DefaultView.aspx?id=1-737924032,0,0,,
Mancroft,1-318519330,SCL,2 Mancroft Road,,,Wolverhampton,West Midlands,WV6 8RS,Tel: 01902742428,No ratings yet Rate it yourself - /Services/careproviders/LeaveReview/DefaultView.aspx?id=1-318519330,0,0,,
Atiba House,1-2261088546,SCL,50-51 Sweetman Street,,,Wolverhampton,West Midlands,WV6 0EN,Tel: 01902425627,2 ratings Rate it yourself - /Services/careproviders/LeaveReview/DefaultView.aspx?id=1-2261088546,,,,
Redhouse,1-628269739,SCL,9 Redhouse Road,,,Wolverhampton,West Midlands,WV6 8SU,Tel: 01902742428,No ratings yet Rate it yourself - /Services/careproviders/LeaveReview/DefaultView.aspx?id=1-628269739,0,0,,
Apple Tree,1-12045246469,SCL,74 Albert Road,,,Wolverhampton,,WV6 0AF,Tel: 07530880120,No ratings yet Rate it yourself - /Services/careproviders/LeaveReview/DefaultView.aspx?id=1-12045246469,0,0,,
Eversleigh Care Centre,1-173717262,SCL,52-62 Albert Road,West Park,,Wolverhampton,West Midlands,WV6 0AF,Tel: 01902426323,No ratings yet Rate it yourself - /Services/careproviders/LeaveReview/DefaultView.aspx?id=1-173717262,0,0,,
Advance Healthcare (James Beattie House),1-12943273064,SCL,James Beattie House,Foley Avenue,,Wolverhampton,,WV6 8NS,Tel: 01902755388,No ratings yet Rate it yourself - /Services/careproviders/LeaveReview/DefaultView.aspx?id=1-12943273064,0,0,,
Atholl House Nursing Home,1-120084277,SCL,98-100 Richmond Road,Compton,,Wolverhampton,West Midlands,WV3 9JJ,Tel: 01902599900,1 rating Rate it yourself - /Services/careproviders/LeaveReview/DefaultView.aspx?id=1-120084277,,,,
Arbour Lodge,1-140007719,SCL,92 Richmond Road,Compton,,Wolverhampton,West Midlands,WV3 9JJ,Tel: 01902771136,No ratings yet Rate it yourself - /Services/careproviders/LeaveReview/DefaultView.aspx?id=1-140007719,0,0,,
Parkdale Care Home,1-10770398863,SCL,91 Tettenhall Road,,,Wolverhampton,West Midlands,WV3 9PG,Tel: 01902710581,2 ratings Rate it yourself - /Services/careproviders/LeaveReview/DefaultView.aspx?id=1-10770398863,,,,
Integra Supported Housing,1-498786000,SCL,Integra Support - Office S4,"Deansgate Offices, Tettenhall Road",,Wolverhampton,,WV1 4TH,Tel: 01384288220,3 ratings Rate it yourself - /Services/careproviders/LeaveReview/DefaultView.aspx?id=1-498786000,,,,
Revelation 22 Care,1-2154152080,SCL,182-183 Newhampton Road East,,,Wolverhampton,West Midlands,WV1 4PQ,Tel: 07979371663,No ratings yet Rate it yourself - /Services/careproviders/LeaveReview/DefaultView.aspx?id=1-2154152080,0,0,,
Engleberg Care Home,1-18581728938,SCL,1 Ash Hill,,,Wolverhampton,,WV3 9DR,Tel: 01902420613,No ratings yet Rate it yourself - /Services/careproviders/LeaveReview/DefaultView.aspx?id=1-18581728938,0,0,,
Caring Care Limited,1-3209561032,SCL,"Suites A B & C, The Westlands",132 Compton Road,,Wolverhampton,,WV3 9QB,Tel: 03300563111,2 ratings Rate it yourself - /Services/careproviders/LeaveReview/DefaultView.aspx?id=1-3209561032,,,,
Park Road CCT,1-6809185747,SCL,22 Park Road West,,,Wolverhampton,,WV1 4PN,Tel: 01902854259,No ratings yet Rate it yourself - /Services/careproviders/LeaveReview/DefaultView.aspx?id=1-6809185747,0,0,,
Sandwell,1-9629958195,SCL,6 The Mews,,,Wolverhampton,,WV6 8FA,Tel: 07843274572,1 rating Rate it yourself - /Services/careproviders/LeaveReview/DefaultView.aspx?id=1-9629958195,,,,
Foxland Grange,1-11462648264,SCL,73 Wergs Road,,,Wolverhampton,West Midlands,WV6 9BN,Tel: 01902925921,No ratings yet Rate it yourself - /Services/careproviders/LeaveReview/DefaultView.aspx?id=1-11462648264,0,0,,
Foxland Grange,1-11480269893,SCL,73 Wergs Road,,,Wolverhampton,West Midlands,WV6 9BN,Tel: 01902774100,No ratings yet Rate it yourself - /Services/careproviders/LeaveReview/DefaultView.aspx?id=1-11480269893,0,0,,
Wrottesley Park House Care Home,1-160749145,SCL,Wergs Road,Tettenhall,,Wolverhampton,West midlands,WV6 9BN,Tel: 01902750040,No ratings yet Rate it yourself - /Services/careproviders/LeaveReview/DefaultView.aspx?id=1-160749145,0,0,,
Britannia Social Care,1-4734516220,SCL,90 Compton Road,,,Wolverhampton,,WV3 9PS,Tel: 03302230172,No ratings yet Rate it yourself - /Services/careproviders/LeaveReview/DefaultView.aspx?id=1-4734516220,0,0,,
Totally Care Limited,1-7388600925,SCL,4 Compton Road,,,Wolverhampton,,WV3 9PH,Tel: 01902973222,No ratings yet Rate it yourself - /Services/careproviders/LeaveReview/DefaultView.aspx?id=1-7388600925,0,0,,
CM Community Care Services Limited,1-126016558,SCL,Lincoln Lodge,2 Tettenhall Road,,Wolverhampton,,WV1 4SA,Tel: 01902426364,1 rating Rate it yourself - /Services/careproviders/LeaveReview/DefaultView.aspx?id=1-126016558,,,,
Oak Cottage,1-14213419184,SCL,Oak Street,,,Wolverhampton,West Midlands,WV3 0AD,Tel: 01902212188,No ratings yet Rate it yourself - /Services/careproviders/LeaveReview/DefaultView.aspx?id=1-14213419184,0,0,,
Charnwood,1-110543857,SCL,7 Finchfield Road,Finchfield,,Wolverhampton,West Midlands,WV3 9LS,Tel: 01902424579,1 rating Rate it yourself - /Services/careproviders/LeaveReview/DefaultView.aspx?id=1-110543857,,,,
Pear Tree House,1-18686640914,SCL,19 Park Avenue,,,Wolverhampton,,WV1 4AH,Tel: 07311357919,No ratings yet Rate it yourself - /Services/careproviders/LeaveReview/DefaultView.aspx?id=1-18686640914,0,0,,
Eden Support Ltd,1-1456310911,SCL,Newhampton Arts Centre,Dunkley Street,,Wolverhampton,West Midlands,WV1 4AN,Tel: 01902771778,No ratings yet Rate it yourself - /Services/careproviders/LeaveReview/DefaultView.aspx?id=1-1456310911,0,0,,
Geocare Services Wolverhampton,1-9440117254,SCL,Regent House,Bath Avenue,,Wolverhampton,West Midlands,WV1 4EG,Tel: 01902810119,No ratings yet Rate it yourself - /Services/careproviders/LeaveReview/DefaultView.aspx?id=1-9440117254,0,0,,
Ignite Nursing,1-14582792368,SCL,Regent House,Bath Avenue,,Wolverhampton,West Midlands,WV1 4EG,,No ratings yet Rate it yourself - /Services/careproviders/LeaveReview/DefaultView.aspx?id=1-14582792368,0,0,,
Medirite Healthcare,1-2159545366,SCL,Regent House,Bath Avenue,,Wolverhampton,West Midlands,WV1 4EG,Tel: 01902823438,No ratings yet Rate it yourself - /Services/careproviders/LeaveReview/DefaultView.aspx?id=1-2159545366,0,0,,
Edith healthcare Wolverhampton,1-9006652069,SCL,S2 Regent House,Bath Avenue,,Wolverhampton,,WV1 4EG,,No ratings yet Rate it yourself - /Services/careproviders/LeaveReview/DefaultView.aspx?id=1-9006652069,0,0,,
C & S Care Services Limited,1-112784475,SCL,Regent House,Bath Avenue,,Wolverhampton,West Midlands,WV1 4EG,,3 ratings Rate it yourself - /Services/careproviders/LeaveReview/DefaultView.aspx?id=1-112784475,,,,
Sunshine Recruitments Ltd,1-15980891601,SCL,"Regent House, Bath Avenue",,,Wolverhampton,,WV1 4EG,Tel: 07412223085,No ratings yet Rate it yourself - /Services/careproviders/LeaveReview/DefaultView.aspx?id=1-15980891601,0,0,,
Breeze Support Solutions,1-16389238020,SCL,Regent House,Bath Avenue,,Wolverhampton,West Midlands,WV1 4EG,Tel: 07983883566,No ratings yet Rate it yourself - /Services/careproviders/LeaveReview/DefaultView.aspx?id=1-16389238020,0,0,,
Hibiscus Domiciliary Care Agency,1-165008858,SCL,46 Yew Street,,,Wolverhampton,West Midlands,WV3 0DA,Tel: 01902716780,No ratings yet Rate it yourself - /Services/careproviders/LeaveReview/DefaultView.aspx?id=1-165008858,0,0,,
Nationwide Care Services Ltd (Wolverhampton),1-11809448494,SCL,The Old Rectory,57 Waterloo Road,,Wolverhampton,,WV1 4QH,Tel: 01902587121,No ratings yet Rate it yourself - /Services/careproviders/LeaveReview/DefaultView.aspx?id=1-11809448494,0,0,,
The Croft,1-118736780,SCL,20 Castlecroft Road,Finchfield,,Wolverhampton,West Midlands,WV3 8BT,Tel: 01902 380022,No ratings yet Rate it yourself - /Services/careproviders/LeaveReview/DefaultView.aspx?id=1-118736780,0,0,,
Home Office,1-13932988872,SCL,5 Barnwood Road,Pendeford,,Wolverhampton,,WV8 1UN,,No ratings yet Rate it yourself - /Services/careproviders/LeaveReview/DefaultView.aspx?id=1-13932988872,0,0,,
Prayngel Healthcare Limited,1-2110699995,SCL,Derwent House 42-46,Waterloo Road,,Wolverhampton,,WV1 4XB,Tel: 03303909535,1 rating Rate it yourself - /Services/careproviders/LeaveReview/DefaultView.aspx?id=1-2110699995,,,,
Carelight Healthcare Limited,1-16863469148,SCL,42-46 Waterloo Road,,,Wolverhampton,,WV1 4XB,,No ratings yet Rate it yourself - /Services/careproviders/LeaveReview/DefaultView.aspx?id=1-16863469148,0,0,,
TS Healthcare Limited,1-7566958465,SCL,11 Waterloo Road,,,Wolverhampton,West Midlands,WV1 4DJ,,No ratings yet Rate it yourself - /Services/careproviders/LeaveReview/DefaultView.aspx?id=1-7566958465,0,0,,
Martworld Care Services Limited,1-2937441998,SCL,"Waterloo Court, Offices 7 & 9",31 Waterloo Road,,Wolverhampton,,WV1 4DJ,Tel: 01902256397,1 rating Rate it yourself - /Services/careproviders/LeaveReview/DefaultView.aspx?id=1-2937441998,,,,
Gillz Care Ltd,1-15068901059,SCL,"Suite 1-3, 31 Waterloo Court",13 Waterloo Road,,Wolverhampton,,WV1 4DJ,Tel: 07481908194,No ratings yet Rate it yourself - /Services/careproviders/LeaveReview/DefaultView.aspx?id=1-15068901059,0,0,,
Zion Care Services Limited,1-10644063424,SCL,9 Waterloo Road,,,Wolverhampton,West Midlands,WV1 4DJ,Tel: 07368934880,1 rating Rate it yourself - /Services/careproviders/LeaveReview/DefaultView.aspx?id=1-10644063424,,,,
Care Angels Homecare Ltd,1-7694244777,SCL,9 Waterloo Road,,,Wolverhampton,West Midlands,WV1 4DJ,Tel: 01902275780,No ratings yet Rate it yourself - /Services/careproviders/LeaveReview/DefaultView.aspx?id=1-7694244777,0,0,,
Alie Limited,1-10710205051,SCL,36 Waterloo Road,,,Wolverhampton,,WV1 4BL,Tel: 07533058309,No ratings yet Rate it yourself - /Services/careproviders/LeaveReview/DefaultView.aspx?id=1-10710205051,0,0,,
Pathways of Hope Wolverhampton,1-16414250065,SCL,"Suite 1, Infinity House",14 Waterloo Road,,Wolverhampton,,WV1 4BL,Tel: 01902229624,No ratings yet Rate it yourself - /Services/careproviders/LeaveReview/DefaultView.aspx?id=1-16414250065,0,0,,
Quality Care Services 4U Ltd,1-17769315957,SCL,14 Waterloo Road,,,Wolverhampton,,WV1 4BS,Tel: 03445070132,No ratings yet Rate it yourself - /Services/careproviders/LeaveReview/DefaultView.aspx?id=1-17769315957,0,0,,
101 Healthcare Ltd,1-12941557120,SCL,"Infinity House, 14 Waterloo Road",,,Wolverhampton,,WV1 4BS,Tel: 01902283101,No ratings yet Rate it yourself - /Services/careproviders/LeaveReview/DefaultView.aspx?id=1-12941557120,0,0,,
Promises of Care,1-2501499161,SCL,80 Darlington Street,,,Wolverhampton,West Midlands,WV1 4JD,Tel: 01902587099,No ratings yet Rate it yourself - /Services/careproviders/LeaveReview/DefaultView.aspx?id=1-2501499161,0,0,,
Midas Care Solutions Ltd,1-3071594767,SCL,Trafalgar House,81-83 Darlington Street,,Wolverhampton,,WV1 4JD,Tel: 01902587062,1 rating Rate it yourself - /Services/careproviders/LeaveReview/DefaultView.aspx?id=1-3071594767,,,,
CeeTee Healthcare Services,1-14383210881,SCL,"Regus, 84 Salop Street",,,Wolverhampton,,WV3 0SR,Tel: 01902973481,No ratings yet Rate it yourself - /Services/careproviders/LeaveReview/DefaultView.aspx?id=1-14383210881,0,0,,
Cergus Group Limited,1-13594347857,SCL,84 Salop Street,,,Wolverhampton,,WV3 0SR,Tel: 01902973456,No ratings yet Rate it yourself - /Services/careproviders/LeaveReview/DefaultView.aspx?id=1-13594347857,0,0,,
"Whiteshed Healthcare, Wolverhampton",1-14567008830,SCL,84 Salop Street,"3rd & 4th Floors,",,Wolverhampton,,WV3 0SR,Tel: 07445031390,No ratings yet Rate it yourself - /Services/careproviders/LeaveReview/DefaultView.aspx?id=1-14567008830,0,0,,
Head Office,1-13945958923,SCL,317 Regus 3rd Floor,84 Salop Street,,Wolverhampton,,WV3 0SR,Tel: 07932028658,No ratings yet Rate it yourself - /Services/careproviders/LeaveReview/DefaultView.aspx?id=1-13945958923,0,0,,
ONECARE WORLD HEALTH LIMITED,1-14683734761,SCL,"3rd and 4th Floor, 84 Salop Street",Office 427,,Wolverhampton,,WV3 0SR,Tel: 07464462997,No ratings yet Rate it yourself - /Services/careproviders/LeaveReview/DefaultView.aspx?id=1-14683734761,0,0,,
Sylviancare Wolverhampton,1-14920409702,SCL,84 Salop Street,,,Wolverhampton,,WV3 0SR,Tel: 01902229544,No ratings yet Rate it yourself - /Services/careproviders/LeaveReview/DefaultView.aspx?id=1-14920409702,0,0,,
Lovage Homecare Ltd,1-12903720590,SCL,"Office 424, 4th Floor, 84 Salop Street",,,Wolverhampton,,WV3 0SR,Tel: 07411757500,No ratings yet Rate it yourself - /Services/careproviders/LeaveReview/DefaultView.aspx?id=1-12903720590,0,0,,
Acton Banks Homecare Limited,1-10153709583,SCL,84 Salop Street,,,Wolverhampton,,WV3 0SR,Tel: 01902711855,No ratings yet Rate it yourself - /Services/careproviders/LeaveReview/DefaultView.aspx?id=1-10153709583,0,0,,
Woodford Homecare,1-1233887220,SCL,84 Salop Street,3rd Floor Office Suite 319,,Wolverhampton,,WV3 0SR,Tel: 07764664084,1 rating Rate it yourself - /Services/careproviders/LeaveReview/DefaultView.aspx?id=1-1233887220,,,,
Rance Healthcare Services Ltd,1-11775024685,SCL,84 Salop Street,3rd and 4th Floors,,Wolverhampton,,WV3 0SR,Tel: 01902973451,No ratings yet Rate it yourself - /Services/careproviders/LeaveReview/DefaultView.aspx?id=1-11775024685,0,0,,
Beyond Support Limited,1-4187252777,SCL,Regus 84 Salop Street,3rd & 4th floors,,Wolverhampton,,WV3 0SR,Tel: 01217924377,No ratings yet Rate it yourself - /Services/careproviders/LeaveReview/DefaultView.aspx?id=1-4187252777,0,0,,
Smithridge main office,1-13981573792,SCL,22 Darlington Street,,,Wolverhampton,,WV1 4HW,,No ratings yet Rate it yourself - /Services/careproviders/LeaveReview/DefaultView.aspx?id=1-13981573792,0,0,,
Essentia Health Pro Office,1-14431717122,SCL,118-119,Salop Street,,Wolverhampton,,WV3 0RX,Tel: 07722526149,No ratings yet Rate it yourself - /Services/careproviders/LeaveReview/DefaultView.aspx?id=1-14431717122,0,0,,
Sinai Care Solutions Limited,1-2950714170,SCL,"Office Suite 2, 178 Stafford Street",,,Wolverhampton,,WV1 1NA,,1 rating Rate it yourself - /Services/careproviders/LeaveReview/DefaultView.aspx?id=1-2950714170,,,,
Abimatic Care Ltd,1-15356238395,SCL,178 Goodwood Drive,,,Wolverhampton,,WV10 6GP,Tel: 07954853554,No ratings yet Rate it yourself - /Services/careproviders/LeaveReview/DefaultView.aspx?id=1-15356238395,0,0,,
Brown Glass Ltd trading Brown Glass Health Care Services,1-11331685094,SCL,2 Mayflower Gardens,,,Wolverhampton,,WV10 6EF,,No ratings yet Rate it yourself - /Services/careproviders/LeaveReview/DefaultView.aspx?id=1-11331685094,0,0,,
ABC Care and Support Services Limited,1-16436271853,SCL,Westbury House,Westbury Street,,Wolverhampton,West Midlands,WV1 1JD,Tel: 01902393940,No ratings yet Rate it yourself - /Services/careproviders/LeaveReview/DefaultView.aspx?id=1-16436271853,0,0,,
ABC Support Limited,1-15763848918,SCL,Westbury House,Westbury Street,,Wolverhampton,West Midlands,WV1 1JD,Tel: 01902393940,No ratings yet Rate it yourself - /Services/careproviders/LeaveReview/DefaultView.aspx?id=1-15763848918,0,0,,
Aspen Lodge Residential Care Home,1-2635321208,SCL,Upper Zoar Street,,,Wolverhampton,West Midlands,WV3 0JH,Tel: 01902 444069,2 ratings Rate it yourself - /Services/careproviders/LeaveReview/DefaultView.aspx?id=1-2635321208,,,,
Welbeck House,1-138480271,SCL,42 Welbeck Avenue,,,Wolverhampton,West Midlands,WV10 9LS,Tel: 01902681909,No ratings yet Rate it yourself - /Services/careproviders/LeaveReview/DefaultView.aspx?id=1-138480271,0,0,,
Goldcrest Healthcare Service (Midlands),1-10233651067,SCL,28 Cleveland Street,,,Wolverhampton,,WV1 3HT,Tel: 01902972055,No ratings yet Rate it yourself - /Services/careproviders/LeaveReview/DefaultView.aspx?id=1-10233651067,0,0,,
Majestic Healthcare LTD,1-14234228045,SCL,"Unit 20, The Pressworks 36-38",Berry Street,,Wolverhampton,,WV1 1HA,,No ratings yet Rate it yourself - /Services/careproviders/LeaveReview/DefaultView.aspx?id=1-14234228045,0,0,,
Cyprus Care Ltd,1-18531153973,SCL,36 -38 Berry Street,,,Wolverhampton,,WV1 1HA,,No ratings yet Rate it yourself - /Services/careproviders/LeaveReview/DefaultView.aspx?id=1-18531153973,0,0,,
3 Angels Complex Care Services,1-12725754333,SCL,"Unit 18, The Pressworks",36 - 38 Berry Street,,Wolverhampton,,WV1 1HA,Tel: 07940778772,No ratings yet Rate it yourself - /Services/careproviders/LeaveReview/DefaultView.aspx?id=1-12725754333,0,0,,
Santos Care Limited,1-12038361290,SCL,36 -38  Berry Street,,,Wolverhampton,,WV1 1HA,Tel: 01902427605,2 ratings Rate it yourself - /Services/careproviders/LeaveReview/DefaultView.aspx?id=1-12038361290,,,,
Sublime Care Solution,1-5987198251,SCL,Office 1-3 Pressworks,36-38 Berry Street,,Wolverhampton,,WV1 1HA,Tel: 01902239014,No ratings yet Rate it yourself - /Services/careproviders/LeaveReview/DefaultView.aspx?id=1-5987198251,0,0,,
Helping Hands Wolverhampton,1-2899938231,SCL,1 Anders Square,Perton,,Wolverhampton,West Midlands,WV6 7QH,Tel: 01902544796,No ratings yet Rate it yourself - /Services/careproviders/LeaveReview/DefaultView.aspx?id=1-2899938231,0,0,,
Ezekiel 37 Care Ltd,1-17195953857,SCL,93 Humphries Road,,,Wolverhampton,,WV10 9NA,,No ratings yet Rate it yourself - /Services/careproviders/LeaveReview/DefaultView.aspx?id=1-17195953857,0,0,,
CARE-A-LOT LIMITED,1-12083470911,SCL,43 Guy Avenue,,,Wolverhampton,,WV10 9SB,,No ratings yet Rate it yourself - /Services/careproviders/LeaveReview/DefaultView.aspx?id=1-12083470911,0,0,,
Ave Maria Care (Wolverhampton),1-10090641405,SCL,Kings House,St. Johns Square,,Wolverhampton,,WV2 4DT,Tel: 03301075949,No ratings yet Rate it yourself - /Services/careproviders/LeaveReview/DefaultView.aspx?id=1-10090641405,0,0,,
Enable Carers Limited,1-12501881509,SCL,Stewart House,18 Stewart Street,,Wolverhampton,,WV2 4JW,,No ratings yet Rate it yourself - /Services/careproviders/LeaveReview/DefaultView.aspx?id=1-12501881509,0,0,,
Blu-Sky Care Limited,1-446703229,SCL,Flat 1,"Hanover House, 11 George Street",,Wolverhampton,,WV2 4DG,Tel: 01902420571,No ratings yet Rate it yourself - /Services/careproviders/LeaveReview/DefaultView.aspx?id=1-446703229,0,0,,
85 Hawksford Crescent,1-14715827599,SCL,85 Hawksford Crescent,,,Wolverhampton,,WV10 9SP,Tel: 07533159282,No ratings yet Rate it yourself - /Services/careproviders/LeaveReview/DefaultView.aspx?id=1-14715827599,0,0,,
Enduring Hearts Limited,1-18722845359,SCL,85 Hawksford Crescent,,,Wolverhampton,,WV10 9SP,,No ratings yet Rate it yourself - /Services/careproviders/LeaveReview/DefaultView.aspx?id=1-18722845359,0,0,,
Swan Care Solutions,1-9267859487,SCL,Suite 203 Denning House,1a George Street,,Wolverhampton,,WV2 4DP,Tel: 07925665692,2 ratings Rate it yourself - /Services/careproviders/LeaveReview/DefaultView.aspx?id=1-9267859487,,,,
Truth Recruitment Ltd,1-19059589481,SCL,1a,George Street,,Wolverhampton,,WV2 4DP,,No ratings yet Rate it yourself - /Services/careproviders/LeaveReview/DefaultView.aspx?id=1-19059589481,0,0,,
Showell Court,1-122285673,SCL,Othello Road,Low Hill,,Wolverhampton,West Midlands,WV10 9NN,Tel: 03001112511,No ratings yet Rate it yourself - /Services/careproviders/LeaveReview/DefaultView.aspx?id=1-122285673,0,0,,
Qualita Healthcare and Recruitment Ltd,1-18687996064,SCL,22 Fordhouse Road,,,Wolverhampton,,WV10 9EA,Tel: 07727304799,No ratings yet Rate it yourself - /Services/careproviders/LeaveReview/DefaultView.aspx?id=1-18687996064,0,0,,
Secure Healthcare Limited,1-2920287949,SCL,"Suite One, Grand Station",Sun Street,,Wolverhampton,West Midlands,WV10 0BF,Tel: 01902302017,No ratings yet Rate it yourself - /Services/careproviders/LeaveReview/DefaultView.aspx?id=1-2920287949,0,0,,
Meadowcroft Residential Care Home,1-113064953,SCL,197-199 Bushbury Lane,,,Wolverhampton,West Midlands,WV10 9TY,Tel: 01902307170,No ratings yet Rate it yourself - /Services/careproviders/LeaveReview/DefaultView.aspx?id=1-113064953,0,0,,
The Cedar Grange Care Home,1-17933794373,SCL,453 Stafford Road,,,Wolverhampton,,WV10 6RR,,No ratings yet Rate it yourself - /Services/careproviders/LeaveReview/DefaultView.aspx?id=1-17933794373,0,0,,
House of the Flame Lily,1-6592356837,SCL,144 Penn Road,,,Wolverhampton,West Midlands,WV3 0EE,Tel: 03334560120,No ratings yet Rate it yourself - /Services/careproviders/LeaveReview/DefaultView.aspx?id=1-6592356837,0,0,,
Orchard House Nursing Home,1-132009507,SCL,16-18 Riley Crescent,Penn,,Wolverhampton,West Midlands,WV3 7DS,Tel: 01902653500,No ratings yet Rate it yourself - /Services/careproviders/LeaveReview/DefaultView.aspx?id=1-132009507,0,0,,
Lonsdale Midlands DCA,1-131377984,SCL,1st Floor St. Georges House,Lever Street,,Wolverhampton,,WV2 1EZ,Tel: 01905798247,No ratings yet Rate it yourself - /Services/careproviders/LeaveReview/DefaultView.aspx?id=1-131377984,0,0,,
Clarriots Care (Wolverhampton),1-2041386142,SCL,The Boot Factory,Cleveland Road,,Wolverhampton,West Midlands,WV2 1BP,Tel: 01902 456725,No ratings yet Rate it yourself - /Services/careproviders/LeaveReview/DefaultView.aspx?id=1-2041386142,0,0,,
Prospect Tree Health Care (Midlands) Ltd,1-2142610059,SCL,"First Floor Office Suite, The Boot Factory",Cleveland Road,,Wolverhampton,West Midlands,WV2 1BP,,1 rating Rate it yourself - /Services/careproviders/LeaveReview/DefaultView.aspx?id=1-2142610059,,,,
New Light Healthcare Limited,1-17050149236,SCL,28 Hawksford Crescent,,,Wolverhampton,,WV10 9SQ,Tel: 07704511296,No ratings yet Rate it yourself - /Services/careproviders/LeaveReview/DefaultView.aspx?id=1-17050149236,0,0,,
Creative Support - Wolverhampton Services,1-133366769,SCL,The Boot Factory,22 Cleveland Road,,Wolverhampton,West Midlands,WV2 1BH,Tel: 01902458797,No ratings yet Rate it yourself - /Services/careproviders/LeaveReview/DefaultView.aspx?id=1-133366769,0,0,,
Complesso Healthcare Solutions,1-2440773264,SCL,Suite 8 The Boot Factory,22 Cleveland Road,,Wolverhampton,,WV2 1BH,Tel: 07496363510,No ratings yet Rate it yourself - /Services/careproviders/LeaveReview/DefaultView.aspx?id=1-2440773264,0,0,,
L&J Agape Healthcare LTD,1-17590385781,SCL,32 Crathorne Avenue,,,Wolverhampton,,WV10 6BT,Tel: 07874290538,No ratings yet Rate it yourself - /Services/careproviders/LeaveReview/DefaultView.aspx?id=1-17590385781,0,0,,
Penn House Residential Home,1-3141087698,SCL,169-171 Penn Road,,,Wolverhampton,West Midlands,WV3 0EQ,Tel: 01902345470,2 ratings Rate it yourself - /Services/careproviders/LeaveReview/DefaultView.aspx?id=1-3141087698,,,,
Dayspring Care Agency,1-14204866194,SCL,110-111 Sunbeam Studios,Sunbeam Street,,Wolverhampton,,WV2 4PF,Tel: 07446180817,No ratings yet Rate it yourself - /Services/careproviders/LeaveReview/DefaultView.aspx?id=1-14204866194,0,0,,