Organisation Name,NACS Code,Organisation Type,Address1,Address2,Address3,Address4,Address5,PostCode,Telephone Number,NHS.UK users rating,Value  (NHS.UK users rating),Banding Classification  (NHS.UK users rating),Car parking (Is there car parking at this organisation?),Disabled access (Disabled access)
The Manor,1-707366425,SCL,The Green,Scotter,,Gainsborough,Lincolnshire,DN21 3UD,Tel: 01724 764884,No ratings yet Rate it yourself - /Services/careproviders/LeaveReview/DefaultView.aspx?id=1-707366425,0,0,,
Holly Tree Lodge,1-145762539,SCL,3 Eastgate,Scotton,,Gainsborough,Lincolnshire,DN21 3QR,Tel: 01724 762537,No ratings yet Rate it yourself - /Services/careproviders/LeaveReview/DefaultView.aspx?id=1-145762539,0,0,,
Dragonby Road,1-13301754042,SCL,15 - 27  Dragonby Road,,,Scunthorpe,,DN17 2LD,Tel: 01724706994,No ratings yet Rate it yourself - /Services/careproviders/LeaveReview/DefaultView.aspx?id=1-13301754042,0,0,,
Carisbrooke Manor,1-137468305,SCL,Carisbrooke Manor Lane,Old Barn,,Scunthorpe,Lincolnshire,DN17 2AA,Tel: 01724289555,No ratings yet Rate it yourself - /Services/careproviders/LeaveReview/DefaultView.aspx?id=1-137468305,0,0,,
Lindum Court,1-331492078,SCL,99-101 High Street,Owston Ferry,,Doncaster,Lincolnshire,DN9 1RL,Tel: 01427 728507,No ratings yet Rate it yourself - /Services/careproviders/LeaveReview/DefaultView.aspx?id=1-331492078,0,0,,
Sunningdale Court-Care Home,1-14963864466,SCL,Albert Road,Ashby,,Scunthorpe,,DN16 2TN,Tel: 01724844181,No ratings yet Rate it yourself - /Services/careproviders/LeaveReview/DefaultView.aspx?id=1-14963864466,0,0,,
Sycamore Lodge Care Home,1-2855203718,SCL,2 Burringham Road,Ashby,,Scunthorpe,South Humberside,DN17 2BB,Tel: 01724856963,No ratings yet Rate it yourself - /Services/careproviders/LeaveReview/DefaultView.aspx?id=1-2855203718,0,0,,
Amphion Home Care Services Limited,1-149381820,SCL,1 Modder Street,,,Scunthorpe,Lincolnshire,DN16 2SH,Tel: 01724844534,No ratings yet Rate it yourself - /Services/careproviders/LeaveReview/DefaultView.aspx?id=1-149381820,0,0,,
Edmund House,1-133850085,SCL,98-108 Everest Road,Ashby,,Scunthorpe,Lincolnshire,DN16 3EE,Tel: 01724844495,No ratings yet Rate it yourself - /Services/careproviders/LeaveReview/DefaultView.aspx?id=1-133850085,0,0,,
The Grange,1-9370217046,SCL,Everest Road,,,Scunthorpe,,DN16 3EF,Tel: 01724847956,1 rating Rate it yourself - /Services/careproviders/LeaveReview/DefaultView.aspx?id=1-9370217046,,,,
Cherry Tree House,1-278042240,SCL,Collum Avenue,Ashby,,Scunthorpe,Lincolnshire,DN16 2TF,Tel: 01724867879,No ratings yet Rate it yourself - /Services/careproviders/LeaveReview/DefaultView.aspx?id=1-278042240,0,0,,
Blyton Court,1-341989782,SCL,3 Laughton Road,Blyton,,Gainsborough,Lincolnshire,DN21 3LG,Tel: 01427628791,No ratings yet Rate it yourself - /Services/careproviders/LeaveReview/DefaultView.aspx?id=1-341989782,0,0,,
Gresham Lodge Care Home,1-2844899252,SCL,255 Ashby Road,,,Scunthorpe,South Humberside,DN16 2AB,Tel: 01724846504,No ratings yet Rate it yourself - /Services/careproviders/LeaveReview/DefaultView.aspx?id=1-2844899252,0,0,,
Phronesis Support Services,1-14921718926,SCL,17 Selby Court,,,Scunthorpe,,DN17 1QQ,,No ratings yet Rate it yourself - /Services/careproviders/LeaveReview/DefaultView.aspx?id=1-14921718926,0,0,,
Lowfield House Nursing Home,1-131820280,SCL,39 Cornwall Street,,,Kirton in Lindsey,Lincolnshire,DN21 4EH,Tel: 01652648835,No ratings yet Rate it yourself - /Services/careproviders/LeaveReview/DefaultView.aspx?id=1-131820280,0,0,,
Amara Care Limited,1-127490881,SCL,Artemis House,25 High Street,,Kirton Lindsey,Lincolnshire,DN21 4LX,,No ratings yet Rate it yourself - /Services/careproviders/LeaveReview/DefaultView.aspx?id=1-127490881,0,0,,
The Valleys Care Home,1-9105928964,SCL,Harpham Close,,,Scunthorpe,Lincolnshire,DN16 3AG,Tel: 01724854863,No ratings yet Rate it yourself - /Services/careproviders/LeaveReview/DefaultView.aspx?id=1-9105928964,0,0,,
Cherry Grove,1-14221314311,SCL,145 Cherry Grove,Ashby,,Scunthorpe,,DN16 2TH,Tel: 01724808108,No ratings yet Rate it yourself - /Services/careproviders/LeaveReview/DefaultView.aspx?id=1-14221314311,0,0,,
Elite Care Solutions Ltd,1-399408421,SCL,13-15 Beechway,,,Scunthorpe,,DN16 2HF,Tel: 01724855582,No ratings yet Rate it yourself - /Services/careproviders/LeaveReview/DefaultView.aspx?id=1-399408421,0,0,,
Bridgewater Park Care Home,1-11410246949,SCL,Bridgewater Road,,,Scunthorpe,Lincolnshire,DN17 1SN,Tel: 01724847323,No ratings yet Rate it yourself - /Services/careproviders/LeaveReview/DefaultView.aspx?id=1-11410246949,0,0,,
Richden Park Care Home,1-918399811,SCL,37-43 Old Brumby Street,,,Scunthorpe,South Humberside,DN16 2AJ,Tel: 01724280587,2 ratings Rate it yourself - /Services/careproviders/LeaveReview/DefaultView.aspx?id=1-918399811,,,,
Warley House,1-278177123,SCL,Warley Road,,,Scunthorpe,Lincolnshire,DN16 1PL,Tel: 01724861507,No ratings yet Rate it yourself - /Services/careproviders/LeaveReview/DefaultView.aspx?id=1-278177123,0,0,,
The Gables,1-4866406466,SCL,195 Ashby Road,,,Scunthorpe,Lincolnshire,DN16 2AQ,,No ratings yet Rate it yourself - /Services/careproviders/LeaveReview/DefaultView.aspx?id=1-4866406466,0,0,,
Headquarters,1-2460943350,SCL,Sovereign House,"Arkwright Way, Queensway Industrial Estate",,Scunthorpe,North Lincolnshire,DN16 1AL,Tel: 01724231100,No ratings yet Rate it yourself - /Services/careproviders/LeaveReview/DefaultView.aspx?id=1-2460943350,0,0,,
Balmoral House,1-435694430,SCL,Old Brumby Street,Old Brumby,,Scunthorpe,South Humberside,DN16 2DB,Tel: 01724854836,No ratings yet Rate it yourself - /Services/careproviders/LeaveReview/DefaultView.aspx?id=1-435694430,0,0,,
Holly House Care Home,1-131736099,SCL,124 High Street,Burringham,,Scunthorpe,Lincolnshire,DN17 3LY,,No ratings yet Rate it yourself - /Services/careproviders/LeaveReview/DefaultView.aspx?id=1-131736099,0,0,,
Lincolnshire House Association,1-113554875,SCL,Brumby Wood Lane,,,Scunthorpe,Lincolnshire,DN17 1AF,,No ratings yet Rate it yourself - /Services/careproviders/LeaveReview/DefaultView.aspx?id=1-113554875,0,0,,
North Lincolnshire Council - Myos House,1-11719239427,SCL,Myos House,Warwick Road,,Scunthorpe,,DN16 1EU,Tel: 01724 297770,No ratings yet Rate it yourself - /Services/careproviders/LeaveReview/DefaultView.aspx?id=1-11719239427,0,0,,
Althorpe Residential Home,1-151159112,SCL,3 Main Street,,,Althorpe,Lincolnshire,DN17 3HJ,,No ratings yet Rate it yourself - /Services/careproviders/LeaveReview/DefaultView.aspx?id=1-151159112,0,0,,
Care Plus Care (Isle) Ltd,1-1326791043,SCL,3 Main Street,Althorpe,,Scunthorpe,South Humberside,DN17 3HJ,Tel: 01724784588,No ratings yet Rate it yourself - /Services/careproviders/LeaveReview/DefaultView.aspx?id=1-1326791043,0,0,,
Ascot House,1-137903977,SCL,88/90 Oswald Road,,,Scunthorpe,Lincolnshire,DN15 7PA,Tel: 01724 867261,No ratings yet Rate it yourself - /Services/careproviders/LeaveReview/DefaultView.aspx?id=1-137903977,0,0,,
Saint Lawrence Residential Care Home,1-119634315,SCL,102-104 Oswald Road,,,Scunthorpe,South Humberside,DN15 7PA,Tel: 01724847082,No ratings yet Rate it yourself - /Services/careproviders/LeaveReview/DefaultView.aspx?id=1-119634315,0,0,,
Hales Group Limited - Scunthorpe,1-2428513405,SCL,84 Oswald Road,,,Scunthorpe,,DN15 7PA,Tel: 01724897266,No ratings yet Rate it yourself - /Services/careproviders/LeaveReview/DefaultView.aspx?id=1-2428513405,0,0,,
Creative Support - North Lincolnshire Services,1-3599481456,SCL,"Suite 2, Unit 4","Park Square, Laneham Street",,Scunthorpe,South Humberside,DN15 6JH,Tel: 01724845519,No ratings yet Rate it yourself - /Services/careproviders/LeaveReview/DefaultView.aspx?id=1-3599481456,0,0,,
Sandhills Court Care Home,1-4779751729,SCL,Exeter Road,,,Scunthorpe,,DN15 7DE,Tel: 01724333001,1 rating Rate it yourself - /Services/careproviders/LeaveReview/DefaultView.aspx?id=1-4779751729,,,,
JME Care Ltd - Community Care Services,1-8683927176,SCL,60 Mary Street,,,Scunthorpe,,DN15 6LB,Tel: 01724897374,1 rating Rate it yourself - /Services/careproviders/LeaveReview/DefaultView.aspx?id=1-8683927176,,,,
Norwood House,1-2232395530,SCL,15a Station Road,Gunness,,Scunthorpe,Lincolnshire,DN15 8SU,Tel: 01724 784333,No ratings yet Rate it yourself - /Services/careproviders/LeaveReview/DefaultView.aspx?id=1-2232395530,0,0,,
Ann Tuplin Care Services Limited,1-120031856,SCL,27 Wells Street,,,Scunthorpe,Lincolnshire,DN15 6HL,Tel: 01724270083,No ratings yet Rate it yourself - /Services/careproviders/LeaveReview/DefaultView.aspx?id=1-120031856,0,0,,
Baytree Court,1-9360962505,SCL,Normanby Road,,,Scunthorpe,Lincolnshire,DN15 6AR,Tel: 01724855410,No ratings yet Rate it yourself - /Services/careproviders/LeaveReview/DefaultView.aspx?id=1-9360962505,0,0,,
Randolph House Care Home,1-9932121789,SCL,Ferry Road West,,,Scunthorpe,Lincolnshire,DN15 8EA,Tel: 01724272500,No ratings yet Rate it yourself - /Services/careproviders/LeaveReview/DefaultView.aspx?id=1-9932121789,0,0,,
Redbourne,1-9827720814,SCL,High Street,Redbourne,,Gainsborough,Lincolnshire,DN21 4QU,Tel: 01652648581,No ratings yet Rate it yourself - /Services/careproviders/LeaveReview/DefaultView.aspx?id=1-9827720814,0,0,,
Rathside Rest Home,1-2745891333,SCL,41 Gainsborough Lane,Scawby,,Brigg,South Humberside,DN20 9BY,Tel: 01652652139,No ratings yet Rate it yourself - /Services/careproviders/LeaveReview/DefaultView.aspx?id=1-2745891333,0,0,,
St Mary's,1-10644978940,SCL,St. Marys Court,,,Scunthorpe,,DN15 8UP,Tel: 01724865461,No ratings yet Rate it yourself - /Services/careproviders/LeaveReview/DefaultView.aspx?id=1-10644978940,0,0,,
Cumberworth Lodge Care Home,1-6284504893,SCL,"Cumberworth Lodge, Main Street","Graizelound, Haxey",,Doncaster,,DN9 2NB,Tel: 01427752309,No ratings yet Rate it yourself - /Services/careproviders/LeaveReview/DefaultView.aspx?id=1-6284504893,0,0,,
Barley Close,1-4922103624,SCL,11 Barley Close,Hibaldstow,,Brigg,,DN20 9RU,Tel: 07725724660,No ratings yet Rate it yourself - /Services/careproviders/LeaveReview/DefaultView.aspx?id=1-4922103624,0,0,,
Phoenix Park Care Village,1-240142507,SCL,Phoenix Avenue,off Phoenix Parkway,,Scunthorpe,Lincolnshire,DN15 8NH,Tel: 01724289885,No ratings yet Rate it yourself - /Services/careproviders/LeaveReview/DefaultView.aspx?id=1-240142507,0,0,,
Amber House,1-254850934,SCL,12 Scawby Road,Broughton,,Brigg,Lincolnshire,DN20 0AF,Tel: 01724897470,No ratings yet Rate it yourself - /Services/careproviders/LeaveReview/DefaultView.aspx?id=1-254850934,0,0,,
Nicholas House Care Home,1-131676486,SCL,11 Church Street,Haxey,,Nr Doncaster,South Yorkshire,DN9 2HY,,No ratings yet Rate it yourself - /Services/careproviders/LeaveReview/DefaultView.aspx?id=1-131676486,0,0,,
Grosvenor House Care Home,1-115522855,SCL,19 Back Street,East Stockwith,,Gainsborough,Lincolnshire,DN21 3DL,Tel: 01427616950,No ratings yet Rate it yourself - /Services/careproviders/LeaveReview/DefaultView.aspx?id=1-115522855,0,0,,
North Lincolnshire Council-Home First Community Support,1-9737563720,SCL,Billet Lane,,,Scunthorpe,,DN15 9YH,Tel: 01724298190,No ratings yet Rate it yourself - /Services/careproviders/LeaveReview/DefaultView.aspx?id=1-9737563720,0,0,,
Options Watermill Lodge,1-676060822,SCL,Common Road,Wressle,,Brigg,South Humberside,DN20 0DA,,No ratings yet Rate it yourself - /Services/careproviders/LeaveReview/DefaultView.aspx?id=1-676060822,0,0,,
Options Watermill House,1-125064118,SCL,Common Road,Wressle,,Brigg,South Humberside,DN20 0DA,Tel: 01652652147,No ratings yet Rate it yourself - /Services/careproviders/LeaveReview/DefaultView.aspx?id=1-125064118,0,0,,
Eliot House,1-143686045,SCL,21 Crooked Billet Street,Morton,,Gainsborough,Lincolnshire,DN21 3AH,Tel: 01427 617545,No ratings yet Rate it yourself - /Services/careproviders/LeaveReview/DefaultView.aspx?id=1-143686045,0,0,,
Rose Meadow,1-306538661,SCL,119 Station Road,Misterton,,Doncaster,South Yorkshire,DN10 4DG,Tel: 01427891190,No ratings yet Rate it yourself - /Services/careproviders/LeaveReview/DefaultView.aspx?id=1-306538661,0,0,,
St Ogg's,1-131815621,SCL,14 Front Street,Morton,,Gainsborough,Lincolnshire,DN21 3AA,,No ratings yet Rate it yourself - /Services/careproviders/LeaveReview/DefaultView.aspx?id=1-131815621,0,0,,
Morton Manor,1-6973096326,SCL,Dog & Duck lane,Morton,,Gainsborough,Lincolnshire,DN21 3BB,Tel: 01427612796,No ratings yet Rate it yourself - /Services/careproviders/LeaveReview/DefaultView.aspx?id=1-6973096326,0,0,,
Carseld Residential Home,1-12952051865,SCL,Brickhills,Broughton,,Brigg,South Humberside,DN20 0BZ,Tel: 01652650613,No ratings yet Rate it yourself - /Services/careproviders/LeaveReview/DefaultView.aspx?id=1-12952051865,0,0,,
Castlethorpe Nursing Home,1-8532365631,SCL,Castlethorpe,,,Brigg,South Humberside,DN20 9LG,Tel: 01652654551,No ratings yet Rate it yourself - /Services/careproviders/LeaveReview/DefaultView.aspx?id=1-8532365631,0,0,,
Knights Home Care Services Ltd,1-2040477035,SCL,"Unit C1, Control and Power Engineering Building","Fox Covert Lane, Misterton",,Doncaster,South Yorkshire,DN10 4ER,Tel: 01427891483,No ratings yet Rate it yourself - /Services/careproviders/LeaveReview/DefaultView.aspx?id=1-2040477035,0,0,,
Beechcroft House,1-422111409,SCL,1 Collywood Close,Westwoodside,,Doncaster,,DN9 2RD,Tel: 01427753393,No ratings yet Rate it yourself - /Services/careproviders/LeaveReview/DefaultView.aspx?id=1-422111409,0,0,,
Tigh Bruadair,1-164911301,SCL,Summer Hill,,,Gainsborough,Lincolnshire,DN21 1HQ,Tel: 01427611541,No ratings yet Rate it yourself - /Services/careproviders/LeaveReview/DefaultView.aspx?id=1-164911301,0,0,,
Middlefield House Nursing Home,1-131820358,SCL,Middlefield Lane,,,Gainsborough,Lincolnshire,DN21 1TY,Tel: 01427615577,No ratings yet Rate it yourself - /Services/careproviders/LeaveReview/DefaultView.aspx?id=1-131820358,0,0,,
Visiting Angels Doncaster & Bassetlaw,1-11686477656,SCL,"Unit 1b, Britannia House",Marshalls Yard,,Gainsborough,,DN21 2NA,Tel: 01302  493646,No ratings yet Rate it yourself - /Services/careproviders/LeaveReview/DefaultView.aspx?id=1-11686477656,0,0,,
CRT - Lincolnshire Home Care,1-13681327542,SCL,Mercury House,Willoughton Drive,,Gainsborough,,DN21 1DY,Tel: 01522308143,No ratings yet Rate it yourself - /Services/careproviders/LeaveReview/DefaultView.aspx?id=1-13681327542,0,0,,
Trent Nursing,1-6406071969,SCL,"Mercury House,Foxby Lane Business Park",Willoughton Drive,,Gainsborough,,DN21 1DY,Tel: 03335773155,No ratings yet Rate it yourself - /Services/careproviders/LeaveReview/DefaultView.aspx?id=1-6406071969,0,0,,
Southfield House,1-131815653,SCL,Albert Street,,,Brigg,Lincolnshire,DN20 8HU,,No ratings yet Rate it yourself - /Services/careproviders/LeaveReview/DefaultView.aspx?id=1-131815653,0,0,,
Abbey Village,1-122169525,SCL,34 Wrawby Street,,,Brigg,Lincolnshire,DN20 8BP,Tel: 01652225548,No ratings yet Rate it yourself - /Services/careproviders/LeaveReview/DefaultView.aspx?id=1-122169525,0,0,,
Clarence House Care Home,1-1228649184,SCL,Albert Street,,,Brigg,South Humberside,DN20 8HS,Tel: 01652650950,No ratings yet Rate it yourself - /Services/careproviders/LeaveReview/DefaultView.aspx?id=1-1228649184,0,0,,
Ferndene Care Home,1-6387545940,SCL,Park Springs Road,,,Gainsborough,,DN21 1NY,Tel: 01427810700,No ratings yet Rate it yourself - /Services/careproviders/LeaveReview/DefaultView.aspx?id=1-6387545940,0,0,,
Orchard Court Residential Home Limited,1-142919468,SCL,7 Wrawby Road,,,Brigg,Lincolnshire,DN20 8DL,,No ratings yet Rate it yourself - /Services/careproviders/LeaveReview/DefaultView.aspx?id=1-142919468,0,0,,
The Birches - Care Home,1-127697467,SCL,Grammar School Road,,,Brigg,Lincolnshire,DN20 8BB,Tel: 01652652348,No ratings yet Rate it yourself - /Services/careproviders/LeaveReview/DefaultView.aspx?id=1-127697467,0,0,,
OSJCT Foxby Court,1-122145155,SCL,Middlefield Lane,,,Gainsborough,Lincolnshire,DN21 1QR,Tel: 01427613376,No ratings yet Rate it yourself - /Services/careproviders/LeaveReview/DefaultView.aspx?id=1-122145155,0,0,,
Kingsway Clayton House Residential Care Home,1-120084039,SCL,Clayton House,9-11 Lea Road,,Gainsborough,Lincolnshire,DN21 1LW,Tel: 01427613730,No ratings yet Rate it yourself - /Services/careproviders/LeaveReview/DefaultView.aspx?id=1-120084039,0,0,,
South Moor Lodge Care Home,1-1936419362,SCL,South Moor Lodge,"South Moor Road, Walkeringham",,Doncaster,South Yorkshire,DN10 4LD,Tel: 01427891204,No ratings yet Rate it yourself - /Services/careproviders/LeaveReview/DefaultView.aspx?id=1-1936419362,0,0,,
Foxby Hill Care Home Ltd,1-1211209898,SCL,Foxby Hill,,,Gainsborough,Lincolnshire,DN21 1PN,Tel: 01427 611231,1 rating Rate it yourself - /Services/careproviders/LeaveReview/DefaultView.aspx?id=1-1211209898,,,,
Greenacres Care Home,1-115003055,SCL,Fieldside,Crowle,,Scunthorpe,Lincolnshire,DN17 4HL,Tel: 01724711661,No ratings yet Rate it yourself - /Services/careproviders/LeaveReview/DefaultView.aspx?id=1-115003055,0,0,,
Drovers Call,1-214719691,SCL,186 Lea Road,,,Gainsborough,Lincolnshire,DN21 1AN,Tel: 01427678300,No ratings yet Rate it yourself - /Services/careproviders/LeaveReview/DefaultView.aspx?id=1-214719691,0,0,,
Keb House Residential Home,1-111624748,SCL,Haytons Lane,Appleby,,Scunthorpe,Lincolnshire,DN15 0AP,Tel: 01724733956,No ratings yet Rate it yourself - /Services/careproviders/LeaveReview/DefaultView.aspx?id=1-111624748,0,0,,
Options Thorpe House,1-125064102,SCL,Sawcliffe Hill,Dragonby,,Scunthorpe,Lincolnshire,DN15 0BJ,Tel: 01724847788,No ratings yet Rate it yourself - /Services/careproviders/LeaveReview/DefaultView.aspx?id=1-125064102,0,0,,
Options Roxby House,1-125064084,SCL,Winterton Road,Roxby,,Scunthorpe,Lincolnshire,DN15 0BJ,Tel: 01724733777,No ratings yet Rate it yourself - /Services/careproviders/LeaveReview/DefaultView.aspx?id=1-125064084,0,0,,
Redcote Residential Home,1-1165831480,SCL,23 Gainsborough Road,Lea,,Gainsborough,Lincolnshire,DN21 5HR,Tel: 01427615700,No ratings yet Rate it yourself - /Services/careproviders/LeaveReview/DefaultView.aspx?id=1-1165831480,0,0,,
Wrawby Hall,1-118067014,SCL,Vicarage Road,Wrawby,,Brigg,Lincolnshire,DN20 8RP,Tel: 01652 655311,No ratings yet Rate it yourself - /Services/careproviders/LeaveReview/DefaultView.aspx?id=1-118067014,0,0,,
Rosekeys,1-160860471,SCL,Gringley on the Hill,"Gainsborough Road, Gringley",,Doncaster,South Yorkshire,DN10 4RJ,Tel: 01777816923,No ratings yet Rate it yourself - /Services/careproviders/LeaveReview/DefaultView.aspx?id=1-160860471,0,0,,
Gilby House Nursing Home,1-131820147,SCL,9 High Street,,,Winterton,Lincolnshire,DN15 9PU,Tel: 01724734824,No ratings yet Rate it yourself - /Services/careproviders/LeaveReview/DefaultView.aspx?id=1-131820147,0,0,,
North Lincolnshire Council Home First Residential,1-1951783480,SCL,42 De Lacy Way,Winterton,,Scunthorpe,,DN15 9XS,Tel: 01724298444,No ratings yet Rate it yourself - /Services/careproviders/LeaveReview/DefaultView.aspx?id=1-1951783480,0,0,,
Blue Swan Health Care Limited,1-19025182895,SCL,The Old School House,"High Street, Willingham By Stow",,Gainsborough,,DN21 5JZ,Tel: 07940298224,No ratings yet Rate it yourself - /Services/careproviders/LeaveReview/DefaultView.aspx?id=1-19025182895,0,0,,
Howson Care Centre,1-126636150,SCL,Marton Road,Willingham-by-Stow,,Gainsborough,Lincolnshire,DN21 5JU,Tel: 01427788283,No ratings yet Rate it yourself - /Services/careproviders/LeaveReview/DefaultView.aspx?id=1-126636150,0,0,,
Holme Farm Residential Home,1-111167010,SCL,9 Church Street,Elsham,,Brigg,Lincolnshire,DN20 0RG,Tel: 01652688755,No ratings yet Rate it yourself - /Services/careproviders/LeaveReview/DefaultView.aspx?id=1-111167010,0,0,,
The Manor House,1-131820311,SCL,Whitton Road,Alkborough,,Scunthorpe,Lincolnshire,DN15 9JG,,No ratings yet Rate it yourself - /Services/careproviders/LeaveReview/DefaultView.aspx?id=1-131820311,0,0,,
Coulson the Bungalow,1-13820278596,SCL,"2 Saxby Road,",Owmby-by-spital,,Market Rasen,,LN8 2DA,Tel: 07484132219,No ratings yet Rate it yourself - /Services/careproviders/LeaveReview/DefaultView.aspx?id=1-13820278596,0,0,,
Chestnut House,1-131820068,SCL,62 High Street,Marton,,Gainsborough,Lincolnshire,DN21 5AW,,No ratings yet Rate it yourself - /Services/careproviders/LeaveReview/DefaultView.aspx?id=1-131820068,0,0,,
The Parklands Care Home,1-2026179939,SCL,26 Ellison Street,Thorne,,Doncaster,South Yorkshire,DN8 5LD,Tel: 01405812233,1 rating Rate it yourself - /Services/careproviders/LeaveReview/DefaultView.aspx?id=1-2026179939,,,,
Casson Court,1-9048644857,SCL,Church Street,Thorne,,Doncaster,,DN8 5BB,Tel: 03701924205,No ratings yet Rate it yourself - /Services/careproviders/LeaveReview/DefaultView.aspx?id=1-9048644857,0,0,,
Thorne House,1-1418638061,SCL,St Nicholas Road,Thorne,,Doncaster,South Yorkshire,DN8 5BG,Tel: 01405818171,No ratings yet Rate it yourself - /Services/careproviders/LeaveReview/DefaultView.aspx?id=1-1418638061,0,0,,
Pinnacle Care Professionals Ltd,1-15842008166,SCL,Orchard View,Harwell,,Doncaster,,DN10 5BU,Tel: 07732595163,No ratings yet Rate it yourself - /Services/careproviders/LeaveReview/DefaultView.aspx?id=1-15842008166,0,0,,
Caremark Doncaster,1-14336699500,SCL,"12 Sea King Drive, Fountain Court","Hayfield Lane, Auckley",,Doncaster,,DN9 3QR,Tel: 01302201392,No ratings yet Rate it yourself - /Services/careproviders/LeaveReview/DefaultView.aspx?id=1-14336699500,0,0,,
Gabs Healthcare,1-17716009483,SCL,5 Cambridge Drive,Thorne,,Doncaster,,DN8 4FD,Tel: 01302496010,No ratings yet Rate it yourself - /Services/careproviders/LeaveReview/DefaultView.aspx?id=1-17716009483,0,0,,
Autism Plus - Rusholme,1-1889942623,SCL,11 St Nicholas Road,Thorne,,Doncaster,South Yorkshire,DN8 5BS,Tel: 01405812128,No ratings yet Rate it yourself - /Services/careproviders/LeaveReview/DefaultView.aspx?id=1-1889942623,0,0,,
King Street,1-118871567,SCL,49 King Street,Thorne,,Doncaster,South Yorkshire,DN8 5AU,Tel: 01405818580,No ratings yet Rate it yourself - /Services/careproviders/LeaveReview/DefaultView.aspx?id=1-118871567,0,0,,
Clemence Rogers Home Care,1-5324653146,SCL,"Armstrong House, First Avenue",Finningley,,Doncaster,,DN9 3RH,Tel: 01302965114,No ratings yet Rate it yourself - /Services/careproviders/LeaveReview/DefaultView.aspx?id=1-5324653146,0,0,,
Bennfield House,1-342589734,SCL,65 King Edward Road,Thorne,,Doncaster,South Yorkshire,DN8 4DE,Tel: 01405812663,No ratings yet Rate it yourself - /Services/careproviders/LeaveReview/DefaultView.aspx?id=1-342589734,0,0,,
Autism Plus,1-1019548217,SCL,Fieldside Court,3 Field Road,,Doncaster,South Yorkshire,DN8 4AG,Tel: 01405812128,No ratings yet Rate it yourself - /Services/careproviders/LeaveReview/DefaultView.aspx?id=1-1019548217,0,0,,
Butterflies Care & Support Ltd,1-423741072,SCL,2 Eastfield,Sturton By Stow,,Lincoln,Lincolnshire,LN1 2DT,Tel: 07538742693,No ratings yet Rate it yourself - /Services/careproviders/LeaveReview/DefaultView.aspx?id=1-423741072,0,0,,
Northfield Care Centre,1-3562136917,SCL,Chace Court,Thorne,,Doncaster,South Yorkshire,DN8 4BW,Tel: 01405816042,2 ratings Rate it yourself - /Services/careproviders/LeaveReview/DefaultView.aspx?id=1-3562136917,,,,
Harry Priestley House,1-4317418850,SCL,30 Fieldside,Thorne,,Doncaster,,DN8 4BQ,Tel: 01405814777,No ratings yet Rate it yourself - /Services/careproviders/LeaveReview/DefaultView.aspx?id=1-4317418850,0,0,,
Matn Limited,1-16531681883,SCL,4 Wembley Road,Moorends,,Doncaster,,DN8 4PR,,No ratings yet Rate it yourself - /Services/careproviders/LeaveReview/DefaultView.aspx?id=1-16531681883,0,0,,
Adeline House Care Home,1-3152081284,SCL,Queen Street,Thorne,,Doncaster,South Yorkshire,DN8 5AQ,Tel: 01405815512,No ratings yet Rate it yourself - /Services/careproviders/LeaveReview/DefaultView.aspx?id=1-3152081284,0,0,,
Prospect House Residential Home,1-117650816,SCL,"Prospect House, Low Street",Swinefleet,,Goole,Humberside,DN14 8DF,Tel: 01405704259,No ratings yet Rate it yourself - /Services/careproviders/LeaveReview/DefaultView.aspx?id=1-117650816,0,0,,