Organisation Name,NACS Code,Organisation Type,Address1,Address2,Address3,Address4,Address5,PostCode,Telephone Number,NHS.UK users rating,Value  (NHS.UK users rating),Banding Classification  (NHS.UK users rating),Car parking (Is there car parking at this organisation?),Disabled access (Disabled access)
London Care (Olive House),1-7157058345,SCL,Olive House,185 Townmead Road,,London,,SW6 2JY,Tel: 02076106718,No ratings yet Rate it yourself - /Services/careproviders/LeaveReview/DefaultView.aspx?id=1-7157058345,0,0,,
Standard Care Limited,1-1932020955,SCL,"Unit 6, Townmead Business Centre",William Morris Way,,London,,SW6 2SZ,Tel: 02035926072,No ratings yet Rate it yourself - /Services/careproviders/LeaveReview/DefaultView.aspx?id=1-1932020955,0,0,,
Arale Group Limited,1-4427359780,SCL,"Unit 29, Townmead Business Centre",William Morris Way,,London,,SW6 2SZ,Tel: 02081296438,No ratings yet Rate it yourself - /Services/careproviders/LeaveReview/DefaultView.aspx?id=1-4427359780,0,0,,
"The Good Care Group at Riverstone, Fulham",1-13946286448,SCL,Riverstone Living,51 Townmead Road,,London,,SW6 2SY,,No ratings yet Rate it yourself - /Services/careproviders/LeaveReview/DefaultView.aspx?id=1-13946286448,0,0,,
Cambuslodge UK Limited,1-109489078,SCL,151 Wandsworth Bridge Road,Fulham,,London,,SW6 2TT,Tel: 02077315814,No ratings yet Rate it yourself - /Services/careproviders/LeaveReview/DefaultView.aspx?id=1-109489078,0,0,,
Wandsworth,1-18225078507,SCL,2 Holman Road,,,London,,SW11 3RL,Tel: 07551724231,No ratings yet Rate it yourself - /Services/careproviders/LeaveReview/DefaultView.aspx?id=1-18225078507,0,0,,
Hamilton George Care Ltd,1-11804914121,SCL,Unit 17,"Spice Court, Ivory Square",,London,,SW11 3UE,,No ratings yet Rate it yourself - /Services/careproviders/LeaveReview/DefaultView.aspx?id=1-11804914121,0,0,,
Home Instead,1-452823580,SCL,"Unit 1z1, Cooper House",2 Michael Road,,London,,SW6 2AD,Tel: 02079384111,No ratings yet Rate it yourself - /Services/careproviders/LeaveReview/DefaultView.aspx?id=1-452823580,0,0,,
George Potter House,1-139097930,SCL,130 Battersea High Street,"Battersea, Wandsworth",,London,,SW11 3JR,Tel: 02072233224,No ratings yet Rate it yourself - /Services/careproviders/LeaveReview/DefaultView.aspx?id=1-139097930,0,0,,
Harwood Road,1-116949710,SCL,95-99 Harwood Road,Fulham,,London,,SW6 4QL,Tel: 02073717142,No ratings yet Rate it yourself - /Services/careproviders/LeaveReview/DefaultView.aspx?id=1-116949710,0,0,,
SureCare Chelsea & Fulham,1-10245080845,SCL,88 Peterborough Road,,,London,,SW6 3HH,Tel: 02038872915,No ratings yet Rate it yourself - /Services/careproviders/LeaveReview/DefaultView.aspx?id=1-10245080845,0,0,,
Care Outlook (Battersea),1-8283740282,SCL,21 Falcon Road,Battersea Park,,London,,SW11 2PJ,Tel: 02078010801,No ratings yet Rate it yourself - /Services/careproviders/LeaveReview/DefaultView.aspx?id=1-8283740282,0,0,,
Civic Care Ltd,1-14435945473,SCL,"Tempo House, 15 Falcon Road",Battersea Park,,London,,SW11 2PJ,Tel: 07495814939,No ratings yet Rate it yourself - /Services/careproviders/LeaveReview/DefaultView.aspx?id=1-14435945473,0,0,,
Ashbourne Healthcare Services,1-121927528,SCL,Ashbourne House,35 Harwood Road,,London,,SW6 4QP,Tel: 02077365200,1 rating Rate it yourself - /Services/careproviders/LeaveReview/DefaultView.aspx?id=1-121927528,,,,
"Andrewjon's, 7 Redan House",1-3918696408,SCL,251 Fulham Court,"Fulham Road, Fulham",,London,,SW6 5QE,,No ratings yet Rate it yourself - /Services/careproviders/LeaveReview/DefaultView.aspx?id=1-3918696408,0,0,,
PURETOUCH CARE LIMITED,1-15004819465,SCL,27 Parsons Green Lane,,,London,,SW6 4HH,,No ratings yet Rate it yourself - /Services/careproviders/LeaveReview/DefaultView.aspx?id=1-15004819465,0,0,,
Meadbank Care Home,1-127818748,SCL,Parkgate Road,Battersea,,London,,SW11 4NN,Tel: 02078016000,No ratings yet Rate it yourself - /Services/careproviders/LeaveReview/DefaultView.aspx?id=1-127818748,0,0,,
Super Fast Care UK Ltd,1-13083588265,SCL,603,Fulham Road,,London,,SW6 5UA,Tel: 07901771190,No ratings yet Rate it yourself - /Services/careproviders/LeaveReview/DefaultView.aspx?id=1-13083588265,0,0,,
Domiciliary Care Agency Surrey,1-13562441189,SCL,John Morris House Community Centre,"164 St Johns Hill, Battersea",,London,,SW11 1SW,Tel: 07458127283,No ratings yet Rate it yourself - /Services/careproviders/LeaveReview/DefaultView.aspx?id=1-13562441189,0,0,,
London Community Care and Support Service,1-10752924714,SCL,John Morris House Community Centre,164 St. John's Hill,,London,,SW11 1SW,,No ratings yet Rate it yourself - /Services/careproviders/LeaveReview/DefaultView.aspx?id=1-10752924714,0,0,,
Ellesmere House,1-139851762,SCL,9 Nightingale Place,Chelsea,,London,,SW10 9NG,Tel: 02035046841,No ratings yet Rate it yourself - /Services/careproviders/LeaveReview/DefaultView.aspx?id=1-139851762,0,0,,
Creative Support - Prince of Wales Drive Extra Care Service,1-9303296565,SCL,31-35 Prince Of Wales Drive,Battersea,,London,,SW11 4SN,Tel: 02072233568,No ratings yet Rate it yourself - /Services/careproviders/LeaveReview/DefaultView.aspx?id=1-9303296565,0,0,,
Battersea Place Retirement Village Limited,1-2525654037,SCL,73 Albert Bridge Road,Battersea,,London,,SW11 4DS,Tel: 07745649051,No ratings yet Rate it yourself - /Services/careproviders/LeaveReview/DefaultView.aspx?id=1-2525654037,0,0,,
Albert Suites at Battersea Place,1-2956491956,SCL,73 Albert Bridge Road,Battersea,,London,,SW11 4DS,Tel: 02079248601,No ratings yet Rate it yourself - /Services/careproviders/LeaveReview/DefaultView.aspx?id=1-2956491956,0,0,,
Farm Lane,1-139851798,SCL,25 Farm Lane,Fulham,,London,,SW6 1PX,Tel: 02073864180,No ratings yet Rate it yourself - /Services/careproviders/LeaveReview/DefaultView.aspx?id=1-139851798,0,0,,
Wandsworth Common Care Home,1-8605274550,SCL,94 North Side Wandsworth Common,,,London,,SW18 2QU,Tel: 02081037010,No ratings yet Rate it yourself - /Services/careproviders/LeaveReview/DefaultView.aspx?id=1-8605274550,0,0,,
Wandsworth Common Care Home,1-15519796566,SCL,94 North Side Wandsworth Common,,,London,,SW18 2QU,Tel: 02081037010,No ratings yet Rate it yourself - /Services/careproviders/LeaveReview/DefaultView.aspx?id=1-15519796566,0,0,,
Harding House,1-10729245692,SCL,70 North Side Wandsworth Common,Clapham,,London,,SW18 2QX,Tel: 02088703653,No ratings yet Rate it yourself - /Services/careproviders/LeaveReview/DefaultView.aspx?id=1-10729245692,0,0,,
Huguenot Place,1-10729245746,SCL,6 Huguenot Place,Wandsworth,,London,,SW18 2EN,,No ratings yet Rate it yourself - /Services/careproviders/LeaveReview/DefaultView.aspx?id=1-10729245746,0,0,,
CLIA Care,1-4279526341,SCL,Apartment 5,1C Osiers Road,,London,,SW18 1NL,Tel: 07738510983,2 ratings Rate it yourself - /Services/careproviders/LeaveReview/DefaultView.aspx?id=1-4279526341,,,,
Graceful Care - Wandsworth,1-6539170371,SCL,182 Battersea Park Road,Wandsworth,,London,,SW11 4ND,Tel: 02089618599,No ratings yet Rate it yourself - /Services/careproviders/LeaveReview/DefaultView.aspx?id=1-6539170371,0,0,,
KITE - Keep Independent Through Enablement,1-137189807,SCL,"The Town Hall, 6th Floor","Town Hall Ext, Wandsworth High Street",,London,,SW18 2PU,Tel: 02088715656,No ratings yet Rate it yourself - /Services/careproviders/LeaveReview/DefaultView.aspx?id=1-137189807,0,0,,
Bluebird Care (Wandsworth),1-2216119816,SCL,,5 College Mews,,London,Greater London,SW18 2SJ,Tel: 020 8877 4950,No ratings yet Rate it yourself - /Services/careproviders/LeaveReview/DefaultView.aspx?id=1-2216119816,0,0,,
Caremark (Hammersmith & Fulham),1-3587181112,SCL,Suite 02/04 Hurlingham Studios,Ranelagh Gardens,,London,,SW6 3PA,Tel: 020 3198 9591,No ratings yet Rate it yourself - /Services/careproviders/LeaveReview/DefaultView.aspx?id=1-3587181112,0,0,,
Poseidon Care,1-12033442826,SCL,Hurlingham Studios,Ranelagh Gardens,,London,,SW6 3PA,Tel: 02073499966,No ratings yet Rate it yourself - /Services/careproviders/LeaveReview/DefaultView.aspx?id=1-12033442826,0,0,,
Caremark (Wandsworth),1-967337591,SCL,Russell House,Spencer Court,,London,,SW18 4JJ,Tel: 020 3542 1255,1 rating Rate it yourself - /Services/careproviders/LeaveReview/DefaultView.aspx?id=1-967337591,,,,
St Teresa's Care Home,1-14248708882,SCL,40-46 Roland Gardens,,,London,,SW7 3PW,Tel: 02073735820,No ratings yet Rate it yourself - /Services/careproviders/LeaveReview/DefaultView.aspx?id=1-14248708882,0,0,,
Creative Support - Melody Road,1-9554124815,SCL,Poplar House,"126a, Melody Road",,London,,SW18 2BF,Tel: 07976915989,No ratings yet Rate it yourself - /Services/careproviders/LeaveReview/DefaultView.aspx?id=1-9554124815,0,0,,
Blanche Health,1-13933768751,SCL,Flat 68,"Eliot Court, Garratt Lane",,London,,SW18 4BN,Tel: 07506575403,No ratings yet Rate it yourself - /Services/careproviders/LeaveReview/DefaultView.aspx?id=1-13933768751,0,0,,
"Home Instead Wandsworth, Lambeth & Dulwich",1-2776209403,SCL,LU132 The Light Bulb,1 Filament Walk,,London,,SW18 4GQ,Tel: 020 8022 5235,8 ratings Rate it yourself - /Services/careproviders/LeaveReview/DefaultView.aspx?id=1-2776209403,,,,
Sunshine Care Agency,1-9655314194,SCL,303 North End Road,,,London,,W14 9NS,Tel: 02081248855,No ratings yet Rate it yourself - /Services/careproviders/LeaveReview/DefaultView.aspx?id=1-9655314194,0,0,,
Eden Grange,1-11016521524,SCL,Eden Court,313 Battersea Park Road,,London,,SW11 4LU,,No ratings yet Rate it yourself - /Services/careproviders/LeaveReview/DefaultView.aspx?id=1-11016521524,0,0,,
Chelsea Court Place,1-5701870063,SCL,234A Kings Road,,,London,,SW3 5UA,Tel: 03334330782,No ratings yet Rate it yourself - /Services/careproviders/LeaveReview/DefaultView.aspx?id=1-5701870063,0,0,,
Edyn Care Head Office,1-5584086807,SCL,edyn.care Head Office,Level 1 Battersea Park Library,,London,Greater London,SW11 4NF,Tel: 02039709900,No ratings yet Rate it yourself - /Services/careproviders/LeaveReview/DefaultView.aspx?id=1-5584086807,0,0,,
Vital Care and Support Ltd,1-9828237272,SCL,Battersea Business Centre,99-109 Lavender Hill,,London,,SW11 5QL,Tel: 02035829876,No ratings yet Rate it yourself - /Services/careproviders/LeaveReview/DefaultView.aspx?id=1-9828237272,0,0,,
High Standard Care Limited,1-6410429103,SCL,"6A, Hyde Park House",5 Manfred Road,,London,,SW15 2RS,Tel: 07791400108,No ratings yet Rate it yourself - /Services/careproviders/LeaveReview/DefaultView.aspx?id=1-6410429103,0,0,,
Tiggo Care,1-13032175195,SCL,Hyde Park House,5 Manfred Road,,London,,SW15 2RS,Tel: 02081028628,No ratings yet Rate it yourself - /Services/careproviders/LeaveReview/DefaultView.aspx?id=1-13032175195,0,0,,
Bliss Care and Training Ltd,1-3213528017,SCL,Unit 44 Drca Business Centre,Charlotte Despard Avenue,,London,,SW11 5JE,Tel: 02033725671,No ratings yet Rate it yourself - /Services/careproviders/LeaveReview/DefaultView.aspx?id=1-3213528017,0,0,,
Margaret Thatcher Infirmary,1-328817696,SCL,Royal Hospital Road,Chelsea,,London,,SW3 4SR,Tel: 02078815259,1 rating Rate it yourself - /Services/careproviders/LeaveReview/DefaultView.aspx?id=1-328817696,,,,
The Pines Nursing Home,1-130217833,SCL,104 West Hill,Putney,,London,,SW15 2UQ,Tel: 02088771951,No ratings yet Rate it yourself - /Services/careproviders/LeaveReview/DefaultView.aspx?id=1-130217833,0,0,,
Kadarcare Service Ltd,1-3840743891,SCL,Apsely House,176 Upper Richmond Road,,London,,SW15 2SH,Tel: 02070433739,1 rating Rate it yourself - /Services/careproviders/LeaveReview/DefaultView.aspx?id=1-3840743891,,,,
Loveday at Home Limited,1-11714477625,SCL,32a Thurloe Place,,,London,,SW7 2HQ,Tel: 07572419008,No ratings yet Rate it yourself - /Services/careproviders/LeaveReview/DefaultView.aspx?id=1-11714477625,0,0,,
Kingsmith Care,1-1383426591,SCL,Bishop Creighton House,374-380 Lillie Road,,London,,SW6 7PH,Tel: 02078719450,No ratings yet Rate it yourself - /Services/careproviders/LeaveReview/DefaultView.aspx?id=1-1383426591,0,0,,
Talgarth Road,1-116949694,SCL,41-43 Talgarth Road,West Kensington,,London,,W14 9DD,Tel: 02076038607,No ratings yet Rate it yourself - /Services/careproviders/LeaveReview/DefaultView.aspx?id=1-116949694,0,0,,
Pax Care For You Ltd,1-14956593392,SCL,Spaces Avon House,Avonmore Road,,London,,W14 8TS,Tel: 02071014891,No ratings yet Rate it yourself - /Services/careproviders/LeaveReview/DefaultView.aspx?id=1-14956593392,0,0,,
Westward Consultants Limited Trading as Draycott Nursing and Care,1-14636101632,SCL,18 Culford Gardens,,,London,,SW3 2ST,Tel: 02083517171,No ratings yet Rate it yourself - /Services/careproviders/LeaveReview/DefaultView.aspx?id=1-14636101632,0,0,,
HH Care Services Ltd,1-10847725095,SCL,"Office 5011, 87 Kimber Road",Wandsworth,,London,,SW18 5EB,Tel: 02038839449,No ratings yet Rate it yourself - /Services/careproviders/LeaveReview/DefaultView.aspx?id=1-10847725095,0,0,,
Wardley Street,1-959495934,SCL,2 Wardley Street,,,London,,SW18 4LU,Tel: 02087726222,No ratings yet Rate it yourself - /Services/careproviders/LeaveReview/DefaultView.aspx?id=1-959495934,0,0,,
Care U Care Ltd,1-11897030866,SCL,4 Greyhound Road,,,London,,W6 8NX,Tel: 07495654455,No ratings yet Rate it yourself - /Services/careproviders/LeaveReview/DefaultView.aspx?id=1-11897030866,0,0,,
White Star Care Ltd,1-3255983682,SCL,"87 Kimber Road, Room 4002",Wandsworth,,London,,SW18 4FS,Tel: 02088706577,No ratings yet Rate it yourself - /Services/careproviders/LeaveReview/DefaultView.aspx?id=1-3255983682,0,0,,
"The Good Care Group at Riverstone, Kensington",1-12489568346,SCL,The Good Care Group at Riverstone,"Riverstone Living, Kensington, 2-4 Warwick Lane",,London,,W14 8FN,Tel: 02034793724,No ratings yet Rate it yourself - /Services/careproviders/LeaveReview/DefaultView.aspx?id=1-12489568346,0,0,,
Mia Care Services Ltd,1-10059930460,SCL,54 Wandle Way,,,London,,SW18 4UJ,Tel: 02035190619,No ratings yet Rate it yourself - /Services/careproviders/LeaveReview/DefaultView.aspx?id=1-10059930460,0,0,,
Nightingale House,1-115085073,SCL,105 Nightingale Lane,Wandsworth Common,,London,,SW12 8NB,,No ratings yet Rate it yourself - /Services/careproviders/LeaveReview/DefaultView.aspx?id=1-115085073,0,0,,
Hammersmith,1-4551889312,SCL,239 Kensington High Street,,,London,,W8 6SN,Tel: 07903068899,No ratings yet Rate it yourself - /Services/careproviders/LeaveReview/DefaultView.aspx?id=1-4551889312,0,0,,
NeuroHealth Case Management Services,1-12673583685,SCL,"Wingate Business Exchange, Office 5",64-66 Wingate Square,,London,,SW4 0AF,Tel: 02086751210,No ratings yet Rate it yourself - /Services/careproviders/LeaveReview/DefaultView.aspx?id=1-12673583685,0,0,,
Livingways Care Services Ltd (Wandsworth),1-12525646680,SCL,"Office 18, 68 Wingate Square",,,London,,SW4 0AF,,No ratings yet Rate it yourself - /Services/careproviders/LeaveReview/DefaultView.aspx?id=1-12525646680,0,0,,
Loveday Kensington,1-12470623506,SCL,2 Kensington Square,,,London,,W8 5EP,Tel: 03330602799,No ratings yet Rate it yourself - /Services/careproviders/LeaveReview/DefaultView.aspx?id=1-12470623506,0,0,,
Audley Care Nightingale,1-8861838902,SCL,Audley Nightingale Place,3 Nightingale Lane,,London,,SW4 9AH,Tel: 07940418250,No ratings yet Rate it yourself - /Services/careproviders/LeaveReview/DefaultView.aspx?id=1-8861838902,0,0,,
Charleston House ,1-15253229866,SCL,68 Clapham Common South Side,,,London,,SW4 9DT,Tel: 020336212222,No ratings yet Rate it yourself - /Services/careproviders/LeaveReview/DefaultView.aspx?id=1-15253229866,0,0,,
Nazareth House - Hammersmith,1-403232028,SCL,Hammersmith Road,Hammersmith,,London,,W6 8DB,Tel: 02087483549,No ratings yet Rate it yourself - /Services/careproviders/LeaveReview/DefaultView.aspx?id=1-403232028,0,0,,
Millfield Healthcare Services LTD,1-9838233409,SCL,Flat 3,8 Nottingham Road,,London,,SW17 7EA,Tel: 02071013840,No ratings yet Rate it yourself - /Services/careproviders/LeaveReview/DefaultView.aspx?id=1-9838233409,0,0,,
Integrity Healthcare Solutions Ltd,1-14383005610,SCL,Unit 18,"18-20, Hillgate Place",,London,,SW12 9ER,Tel: 02030896590,No ratings yet Rate it yourself - /Services/careproviders/LeaveReview/DefaultView.aspx?id=1-14383005610,0,0,,
Care of a Kind (Kensington and Chelsea),1-13832747939,SCL,Niddry Lodge,51 Holland Street,,London,,W8 7JB,Tel: 02034419464,No ratings yet Rate it yourself - /Services/careproviders/LeaveReview/DefaultView.aspx?id=1-13832747939,0,0,,
St Vincents House,1-139859140,SCL,49 Queen Caroline Street,,,London,,W6 9QH,Tel: 02086000510,2 ratings Rate it yourself - /Services/careproviders/LeaveReview/DefaultView.aspx?id=1-139859140,,,,
Old Hospital Close (21),1-1830130318,SCL,21 Old Hospital Close,"St James Drive, Balham",,London,,SW12 8SR,Tel: 02086727149,No ratings yet Rate it yourself - /Services/careproviders/LeaveReview/DefaultView.aspx?id=1-1830130318,0,0,,
Old Hospital Close (12),1-1830130282,SCL,12 Old Hospital Close,"St James' Drive, Balham",,London,,SW12 8SS,Tel: 02087677937,No ratings yet Rate it yourself - /Services/careproviders/LeaveReview/DefaultView.aspx?id=1-1830130282,0,0,,
Trinity Court Nursing Home,1-106202900,SCL,165-167 Trinity Road,Tooting,,London,,SW17 7HL,Tel: 02087678767,No ratings yet Rate it yourself - /Services/careproviders/LeaveReview/DefaultView.aspx?id=1-106202900,0,0,,
Collingwood Court Care Home,1-16971995754,SCL,Nelsons Row,Clapham,,London,,SW4 7JR,Tel: 02076271400,No ratings yet Rate it yourself - /Services/careproviders/LeaveReview/DefaultView.aspx?id=1-16971995754,0,0,,
Ashmead Care Centre,1-3882013480,SCL,201 Cortis Road,,,London,,SW15 3AX,Tel: 02082466430,2 ratings Rate it yourself - /Services/careproviders/LeaveReview/DefaultView.aspx?id=1-3882013480,,,,
Wimbledon Common Care Home,1-10882124560,SCL,6 Victoria Drive,Wimbledon,,London,,SW19 6AB,Tel: 02081080178,No ratings yet Rate it yourself - /Services/careproviders/LeaveReview/DefaultView.aspx?id=1-10882124560,0,0,,
Wimbledon Common Care Home,1-15519796777,SCL,6 Victoria Drive,,,London,,SW19 6AB,Tel: 02083945710,No ratings yet Rate it yourself - /Services/careproviders/LeaveReview/DefaultView.aspx?id=1-15519796777,0,0,,
The Meadowcroft Care Home,1-14347523514,SCL,28 Springfield Drive,Tooting,,London,,SW17 0SD,Tel: 02077931122,No ratings yet Rate it yourself - /Services/careproviders/LeaveReview/DefaultView.aspx?id=1-14347523514,0,0,,
Parkgate Nursing Agency - 1 Boundaries Road,1-124777108,SCL,1 Boundaries Road,Balham,,London,,SW12 8ET,Tel: 02086734755,No ratings yet Rate it yourself - /Services/careproviders/LeaveReview/DefaultView.aspx?id=1-124777108,0,0,,
Bhakti Shyama Care Centre,1-333143159,SCL,1 Balham New Road,,,London,,SW12 9PH,Tel: 020 8772 1499,No ratings yet Rate it yourself - /Services/careproviders/LeaveReview/DefaultView.aspx?id=1-333143159,0,0,,
The Laurels Care Centre Limited,1-146791079,SCL,70 Union Road,Clapham,,London,,SW4 6JT,Tel: 02074987500,No ratings yet Rate it yourself - /Services/careproviders/LeaveReview/DefaultView.aspx?id=1-146791079,0,0,,
ZIA Care Ltd,1-15885677874,SCL,Flat 36,"Ashcroft Square, King Street",,London,,W6 0YJ,Tel: 02034880098,No ratings yet Rate it yourself - /Services/careproviders/LeaveReview/DefaultView.aspx?id=1-15885677874,0,0,,
MiHomecare Kensington and Chelsea,1-5774425874,SCL,"Unit 2 , 2nd and 3rd Floors","Cambridge Court, 210 Shepherds Bush Road",,London,,W6 7NJ,Tel: 03331212401,No ratings yet Rate it yourself - /Services/careproviders/LeaveReview/DefaultView.aspx?id=1-5774425874,0,0,,
MiHomecare Hammersmith and Fulham,1-5774425942,SCL,"Unit 2, First Floor","Cambridge Court, 210 Shepherds Bush Road",,London,,W6 7NJ,Tel: 03331216801,No ratings yet Rate it yourself - /Services/careproviders/LeaveReview/DefaultView.aspx?id=1-5774425942,0,0,,
Care Quality Services London,1-6192806928,SCL,Office 620,26-28 Hammersmith Grove,,London,,W6 7BA,Tel: 02074034888,No ratings yet Rate it yourself - /Services/careproviders/LeaveReview/DefaultView.aspx?id=1-6192806928,0,0,,
Kechelle Homecare Ltd,1-14518356049,SCL,26-28 Hammersmith Grove,,,London,,W6 7BA,Tel: 07535494671,No ratings yet Rate it yourself - /Services/careproviders/LeaveReview/DefaultView.aspx?id=1-14518356049,0,0,,
Bravo Care Branch,1-9776078134,SCL,26-28 Hammersmith Grove,Hammersmith,,London,,W6 7BA,Tel: 02080041744,No ratings yet Rate it yourself - /Services/careproviders/LeaveReview/DefaultView.aspx?id=1-9776078134,0,0,,
Rosedene Nursing Home,1-123915388,SCL,141-147 Trinity Road,Wandsworth Common,,London,,SW17 7HJ,Tel: 02086727969,No ratings yet Rate it yourself - /Services/careproviders/LeaveReview/DefaultView.aspx?id=1-123915388,0,0,,
"Walfinch Chiswick, Hammersmith & Kensington",1-12981347805,SCL,"Britannia House, Suite 202",1-11 Glenthorne Road,,London,,W6 0LH,Tel: 02045686800,No ratings yet Rate it yourself - /Services/careproviders/LeaveReview/DefaultView.aspx?id=1-12981347805,0,0,,
Holistic Community Care Limited,1-1601365333,SCL,Unit 3B,"Union Court, 20 Union Road",,London,,SW4 6JP,Tel: 02070910399,2 ratings Rate it yourself - /Services/careproviders/LeaveReview/DefaultView.aspx?id=1-1601365333,,,,
St Georges Nursing Home,1-11866029317,SCL,61,St. Georges Square,,London,,SW1V 3QR,Tel: 02078219001,1 rating Rate it yourself - /Services/careproviders/LeaveReview/DefaultView.aspx?id=1-11866029317,,,,
Ask Butler (UK) Limited,1-1783573203,SCL,"2nd Floor, 123 King Street",,,London,,W6 9JG,Tel: 02033979636,No ratings yet Rate it yourself - /Services/careproviders/LeaveReview/DefaultView.aspx?id=1-1783573203,0,0,,
Shenehom Housing Association,1-115723266,SCL,31-32 Ranelagh Avenue,Barnes,,London,,SW13 0BN,Tel: 02088762199,No ratings yet Rate it yourself - /Services/careproviders/LeaveReview/DefaultView.aspx?id=1-115723266,0,0,,
Cavendish Road,1-1830130245,SCL,274a & b Cavendish Road,Balham,,London,,SW12 0BS,Tel: 02086759957,No ratings yet Rate it yourself - /Services/careproviders/LeaveReview/DefaultView.aspx?id=1-1830130245,0,0,,
Vincentian Care Plus,1-490741672,SCL,Second Floor,12-16 (Door 14) Buckingham Palace Road,,London,,SW1W 0QP,Tel: 02077304254,No ratings yet Rate it yourself - /Services/careproviders/LeaveReview/DefaultView.aspx?id=1-490741672,0,0,,
HomeCare Reablement Service,1-332123980,SCL,Floor 4,145-155 King Street,,Hammersmith,,W6 9XY,,No ratings yet Rate it yourself - /Services/careproviders/LeaveReview/DefaultView.aspx?id=1-332123980,0,0,,
A50 Ltd,1-10091094862,SCL,188 Dover House Road,,,London,,SW15 5AR,Tel: 02088786441,No ratings yet Rate it yourself - /Services/careproviders/LeaveReview/DefaultView.aspx?id=1-10091094862,0,0,,
Yarrow Domiciliary Care Agency,1-136010893,SCL,31-33 Lumiere Court,209 Balham High Road,,London,,SW17 7BQ,Tel: 02087354600,No ratings yet Rate it yourself - /Services/careproviders/LeaveReview/DefaultView.aspx?id=1-136010893,0,0,,
Certitude London Shared Lives,1-117373818,SCL,31-33 Lumiere Court,209 Balham High Road,,London,,SW17 7BQ,Tel: 02087726222,No ratings yet Rate it yourself - /Services/careproviders/LeaveReview/DefaultView.aspx?id=1-117373818,0,0,,
Southside Partnership Domiciliary Care Agency,1-117373860,SCL,31-33 Lumiere Court,209 Balham High Road,,London,,SW17 7BQ,Tel: 02087726222,No ratings yet Rate it yourself - /Services/careproviders/LeaveReview/DefaultView.aspx?id=1-117373860,0,0,,
Viera Gray House,1-2293924933,SCL,27 Ferry Road,,,London,,SW13 9PP,Tel: 02087484563,No ratings yet Rate it yourself - /Services/careproviders/LeaveReview/DefaultView.aspx?id=1-2293924933,0,0,,
Garside House Nursing Home,1-2111711282,SCL,131-151 Regency Street,,,London,,SW1P 4AH,Tel: 02038265520,No ratings yet Rate it yourself - /Services/careproviders/LeaveReview/DefaultView.aspx?id=1-2111711282,0,0,,
Rivercourt Project Short Breaks,1-140858290,SCL,17 Rivercourt Road,Hammersmith,,London,,W6 9LD,Tel: 02085638683,No ratings yet Rate it yourself - /Services/careproviders/LeaveReview/DefaultView.aspx?id=1-140858290,0,0,,
Lingham Court ,1-15234926708,SCL,10 Lingham Street,,,London,,SW9 9HF,Tel: 02033439400,No ratings yet Rate it yourself - /Services/careproviders/LeaveReview/DefaultView.aspx?id=1-15234926708,0,0,,