Organisation Name,NACS Code,Organisation Type,Address1,Address2,Address3,Address4,Address5,PostCode,Telephone Number,NHS.UK users rating,Value  (NHS.UK users rating),Banding Classification  (NHS.UK users rating),Car parking (Is there car parking at this organisation?),Disabled access (Disabled access)
Starwrick Care Ltd,1-14572849655,SCL,11 Wynash Gardens,,,Carshalton,,SM5 3PU,,No ratings yet Rate it yourself - /Services/careproviders/LeaveReview/DefaultView.aspx?id=1-14572849655,0,0,,
Wallace Crescent,1-12429143503,SCL,85 Wallace Crescent,,,Carshalton,,SM5 3SU,Tel: 02086695767,No ratings yet Rate it yourself - /Services/careproviders/LeaveReview/DefaultView.aspx?id=1-12429143503,0,0,,
Sweet Homes Limited t/a Carshalton Nursing Home,1-117294756,SCL,28 Salisbury Road,,,Carshalton,Surrey,SM5 3HD,Tel: 02086692592,No ratings yet Rate it yourself - /Services/careproviders/LeaveReview/DefaultView.aspx?id=1-117294756,0,0,,
Park Lodge,1-409784758,SCL,45 Carshalton Park Road,,,Carshalton,Surrey,SM5 3SP,,No ratings yet Rate it yourself - /Services/careproviders/LeaveReview/DefaultView.aspx?id=1-409784758,0,0,,
Premium Homecare Ltd,1-7120824167,SCL,17 Gordon Road,,,Carshalton,Surrey,SM5 3RG,Tel: 02086425299,No ratings yet Rate it yourself - /Services/careproviders/LeaveReview/DefaultView.aspx?id=1-7120824167,0,0,,
Living Ambitions Limited - 32 Ringstead Road,1-139180949,SCL,32 Ringstead Road,,,Sutton,Surrey,SM1 4SJ,Tel: 02086427725,No ratings yet Rate it yourself - /Services/careproviders/LeaveReview/DefaultView.aspx?id=1-139180949,0,0,,
Living Ambitions Limited - 89 Grosvenor Avenue,1-139180987,SCL,89 Grosvenor Avenue,,,Carshalton,Surrey,SM5 3EN,Tel: 02086473912,No ratings yet Rate it yourself - /Services/careproviders/LeaveReview/DefaultView.aspx?id=1-139180987,0,0,,
The Willows Care Home,1-213641183,SCL,1 The Ridgway,,,Sutton,Surrey,SM2 5JX,Tel: 02086617653,No ratings yet Rate it yourself - /Services/careproviders/LeaveReview/DefaultView.aspx?id=1-213641183,0,0,,
Tennyson Grange,1-11457259503,SCL,123 Westmead Road,,,Sutton,Surrey,SM1 4JE,Tel: 02038239065,No ratings yet Rate it yourself - /Services/careproviders/LeaveReview/DefaultView.aspx?id=1-11457259503,0,0,,
Tennyson Grange,1-7493737694,SCL,123 Westmead Road,,,Sutton,Surrey,SM1 4JE,Tel: 02038239065,No ratings yet Rate it yourself - /Services/careproviders/LeaveReview/DefaultView.aspx?id=1-7493737694,0,0,,
Lodore Nursing Home,1-519248097,SCL,9 Mayfield Road,,,Sutton,Surrey,SM2 5DU,Tel: 02086423088,No ratings yet Rate it yourself - /Services/careproviders/LeaveReview/DefaultView.aspx?id=1-519248097,0,0,,
Mayfield Road,1-2112143236,SCL,17 Mayfield Road,,,Sutton,Surrey,SM2 5DU,Tel: 02086423770,No ratings yet Rate it yourself - /Services/careproviders/LeaveReview/DefaultView.aspx?id=1-2112143236,0,0,,
St Judes Nursing Home,1-107911476,SCL,29-31 Mayfield Road,,,Sutton,Surrey,SM2 5DU,Tel: 02086431335,No ratings yet Rate it yourself - /Services/careproviders/LeaveReview/DefaultView.aspx?id=1-107911476,0,0,,
Rafael Home,1-1732605206,SCL,172 Stanley Park Road,,,Carshalton Beeches,Surrey,SM5 3JR,Tel: 02035566693,No ratings yet Rate it yourself - /Services/careproviders/LeaveReview/DefaultView.aspx?id=1-1732605206,0,0,,
Barons Lodge Sutton,1-1051444139,SCL,2 Cumnor Road,,,Sutton,Surrey,SM2 5DW,Tel: 02086421884,No ratings yet Rate it yourself - /Services/careproviders/LeaveReview/DefaultView.aspx?id=1-1051444139,0,0,,
Dawson House,1-3012457335,SCL,151 Stanley Park Road,,,Carshalton,Surrey,SM5 3JJ,Tel: 02083955724,No ratings yet Rate it yourself - /Services/careproviders/LeaveReview/DefaultView.aspx?id=1-3012457335,0,0,,
44 Albion Road,1-9654806673,SCL,44 Albion Road,,,Sutton,Surrey,SM2 5TF,Tel: 02086422092,No ratings yet Rate it yourself - /Services/careproviders/LeaveReview/DefaultView.aspx?id=1-9654806673,0,0,,
Hylton House,1-126097795,SCL,34 The Ridgway,,,Sutton,Surrey,SM2 5JU,Tel: 02086612663,No ratings yet Rate it yourself - /Services/careproviders/LeaveReview/DefaultView.aspx?id=1-126097795,0,0,,
Independent Lifestyle Options Domiciliary Care,1-666404419,SCL,76 Beddington Gardens,,,Carshalton,Surrey,SM5 3HQ,,No ratings yet Rate it yourself - /Services/careproviders/LeaveReview/DefaultView.aspx?id=1-666404419,0,0,,
Hemmet House,1-121014562,SCL,76 Beddington Gardens,,,Carshalton,Surrey,SM5 3HQ,Tel: 02086696367,No ratings yet Rate it yourself - /Services/careproviders/LeaveReview/DefaultView.aspx?id=1-121014562,0,0,,
Gable Lodge,1-110261278,SCL,66 Beddington Gardens,,,Carshalton,Surrey,SM5 3HQ,Tel: 02086695513,No ratings yet Rate it yourself - /Services/careproviders/LeaveReview/DefaultView.aspx?id=1-110261278,0,0,,
A24 Group Ltd - Sutton,1-132798477,SCL,Group House,92-96 Lind Road,,Sutton,Surrey,SM1 4PL,Tel: 08454523344,No ratings yet Rate it yourself - /Services/careproviders/LeaveReview/DefaultView.aspx?id=1-132798477,0,0,,
Senacare Ltd - Sutton,1-18397794498,SCL,"Suite 3, Pandora House",41 - 45 Lind Road,,Sutton,,SM1 4PP,Tel: 07931617690,No ratings yet Rate it yourself - /Services/careproviders/LeaveReview/DefaultView.aspx?id=1-18397794498,0,0,,
Mimm's Caring Angels,1-8238703888,SCL,"Office 2,  Pandora House",41 - 45 Lind Road,,Sutton,,SM1 4PP,,No ratings yet Rate it yourself - /Services/careproviders/LeaveReview/DefaultView.aspx?id=1-8238703888,0,0,,
Exodus Health Care Services,1-1888170840,SCL,"Office 4, First Floor, Pandora House",41-45 Lind Road,,Sutton,,SM1 4PP,Tel: 02080013556,No ratings yet Rate it yourself - /Services/careproviders/LeaveReview/DefaultView.aspx?id=1-1888170840,0,0,,
Worlta Health Care Ltd,1-10751799033,SCL,"Unit 8, First Floor","13-19, Lower Road",,Sutton,,SM1 4QJ,,No ratings yet Rate it yourself - /Services/careproviders/LeaveReview/DefaultView.aspx?id=1-10751799033,0,0,,
Rosemil Care,1-19058395352,SCL,6 Sutton Plaza,,,Sutton,,SM1 4FS,Tel: 07878815929,No ratings yet Rate it yourself - /Services/careproviders/LeaveReview/DefaultView.aspx?id=1-19058395352,0,0,,
Amazyn Homecare,1-13561862984,SCL,6 Sutton Plaza,,,Sutton,,SM1 4FS,Tel: 01202129190,No ratings yet Rate it yourself - /Services/careproviders/LeaveReview/DefaultView.aspx?id=1-13561862984,0,0,,
Bornipete Limited,1-18096863630,SCL,6 Sutton Plaza,,,Sutton,,SM1 4FS,Tel: 07970598716,No ratings yet Rate it yourself - /Services/careproviders/LeaveReview/DefaultView.aspx?id=1-18096863630,0,0,,
Ryelands,1-117965762,SCL,15 Beddington Gardens,,,Wallington,Surrey,SM6 0JF,Tel: 02086476837,No ratings yet Rate it yourself - /Services/careproviders/LeaveReview/DefaultView.aspx?id=1-117965762,0,0,,
Crystalline Business Solutions Limited,1-5083760548,SCL,"Office 2, 14 Butter Hill",,,Wallington,,SM6 7JD,Tel: 07960235217,No ratings yet Rate it yourself - /Services/careproviders/LeaveReview/DefaultView.aspx?id=1-5083760548,0,0,,
Heathcotes Sutton Supported Living,1-12719277421,SCL,Sutton Court Road,,,Sutton,,SM1 4SY,,No ratings yet Rate it yourself - /Services/careproviders/LeaveReview/DefaultView.aspx?id=1-12719277421,0,0,,
"Valor Care Services, Training and Consultancy Limited",1-1290104056,SCL,6 Sutton Plaza,"Sutton Point, Sutton Court Road",,Sutton,,SM1 4SY,Tel: 02030928632,No ratings yet Rate it yourself - /Services/careproviders/LeaveReview/DefaultView.aspx?id=1-1290104056,0,0,,
Stanley Park Road,1-6919842098,SCL,19 Stanley Park Road,,,Wallington,,SM6 0HL,,No ratings yet Rate it yourself - /Services/careproviders/LeaveReview/DefaultView.aspx?id=1-6919842098,0,0,,
Nurse Next Door,1-2261990481,SCL,4 Tudor Court,Brighton Road,,Sutton,Surrey,SM2 5AE,Tel: 01372700444,No ratings yet Rate it yourself - /Services/careproviders/LeaveReview/DefaultView.aspx?id=1-2261990481,0,0,,
Encompass Shared Lives Sutton,1-10049925032,SCL,"Sutton Gate, 1st Floor",1 Carshalton Road,,Sutton,,SM1 4LE,Tel: 07872510120,No ratings yet Rate it yourself - /Services/careproviders/LeaveReview/DefaultView.aspx?id=1-10049925032,0,0,,
YourLife (Wallington),1-2543036253,SCL,Elles House,Shotfield,,Wallington,Surrey,SM6 0BL,Tel: 02087731137,No ratings yet Rate it yourself - /Services/careproviders/LeaveReview/DefaultView.aspx?id=1-2543036253,0,0,,
Pivot Care Group Limited,1-7510363390,SCL,25b,Danbury Mews,,Wallington,,SM6 0BY,Tel: 07492472245,No ratings yet Rate it yourself - /Services/careproviders/LeaveReview/DefaultView.aspx?id=1-7510363390,0,0,,
Beech Manor,1-400283026,SCL,21 Banstead Road South,,,Sutton,Surrey,SM2 5LF,,No ratings yet Rate it yourself - /Services/careproviders/LeaveReview/DefaultView.aspx?id=1-400283026,0,0,,
Absolute Care Services (Cloverdale Court),1-6410707255,SCL,10 - 14 Stanley Park Road,,,Wallington,,SM6 0EU,Tel: 02038155448,No ratings yet Rate it yourself - /Services/careproviders/LeaveReview/DefaultView.aspx?id=1-6410707255,0,0,,
Lakeshore Care Ltd,1-1849442043,SCL,15A Grove Road,2nd Floor,,Sutton,,SM1 1BB,Tel: 02086619960,No ratings yet Rate it yourself - /Services/careproviders/LeaveReview/DefaultView.aspx?id=1-1849442043,0,0,,
Westminster Homecare Limited (Wallington),1-4799685688,SCL,"Suite 3A, Mezzanine BTS House",69-73 Manor Road,,Wallington,,SM6 0DD,Tel: 02039689133,No ratings yet Rate it yourself - /Services/careproviders/LeaveReview/DefaultView.aspx?id=1-4799685688,0,0,,
Living Ambitions Limited - 63a Victoria Avenue,1-139181015,SCL,63a Victoria Avenue,,,Wallington,Surrey,SM6 7JP,Tel: 02086694559,No ratings yet Rate it yourself - /Services/careproviders/LeaveReview/DefaultView.aspx?id=1-139181015,0,0,,
Larkrise,1-3012597847,SCL,50 The Gallop,,,Sutton,Surrey,SM2 5RY,Tel: 02035838979,No ratings yet Rate it yourself - /Services/careproviders/LeaveReview/DefaultView.aspx?id=1-3012597847,0,0,,
Tudor Lodge,1-3012604179,SCL,45 The Gallop,,,Sutton,Surrey,SM2 5RY,Tel: 02082390814,No ratings yet Rate it yourself - /Services/careproviders/LeaveReview/DefaultView.aspx?id=1-3012604179,0,0,,
Brambledown Road,1-112747034,SCL,44 Brambledown Road,,,Wallington,Surrey,SM6 0TF,Tel: 02086471325,No ratings yet Rate it yourself - /Services/careproviders/LeaveReview/DefaultView.aspx?id=1-112747034,0,0,,
Fond of Care Ltd,1-7582040782,SCL,80 Culvers Way,,,Carshalton,,SM5 2LP,Tel: 02080883250,No ratings yet Rate it yourself - /Services/careproviders/LeaveReview/DefaultView.aspx?id=1-7582040782,0,0,,
Grennell Lodge Nursing Care Home,1-11829116583,SCL,69 All Saints Road,,,Sutton,Surrey,SM1 3DJ,Tel: 02086447567,No ratings yet Rate it yourself - /Services/careproviders/LeaveReview/DefaultView.aspx?id=1-11829116583,0,0,,
Mount Park,1-4487990897,SCL,43 Mount Park,,,Carshalton,Surrey,SM5 4PR,,No ratings yet Rate it yourself - /Services/careproviders/LeaveReview/DefaultView.aspx?id=1-4487990897,0,0,,
The Specialist Health Team for People with Learning Disabilities,1-127638572,SCL,Civic Offices,St Nicholas Way,,Sutton,Surrey,SM1 1EA,Tel: 020 8770 4129,No ratings yet Rate it yourself - /Services/careproviders/LeaveReview/DefaultView.aspx?id=1-127638572,0,0,,
Short Term Assessment & Reablement Team (START - London Borough of Sutton),1-1775050303,SCL,Civic Offices,St Nicholas Way,,Sutton,Surrey,SM1 1EA,Tel: 02087705856,No ratings yet Rate it yourself - /Services/careproviders/LeaveReview/DefaultView.aspx?id=1-1775050303,0,0,,
Kisimul Supported Living Surrey,1-12108867571,SCL,City House,Sutton Park Road,,Sutton,,SM1 2AE,Tel: 02083984367,No ratings yet Rate it yourself - /Services/careproviders/LeaveReview/DefaultView.aspx?id=1-12108867571,0,0,,
Rosswood Gardens,1-1830130556,SCL,"4,6 & 8 Rosswood Gardens",,,Wallington,,SM6 8QZ,Tel: 02086478193,No ratings yet Rate it yourself - /Services/careproviders/LeaveReview/DefaultView.aspx?id=1-1830130556,0,0,,
Housing 21 - Belsize Court,1-2097969667,SCL,Belsize Court,18 Burnell Road,,Sutton,,SM1 4BH,Tel: 03701924672,No ratings yet Rate it yourself - /Services/careproviders/LeaveReview/DefaultView.aspx?id=1-2097969667,0,0,,
Park Hill House,1-117354407,SCL,25 Park Hill Road,,,Wallington,Surrey,SM6 0SA,Tel: 02086471346,No ratings yet Rate it yourself - /Services/careproviders/LeaveReview/DefaultView.aspx?id=1-117354407,0,0,,
Bridge House Care Centre,1-126050934,SCL,280/282 London Road,,,London,,SM6 7DJ,Tel: 020 8647 8419,No ratings yet Rate it yourself - /Services/careproviders/LeaveReview/DefaultView.aspx?id=1-126050934,0,0,,
Star Care UK Limited,1-3905902443,SCL,272 London Road,,,Wallington,Surrey,SM6 7DJ,Tel: 02085026660,No ratings yet Rate it yourself - /Services/careproviders/LeaveReview/DefaultView.aspx?id=1-3905902443,0,0,,
Rutland House,1-107135403,SCL,67 All Saints Road,,,London,,SM1 3DQ,Tel: 020 8644 5699,No ratings yet Rate it yourself - /Services/careproviders/LeaveReview/DefaultView.aspx?id=1-107135403,0,0,,
Live & Learn,1-144505415,SCL,131 Woodmansterne Road,Carshalton Beeches,,Carshalton,Surrey,SM5 4AF,Tel: 02082559347,No ratings yet Rate it yourself - /Services/careproviders/LeaveReview/DefaultView.aspx?id=1-144505415,0,0,,
Eversfield House,1-116759122,SCL,45 Mulgrave Road,,,Sutton,Surrey,SM2 6LJ,Tel: 02086426661,No ratings yet Rate it yourself - /Services/careproviders/LeaveReview/DefaultView.aspx?id=1-116759122,0,0,,
Escoben Care Ltd,1-2850930645,SCL,"Parker House, 1st Floor",44 Stafford Road,,Wallington,,SM6 9AA,Tel: 07462606583,No ratings yet Rate it yourself - /Services/careproviders/LeaveReview/DefaultView.aspx?id=1-2850930645,0,0,,
Savannah Care Limited,1-2745693757,SCL,38 Stafford Road,Wallington,,Sutton,Surrey,SM6 9AA,Tel: 02035816335,No ratings yet Rate it yourself - /Services/careproviders/LeaveReview/DefaultView.aspx?id=1-2745693757,0,0,,
Colkara Care and Support Ltd,1-11432801695,SCL,"Unit 2, Room 11","Sutton Business Park, Restmor Way",,Wallington,,SM6 7AH,Tel: 07523989546,No ratings yet Rate it yourself - /Services/careproviders/LeaveReview/DefaultView.aspx?id=1-11432801695,0,0,,
QH Care Services Limited,1-14830310040,SCL,Unit 1,"Sutton Business Park, Restmor Way",,Wallington,,SM6 7AH,,No ratings yet Rate it yourself - /Services/careproviders/LeaveReview/DefaultView.aspx?id=1-14830310040,0,0,,
Grange Cottage Residential Home,1-123444244,SCL,6 Grange Road,,,Sutton,Surrey,SM2 6RS,Tel: 02086422721,No ratings yet Rate it yourself - /Services/careproviders/LeaveReview/DefaultView.aspx?id=1-123444244,0,0,,
Lavender Oaks Care Home,1-4357270145,SCL,4 Metcalfe Avenue,,,Carshalton,Surrey,SM5 4AQ,Tel: 08081642522,No ratings yet Rate it yourself - /Services/careproviders/LeaveReview/DefaultView.aspx?id=1-4357270145,0,0,,
Cranley Gardens,1-112747007,SCL,14 Cranley Gardens,,,Wallington,Surrey,SM6 9PR,Tel: 02084058206,No ratings yet Rate it yourself - /Services/careproviders/LeaveReview/DefaultView.aspx?id=1-112747007,0,0,,
The Regard Partnership Limited - Grove Road,1-136882855,SCL,45 Grove Road,,,Sutton,Surrey,SM1 2AW,Tel: 02086422899,No ratings yet Rate it yourself - /Services/careproviders/LeaveReview/DefaultView.aspx?id=1-136882855,0,0,,
Walton House,1-117354392,SCL,12 Hall Road,,,Wallington,Surrey,SM6 0RT,Tel: 02086478836,No ratings yet Rate it yourself - /Services/careproviders/LeaveReview/DefaultView.aspx?id=1-117354392,0,0,,
Hall Road,1-112747096,SCL,7 Hall Road,,,Wallington,Surrey,SM6 0RT,Tel: 02082549895,No ratings yet Rate it yourself - /Services/careproviders/LeaveReview/DefaultView.aspx?id=1-112747096,0,0,,
Ashurst Lodge,1-7118839390,SCL,11 Hall Road,,,Wallington,Surrey,SM6 0RT,Tel: 02087731769,No ratings yet Rate it yourself - /Services/careproviders/LeaveReview/DefaultView.aspx?id=1-7118839390,0,0,,
3 The Green,1-9655470904,SCL,3 The Green,,,Sutton,Surrey,SM1 1QT,Tel: 02086419348,No ratings yet Rate it yourself - /Services/careproviders/LeaveReview/DefaultView.aspx?id=1-9655470904,0,0,,
All-Ineed Care Services,1-15053904635,SCL,99 Ferndale Crescent,,,Carshalton,,SM5 2FG,Tel: 02030912705,No ratings yet Rate it yourself - /Services/careproviders/LeaveReview/DefaultView.aspx?id=1-15053904635,0,0,,
Wellesley Lodge,1-114226882,SCL,41 Worcester Road,,,London,,SM2 6PY,Tel: 020 8643 8860,No ratings yet Rate it yourself - /Services/careproviders/LeaveReview/DefaultView.aspx?id=1-114226882,0,0,,
Orchard House Nursing Home,1-519369121,SCL,35 Hallmead Road,,,Sutton,Surrey,SM1 1RD,Tel: 02086443916,No ratings yet Rate it yourself - /Services/careproviders/LeaveReview/DefaultView.aspx?id=1-519369121,0,0,,
Grasmere Rest Home,1-138947324,SCL,49 Grange Road,,,London,,SM2 6ST,Tel: 020 8642 8612,No ratings yet Rate it yourself - /Services/careproviders/LeaveReview/DefaultView.aspx?id=1-138947324,0,0,,
Croft Willow House,1-6115453456,SCL,45 Stayton Road,,,Sutton,,SM1 1QY,Tel: 07812698442,No ratings yet Rate it yourself - /Services/careproviders/LeaveReview/DefaultView.aspx?id=1-6115453456,0,0,,
Grove House,1-5905085780,SCL,122 Grove Road,,,Sutton,Surrey,SM1 2DD,Tel: 01246556453,No ratings yet Rate it yourself - /Services/careproviders/LeaveReview/DefaultView.aspx?id=1-5905085780,0,0,,
Elite CarePlus Ltd,1-2598387969,SCL,135 Stafford Road,,,London,,SM6 9BN,Tel: 0207 998 7860,No ratings yet Rate it yourself - /Services/careproviders/LeaveReview/DefaultView.aspx?id=1-2598387969,0,0,,
Crossways Nursing Home,1-6024071827,SCL,17 Overton Road,,,Sutton,Surrey,SM2 6RA,Tel: 02086420955,No ratings yet Rate it yourself - /Services/careproviders/LeaveReview/DefaultView.aspx?id=1-6024071827,0,0,,
Belmont House Nursing Home,1-2714144134,SCL,75 Worcester Road,,,Sutton,Surrey,SM2 6ND,Tel: 02086527900,No ratings yet Rate it yourself - /Services/careproviders/LeaveReview/DefaultView.aspx?id=1-2714144134,0,0,,
Morton Gardens LTD,1-8410948785,SCL,139 Demesne Road,,,Wallington,Surrey,SM6 8EW,Tel: 02086479503,No ratings yet Rate it yourself - /Services/careproviders/LeaveReview/DefaultView.aspx?id=1-8410948785,0,0,,
Cranleigh Gardens,1-2026102033,SCL,1 Cranleigh Gardens,,,Sutton,Surrey,SM1 3EJ,Tel: 02086617238,No ratings yet Rate it yourself - /Services/careproviders/LeaveReview/DefaultView.aspx?id=1-2026102033,0,0,,
David House,1-3083188247,SCL,36 Sandy Lane South,,,Wallington,Surrey,SM6 9QZ,Tel: 02086477981,No ratings yet Rate it yourself - /Services/careproviders/LeaveReview/DefaultView.aspx?id=1-3083188247,0,0,,
Raleigh House,1-225238824,SCL,9 Raleigh Avenue,,,Wallington,Surrey,SM6 8HE,Tel: 02086693691,No ratings yet Rate it yourself - /Services/careproviders/LeaveReview/DefaultView.aspx?id=1-225238824,0,0,,
Entirety,1-9889822742,SCL,187 Buckhurst Avenue,,,Carshalton,Surrey,SM5 1PD,Tel: 07759931785,No ratings yet Rate it yourself - /Services/careproviders/LeaveReview/DefaultView.aspx?id=1-9889822742,0,0,,
Direct Care and Support Services,1-300185842,SCL,20 Fairway,,,London,,SM5 4HS,Tel: 020 8915 0771,No ratings yet Rate it yourself - /Services/careproviders/LeaveReview/DefaultView.aspx?id=1-300185842,0,0,,
Allswell Lodge,1-112241866,SCL,95 Gander Green Lane,,,Sutton,Surrey,SM1 2EP,Tel: 02086422896,No ratings yet Rate it yourself - /Services/careproviders/LeaveReview/DefaultView.aspx?id=1-112241866,0,0,,
Hazel Homes for Autism,1-5203547452,SCL,1 Miller Close,,,Mitcham,Surrey,CR4 4AX,Tel: 02037542794,No ratings yet Rate it yourself - /Services/careproviders/LeaveReview/DefaultView.aspx?id=1-5203547452,0,0,,
McRae Lane,1-15199356087,SCL,25 McRae Lane,,,Mitcham,Surrey,CR4 4AT,Tel: 02086488150,No ratings yet Rate it yourself - /Services/careproviders/LeaveReview/DefaultView.aspx?id=1-15199356087,0,0,,
Jesmund Nursing Home,1-4211948948,SCL,29 York Road,Cheam,,Sutton,Surrey,SM2 6HL,Tel: 02086429660,No ratings yet Rate it yourself - /Services/careproviders/LeaveReview/DefaultView.aspx?id=1-4211948948,0,0,,
York Road,1-128605798,SCL,31 York Road,,,Sutton,Surrey,SM2 6HL,Tel: 02086426310,No ratings yet Rate it yourself - /Services/careproviders/LeaveReview/DefaultView.aspx?id=1-128605798,0,0,,
Magnolia House,1-106191811,SCL,19 Fairholme Road,Cheam,,Sutton,Surrey,SM1 2EE,Tel: 02086426722,No ratings yet Rate it yourself - /Services/careproviders/LeaveReview/DefaultView.aspx?id=1-106191811,0,0,,
Chenash Homecare Specialists,1-3609031668,SCL,19 Lindores Road,,,Carshalton,Surrey,SM5 1BQ,Tel: 02086486400,No ratings yet Rate it yourself - /Services/careproviders/LeaveReview/DefaultView.aspx?id=1-3609031668,0,0,,
Lavender Care Agency LTD,1-4882553208,SCL,14 Hengist Way,,,Wallington,Surrey,SM6 9BP,Tel: 07739406818,No ratings yet Rate it yourself - /Services/careproviders/LeaveReview/DefaultView.aspx?id=1-4882553208,0,0,,
Walsingham Support - 31 Budge Lane,1-124120031,SCL,31 Budge Lane,,,Mitcham,Surrey,CR4 4AN,Tel: 02086405206,No ratings yet Rate it yourself - /Services/careproviders/LeaveReview/DefaultView.aspx?id=1-124120031,0,0,,
Walsingham Support - 21 Budge Lane,1-124120014,SCL,21 Budge Lane,,,Mitcham,Surrey,CR4 4AN,Tel: 02086405169,No ratings yet Rate it yourself - /Services/careproviders/LeaveReview/DefaultView.aspx?id=1-124120014,0,0,,
The Health Care Group (THCG ) LTD,1-7475077008,SCL,92 Oldfields Road,,,Sutton,Surrey,SM1 2NU,Tel: 02039038306,No ratings yet Rate it yourself - /Services/careproviders/LeaveReview/DefaultView.aspx?id=1-7475077008,0,0,,
Southdown Nursing Home,1-141526839,SCL,5 Dorset Road,,,Sutton,Surrey,SM2 6JA,Tel: 02086426169,No ratings yet Rate it yourself - /Services/careproviders/LeaveReview/DefaultView.aspx?id=1-141526839,0,0,,
Living Ambitions Limited - 231 Stafford Road,1-139180973,SCL,231 Stafford Road,,,Wallington,Surrey,SM6 9BX,Tel: 02086471271,No ratings yet Rate it yourself - /Services/careproviders/LeaveReview/DefaultView.aspx?id=1-139180973,0,0,,
Sante Care At Home,1-2058721646,SCL,74 Link Lane,,,Wallington,Surrey,SM6 9DZ,Tel: 02034323315,No ratings yet Rate it yourself - /Services/careproviders/LeaveReview/DefaultView.aspx?id=1-2058721646,0,0,,
Absolute Care Services (Dymond House),1-6197723961,SCL,60a Redford Avenue,,,Wallington,,SM6 9AD,Tel: 02038155446,No ratings yet Rate it yourself - /Services/careproviders/LeaveReview/DefaultView.aspx?id=1-6197723961,0,0,,
CN Healthcare Limited,1-2706491970,SCL,12,Station Road,,Sutton,,SM2 6BH,Tel: 02086426870,No ratings yet Rate it yourself - /Services/careproviders/LeaveReview/DefaultView.aspx?id=1-2706491970,0,0,,
Guardian Angel Carers Banstead and Purley,1-14019091532,SCL,17 Station Road,,,Sutton,,SM2 6BX,,No ratings yet Rate it yourself - /Services/careproviders/LeaveReview/DefaultView.aspx?id=1-14019091532,0,0,,
UK Home Care Limited - Carshalton office,1-6060313157,SCL,109 Stavordale Road,,,Carshalton,Surrey,SM5 1BU,Tel: 02083950306,No ratings yet Rate it yourself - /Services/careproviders/LeaveReview/DefaultView.aspx?id=1-6060313157,0,0,,
Happy Family Care Services Limited,1-12473152765,SCL,"Room 6, Hill House",Bishopsford Road,,Morden,,SM4 6BL,Tel: 07799486781,No ratings yet Rate it yourself - /Services/careproviders/LeaveReview/DefaultView.aspx?id=1-12473152765,0,0,,
Clovecare Limited,1-2155532754,SCL,Hill House,Bishopsford Road,,Morden,Surrey,SM4 6BL,Tel: 02036325005,No ratings yet Rate it yourself - /Services/careproviders/LeaveReview/DefaultView.aspx?id=1-2155532754,0,0,,
Harrington Homecare Headquarters,1-15673161265,SCL,3 Villiers Court (First Floor Offices),"40 Upper Mulgrave Road, Cheam",,Sutton,,SM2 7AJ,Tel: 02083941111,No ratings yet Rate it yourself - /Services/careproviders/LeaveReview/DefaultView.aspx?id=1-15673161265,0,0,,
Willow Lodge Nursing Home,1-2981698841,SCL,59 Burdon Lane,Cheam,,Sutton,Surrey,SM2 7BY,Tel: 02086424117,No ratings yet Rate it yourself - /Services/careproviders/LeaveReview/DefaultView.aspx?id=1-2981698841,0,0,,
374 St Helier Avenue,1-9655829638,SCL,374 St. Helier Avenue,,,Morden,,SM4 6JU,Tel: 02086480661,No ratings yet Rate it yourself - /Services/careproviders/LeaveReview/DefaultView.aspx?id=1-9655829638,0,0,,
Community Living Ltd,1-7860886809,SCL,"Cheam House, 38 Park Road",Cheam,,Sutton,,SM3 8PY,Tel: 02083955879,No ratings yet Rate it yourself - /Services/careproviders/LeaveReview/DefaultView.aspx?id=1-7860886809,0,0,,
Heritage Healthcare Epsom,1-3119998535,SCL,,41 The Broadway,,Sutton,Surrey,SM3 8BL,Tel: 01372 303222,No ratings yet Rate it yourself - /Services/careproviders/LeaveReview/DefaultView.aspx?id=1-3119998535,0,0,,