Organisation Name,NACS Code,Organisation Type,Address1,Address2,Address3,Address4,Address5,PostCode,Telephone Number,NHS.UK users rating,Value  (NHS.UK users rating),Banding Classification  (NHS.UK users rating),Car parking (Is there car parking at this organisation?),Disabled access (Disabled access)
Link House,1-6355845475,SCL,15 Blenheim Road,,,London,,SW20 9BA,Tel: 02085404899,No ratings yet Rate it yourself - /Services/careproviders/LeaveReview/DefaultView.aspx?id=1-6355845475,0,0,,
Carter House,1-6355845542,SCL,1-2 Farnham Gardens,,,London,,SW20 0UE,Tel: 02089466566,No ratings yet Rate it yourself - /Services/careproviders/LeaveReview/DefaultView.aspx?id=1-6355845542,0,0,,
Value Health Care and Cleaning Services Limited,1-7535230042,SCL,6 Petworth Gardens,,,London,,SW20 0UH,Tel: 07415584600,No ratings yet Rate it yourself - /Services/careproviders/LeaveReview/DefaultView.aspx?id=1-7535230042,0,0,,
London Care (Raynes Park),1-2025067002,SCL,St Georges House,3-5 Pepys Road,,London,,SW20 8ZU,Tel: 02089444300,No ratings yet Rate it yourself - /Services/careproviders/LeaveReview/DefaultView.aspx?id=1-2025067002,0,0,,
MiHomecare - Raynes Park,1-283391421,SCL,St Georges House,3-5 Pepys Road,,London,,SW20 8ZU,Tel: 03331219401,No ratings yet Rate it yourself - /Services/careproviders/LeaveReview/DefaultView.aspx?id=1-283391421,0,0,,
Meadowsweet,1-120437822,SCL,14 Meadowsweet Close,Raynes Park,,London,,SW20 9PB,Tel: 02085449830,No ratings yet Rate it yourself - /Services/careproviders/LeaveReview/DefaultView.aspx?id=1-120437822,0,0,,
Noblesse Care Ltd,1-12205720023,SCL,Unit 1-3,"Wyvern Estate, Beverley Way",,New Malden,,KT3 4PH,,No ratings yet Rate it yourself - /Services/careproviders/LeaveReview/DefaultView.aspx?id=1-12205720023,0,0,,
Bavani Care Home Limited,1-4811526348,SCL,142 Elm Walk,,,London,,SW20 9EG,Tel: 02085440700,No ratings yet Rate it yourself - /Services/careproviders/LeaveReview/DefaultView.aspx?id=1-4811526348,0,0,,
Wimbledon Beaumont DCA,1-125863127,SCL,35 Arterberry Road,Wimbledon,,London,,SW20 8AG,,No ratings yet Rate it yourself - /Services/careproviders/LeaveReview/DefaultView.aspx?id=1-125863127,0,0,,
Wimbledon Beaumont,1-125863110,SCL,35 Arterberry Road,Wimbledon,,London,,SW20 8AG,Tel: 02089448299,No ratings yet Rate it yourself - /Services/careproviders/LeaveReview/DefaultView.aspx?id=1-125863110,0,0,,
St Teresa's Home for the Elderly,1-10855459135,SCL,12 Lansdowne Road,Wimbledon,,London,,SW20 8AN,Tel: 02088797366,No ratings yet Rate it yourself - /Services/careproviders/LeaveReview/DefaultView.aspx?id=1-10855459135,0,0,,
YourLife (Raynes Park),1-2794515501,SCL,Liberty House,246 Kingston Road,,London,,SW20 8DA,Tel: 02085439995,No ratings yet Rate it yourself - /Services/careproviders/LeaveReview/DefaultView.aspx?id=1-2794515501,0,0,,
Kelstone Court Nursing Home,1-14156739967,SCL,153 Camborne Road,,,Morden,Surrey,SM4 4JN,Tel: 02085420748,No ratings yet Rate it yourself - /Services/careproviders/LeaveReview/DefaultView.aspx?id=1-14156739967,0,0,,
Concord Care Services,1-9781027959,SCL,2 Walton Avenue,,,New Malden,Surrey,KT3 6DQ,Tel: 02089420421,No ratings yet Rate it yourself - /Services/careproviders/LeaveReview/DefaultView.aspx?id=1-9781027959,0,0,,
Sunlight House,1-120400078,SCL,412 Hillcross Avenue,,,Morden,Surrey,SM4 4EX,Tel: 02085420479,No ratings yet Rate it yourself - /Services/careproviders/LeaveReview/DefaultView.aspx?id=1-120400078,0,0,,
Abbey House - Morden,1-118658356,SCL,455 Hillcross Avenue,,,Morden,Surrey,SM4 4BZ,Tel: 02085425065,No ratings yet Rate it yourself - /Services/careproviders/LeaveReview/DefaultView.aspx?id=1-118658356,0,0,,
Care 4 Care Headquarters,1-3552205463,SCL,59 Ashridge Way,,,Morden,Surrey,SM4 4ED,Tel: 02087157223,No ratings yet Rate it yourself - /Services/careproviders/LeaveReview/DefaultView.aspx?id=1-3552205463,0,0,,
My Homecare Kingston,1-7371360770,SCL,151 High Street,,,New Malden,,KT3 4BH,Tel: 02089497861,No ratings yet Rate it yourself - /Services/careproviders/LeaveReview/DefaultView.aspx?id=1-7371360770,0,0,,
Coombe Hill Manor,1-10232604320,SCL,190-196,Coombe Lane West,,Kingston Upon Thames,,KT2 7EQ,Tel: 02083364650,No ratings yet Rate it yourself - /Services/careproviders/LeaveReview/DefaultView.aspx?id=1-10232604320,0,0,,
Signature at Coombe Hill Manor,1-16666829453,SCL,190-196 Coombe Lane West,,,Kingston Upon Thames,Surrey,KT2 7EQ,Tel: 02031314697,No ratings yet Rate it yourself - /Services/careproviders/LeaveReview/DefaultView.aspx?id=1-16666829453,0,0,,
Keychange Charity Alexander House Care Home,1-119174737,SCL,12 Clifton Road,Wimbledon,,London,,SW19 4QT,Tel: 02089467147,1 rating Rate it yourself - /Services/careproviders/LeaveReview/DefaultView.aspx?id=1-119174737,,,,
HF Trust - Thetford Road,1-120701855,SCL,Thetford Road,New Malden,,London,,KT3 5DN,Tel: 02083360134,No ratings yet Rate it yourself - /Services/careproviders/LeaveReview/DefaultView.aspx?id=1-120701855,0,0,,
The White House Nursing Home,1-2467187658,SCL,274 Malden Road,,,London,,KT3 6AR,Tel: 020 8949 0747,No ratings yet Rate it yourself - /Services/careproviders/LeaveReview/DefaultView.aspx?id=1-2467187658,0,0,,
Hallmark Kew House Luxury Care Home,1-2767529762,SCL,58 Spencer Hill Road,,,London,,SW19 4EL,Tel: 02089710190,No ratings yet Rate it yourself - /Services/careproviders/LeaveReview/DefaultView.aspx?id=1-2767529762,0,0,,
Cloyda Care Home,1-109019161,SCL,227 Malden Road,,,New Malden,Surrey,KT3 6AG,Tel: 02089491839,No ratings yet Rate it yourself - /Services/careproviders/LeaveReview/DefaultView.aspx?id=1-109019161,0,0,,
Devonshire Dementia Care Home and Day Centre,1-107289210,SCL,The Devonshire Care Home,213 Malden Road,,New Malden,Surrey,KT3 6AG,Tel: 02089490818,No ratings yet Rate it yourself - /Services/careproviders/LeaveReview/DefaultView.aspx?id=1-107289210,0,0,,
Medihands Clifton,1-118700648,SCL,17 Bodley Road,,,New Malden,Surrey,KT3 5QD,Tel: 02089493581,No ratings yet Rate it yourself - /Services/careproviders/LeaveReview/DefaultView.aspx?id=1-118700648,0,0,,
Speirs House,1-121567278,SCL,The Chesters,Traps Lane,,New Malden,Surrey,KT3 4SF,Tel: 02089495569,No ratings yet Rate it yourself - /Services/careproviders/LeaveReview/DefaultView.aspx?id=1-121567278,0,0,,
Housing 21 - Pantiles House,1-125487728,SCL,30 Langley Road,Merton,,London,,SW19 3AN,Tel: 03701924628,No ratings yet Rate it yourself - /Services/careproviders/LeaveReview/DefaultView.aspx?id=1-125487728,0,0,,
Jericho Lodge,1-122095814,SCL,22 Links Avenue,,,Morden,Surrey,SM4 5AA,Tel: 02085436686,No ratings yet Rate it yourself - /Services/careproviders/LeaveReview/DefaultView.aspx?id=1-122095814,0,0,,
Jubilee Lodge,1-122095798,SCL,3 Hartherleigh Close,,,Morden,Surrey,SM4 5AD,Tel: 02085433466,No ratings yet Rate it yourself - /Services/careproviders/LeaveReview/DefaultView.aspx?id=1-122095798,0,0,,
HFH Healthcare Limited,1-716889678,SCL,"Tuition House, 2nd Floor","27-37 St Georges Road, Wimbledon",,London,,SW19 4EU,Tel: 02089448831,1 rating Rate it yourself - /Services/careproviders/LeaveReview/DefaultView.aspx?id=1-716889678,,,,
London Residential Health Care Limited - Brook House Nursing Home,1-620171806,SCL,8A Nelson Road,,,New Malden,,KT3 5EA,Tel: 02089429360,2 ratings Rate it yourself - /Services/careproviders/LeaveReview/DefaultView.aspx?id=1-620171806,,,,
Manor House Residential Home,1-11879041116,SCL,Manor House,London Road,,Morden,,SM4 5QT,Tel: 02086483571,No ratings yet Rate it yourself - /Services/careproviders/LeaveReview/DefaultView.aspx?id=1-11879041116,0,0,,
Medihands Healthcare,1-118700631,SCL,149-153 Kingston Road,,,New Malden,Surrey,KT3 3NS,Tel: 02089497860,No ratings yet Rate it yourself - /Services/careproviders/LeaveReview/DefaultView.aspx?id=1-118700631,0,0,,
St Ann's Lodge 2,1-107071905,SCL,3 Lyndhurst Drive,,,New Malden,Surrey,KT3 5LL,Tel: 02082418005,No ratings yet Rate it yourself - /Services/careproviders/LeaveReview/DefaultView.aspx?id=1-107071905,0,0,,
St Ann's Lodge 1,1-2964087038,SCL,1 Lyndhurst Drive,,,New Malden,Surrey,KT3 5LL,Tel: 02089425102,No ratings yet Rate it yourself - /Services/careproviders/LeaveReview/DefaultView.aspx?id=1-2964087038,0,0,,
Lynton Hall Care Home,1-127818681,SCL,2 Lynton Road,,,New Malden,Surrey,KT3 5EE,Tel: 02089491765,No ratings yet Rate it yourself - /Services/careproviders/LeaveReview/DefaultView.aspx?id=1-127818681,0,0,,
Cherry Lodge,1-14865007894,SCL,14 Lynton Road,,,New Malden,Surrey,KT3 5EE,Tel: 02082969188,No ratings yet Rate it yourself - /Services/careproviders/LeaveReview/DefaultView.aspx?id=1-14865007894,0,0,,
Supreme Care Services Limited,1-122095739,SCL,9 Crown Parade,Crown Lane,,Morden,Surrey,SM4 5DA,Tel: 02085450030,No ratings yet Rate it yourself - /Services/careproviders/LeaveReview/DefaultView.aspx?id=1-122095739,0,0,,
Ashlong Cottage,1-128023439,SCL,141a Longfellow Road,,,Worcester Park,Surrey,KT4 8BA,Tel: 02083370839,No ratings yet Rate it yourself - /Services/careproviders/LeaveReview/DefaultView.aspx?id=1-128023439,0,0,,
Merton Shared Lives Scheme,1-434345058,SCL,Merton Civic Centre 3rd Floor,London Road,,Morden,Surrey,SM4 5DX,Tel: 02085454003,No ratings yet Rate it yourself - /Services/careproviders/LeaveReview/DefaultView.aspx?id=1-434345058,0,0,,
London Borough of Merton - Reablement Service,1-1577976511,SCL,Merton Civic Centre,London Road,,Morden,Surrey,SM4 5DX,Tel: 02082745319,No ratings yet Rate it yourself - /Services/careproviders/LeaveReview/DefaultView.aspx?id=1-1577976511,0,0,,
London Borough of Merton - Supported Living Service,1-444694474,SCL,Merton Civic Centre,London Road,,Morden,Surrey,SM4 5DX,Tel: 02085453676,No ratings yet Rate it yourself - /Services/careproviders/LeaveReview/DefaultView.aspx?id=1-444694474,0,0,,
Reliable Personnel Limited,1-128295096,SCL,32 Crown Lane,,,Morden,Surrey,SM4 5BL,,No ratings yet Rate it yourself - /Services/careproviders/LeaveReview/DefaultView.aspx?id=1-128295096,0,0,,
My Homecare Sutton and Surrey,1-4642295424,SCL,Front offices,153 Epsom Road,,Sutton,,SM3 9EY,Tel: 02083379324,No ratings yet Rate it yourself - /Services/careproviders/LeaveReview/DefaultView.aspx?id=1-4642295424,0,0,,
Helping Hands Wimbledon,1-3056976124,SCL,35 Church Road,,,London,,SW19 5DQ,Tel: 02038799085,No ratings yet Rate it yourself - /Services/careproviders/LeaveReview/DefaultView.aspx?id=1-3056976124,0,0,,
Sutton Court Care Centre,1-138446395,SCL,486-488 Sutton Common Road,,,Sutton,Surrey,SM3 9JL,Tel: 02086448118,No ratings yet Rate it yourself - /Services/careproviders/LeaveReview/DefaultView.aspx?id=1-138446395,0,0,,
Ashington House,1-135175387,SCL,402 Malden Road,,,Worcester Park,Surrey,KT4 7NJ,Tel: 02083307476,No ratings yet Rate it yourself - /Services/careproviders/LeaveReview/DefaultView.aspx?id=1-135175387,0,0,,
Lee House,1-137749984,SCL,2 Lancaster Avenue,Wimbledon,,London,,SW19 5DE,Tel: 02089460369,No ratings yet Rate it yourself - /Services/careproviders/LeaveReview/DefaultView.aspx?id=1-137749984,0,0,,
Ezey Care Limited,1-10078820280,SCL,"Peel House, Suite 102-D1",34-44 London Road,,Morden,,SM4 5BT,Tel: 07908731210,No ratings yet Rate it yourself - /Services/careproviders/LeaveReview/DefaultView.aspx?id=1-10078820280,0,0,,
Royal Mencap Society - Domiciliary Care Services and Shared Lives - West London,1-1644075468,SCL,"Suite 207, Peel House",34 - 44 London Road,,Morden,,SM4 5BT,Tel: 02085456940,No ratings yet Rate it yourself - /Services/careproviders/LeaveReview/DefaultView.aspx?id=1-1644075468,0,0,,
Oasis Plus Care Services Ltd,1-11516737304,SCL,Peel House,34-44 London Road,,Morden,Surrey,SM4 5BT,,No ratings yet Rate it yourself - /Services/careproviders/LeaveReview/DefaultView.aspx?id=1-11516737304,0,0,,
Loredana Home Care - Main Office,1-18693419680,SCL,"Peel House, Suite 312",44 London Road,,Morden,,SM4 5BT,Tel: 02030266726,No ratings yet Rate it yourself - /Services/careproviders/LeaveReview/DefaultView.aspx?id=1-18693419680,0,0,,
Favoured Health Care CIC,1-2063744860,SCL,"Unit101E, Peel House",32-34 London Road,,Morden,Surrey,SM4 5BT,Tel: 02036201114,No ratings yet Rate it yourself - /Services/careproviders/LeaveReview/DefaultView.aspx?id=1-2063744860,0,0,,
Day and Nite Services (Kingston),1-1903641335,SCL,Unit 31,"Kingspark Business Centre, 152-178 Kingston Road",,New Malden,Surrey,KT3 3ST,Tel: 02089497179,No ratings yet Rate it yourself - /Services/careproviders/LeaveReview/DefaultView.aspx?id=1-1903641335,0,0,,
Sunshine Health Care Services Limited,1-10683141941,SCL,Unit 53,Kingspark Business Centre 152-178 Kingston Road,,New Malden,,KT3 3ST,Tel: 07437176922,No ratings yet Rate it yourself - /Services/careproviders/LeaveReview/DefaultView.aspx?id=1-10683141941,0,0,,
Kingspark Business Centre,1-6547952548,SCL,Unit 26 Kingspark Business Centre,152-178 Kingston Road,,New Malden,,KT3 3ST,Tel: 02038139735,No ratings yet Rate it yourself - /Services/careproviders/LeaveReview/DefaultView.aspx?id=1-6547952548,0,0,,
Leys Consultants,1-18445324917,SCL,Unit 109,"Kingspark Business Centre 152-178, Kingston Road",,New Malden,,KT3 3ST,Tel: 07518943606,No ratings yet Rate it yourself - /Services/careproviders/LeaveReview/DefaultView.aspx?id=1-18445324917,0,0,,
Jardine Care Limited t/a Home Instead Senior Care,1-4364899153,SCL,"Top Floor Right, Apsley House",Apsley Road,,New Malden,,KT3 3NJ,Tel: 02038797877,No ratings yet Rate it yourself - /Services/careproviders/LeaveReview/DefaultView.aspx?id=1-4364899153,0,0,,
Home Instead Senior Care,1-2239302350,SCL,"Unit 6, Apsley House",Apsley Road,,New Malden,Surrey,KT3 3NJ,Tel: 02089424137,No ratings yet Rate it yourself - /Services/careproviders/LeaveReview/DefaultView.aspx?id=1-2239302350,0,0,,
Mayfair Homecare - Merton,1-7293235363,SCL,23 Abbotsbury Road,,,Morden,Surrey,SM4 5LJ,Tel: 02086480645,No ratings yet Rate it yourself - /Services/careproviders/LeaveReview/DefaultView.aspx?id=1-7293235363,0,0,,
Good Oaks Home Care Wimbledon & Kingston,1-11060338973,SCL,623 Highland House,165 The Broadway,,London,,SW19 1NE,Tel: 07596544468,1 rating Rate it yourself - /Services/careproviders/LeaveReview/DefaultView.aspx?id=1-11060338973,,,,
K&R CARE,1-11476607528,SCL,Highland House 165-167,The Broadway,,London,,SW19 1NE,Tel: 02081543009,No ratings yet Rate it yourself - /Services/careproviders/LeaveReview/DefaultView.aspx?id=1-11476607528,0,0,,
Wise Support,1-12408473805,SCL,69 Sheephouse Way,,,New Malden,,KT3 5PF,Tel: 07890580000,No ratings yet Rate it yourself - /Services/careproviders/LeaveReview/DefaultView.aspx?id=1-12408473805,0,0,,
J.C.Michael Groups Ltd Wandsworth,1-2193075496,SCL,182 The Broadway,,,London,,SW19 1RY,Tel: 02085408441,No ratings yet Rate it yourself - /Services/careproviders/LeaveReview/DefaultView.aspx?id=1-2193075496,0,0,,
HF Trust - Kingston DCA,1-120702190,SCL,Springfield Resource Centre,Springfield Place,,New Malden,Surrey,KT3 3LJ,Tel: 02089429769,No ratings yet Rate it yourself - /Services/careproviders/LeaveReview/DefaultView.aspx?id=1-120702190,0,0,,
Aston Way,1-15350226720,SCL,"Room 4, Suite 6, Second Floor",1-4 Park Terrace,,Worcester Park,,KT4 7JZ,Tel: 07928510934,No ratings yet Rate it yourself - /Services/careproviders/LeaveReview/DefaultView.aspx?id=1-15350226720,0,0,,
Expert Care Worcester,1-10086441080,SCL,"Park House, 1-4 Park Terrace","2nd Floor, Suite 4",,Worcester Park,,KT4 7JZ,Tel: 07429864177,No ratings yet Rate it yourself - /Services/careproviders/LeaveReview/DefaultView.aspx?id=1-10086441080,0,0,,
Queens Court,1-125861794,SCL,32-34 Queens Road,Wimbledon,,London,,SW19 8LR,Tel: 02089715019,No ratings yet Rate it yourself - /Services/careproviders/LeaveReview/DefaultView.aspx?id=1-125861794,0,0,,
Anne Residential Homes - 74 Coombe,1-119763291,SCL,74 Coombe Lane West,,,Kingston Upon Thames,Surrey,KT2 7DA,Tel: 02089428378,No ratings yet Rate it yourself - /Services/careproviders/LeaveReview/DefaultView.aspx?id=1-119763291,0,0,,
Brightstar Homecare Limited,1-14191862130,SCL,"Suite C, The Jubilee Centre",10-12 Lombard Road,,London,,SW19 3TZ,Tel: 07719638519,No ratings yet Rate it yourself - /Services/careproviders/LeaveReview/DefaultView.aspx?id=1-14191862130,0,0,,
"Kerr-Care At Home Services Ltd - Right At Home (Wimbledon, Putney and Kingston)",1-2238952651,SCL,Lombard Business Park,8 Lombard Road,,London,,SW19 3TZ,Tel: 02037006515,No ratings yet Rate it yourself - /Services/careproviders/LeaveReview/DefaultView.aspx?id=1-2238952651,0,0,,
Meds Resources Limited,1-4730869082,SCL,The Jubilee  Centre,"10-12 Lombard Road, Wimbledon",,London,,SW19 3TZ,,No ratings yet Rate it yourself - /Services/careproviders/LeaveReview/DefaultView.aspx?id=1-4730869082,0,0,,
Ayai Care Head Office,1-12415391576,SCL,64 Gainsborough Road,,,New Malden,,KT3 5NX,Tel: 02082554710,No ratings yet Rate it yourself - /Services/careproviders/LeaveReview/DefaultView.aspx?id=1-12415391576,0,0,,
Westbourne Court,1-2004653460,SCL,"Flat 43, Westbourne Court","Westbourne Avenue, Cheam",,Sutton,,SM3 9ED,Tel: 02086443204,No ratings yet Rate it yourself - /Services/careproviders/LeaveReview/DefaultView.aspx?id=1-2004653460,0,0,,
Gentle Healthcare Services,1-4359052895,SCL,12 Deer Park Road,,,London,,SW19 3TL,Tel: 07445281380,No ratings yet Rate it yourself - /Services/careproviders/LeaveReview/DefaultView.aspx?id=1-4359052895,0,0,,
Wandle Healthcare Services,1-1981515382,SCL,Lombard Business Park,"Deer Park Studios, 12 Deer Park Road",,London,,SW19 3TL,Tel: 02039834132,1 rating Rate it yourself - /Services/careproviders/LeaveReview/DefaultView.aspx?id=1-1981515382,,,,
Rosehill Care,1-12924792216,SCL,12 Deer Park Road,,,London,,SW19 3TL,Tel: 07734901093,No ratings yet Rate it yourself - /Services/careproviders/LeaveReview/DefaultView.aspx?id=1-12924792216,0,0,,
Eveready Carers,1-14354795066,SCL,12 Deer Park Road,,,London,,SW19 3TL,Tel: 02085429679,No ratings yet Rate it yourself - /Services/careproviders/LeaveReview/DefaultView.aspx?id=1-14354795066,0,0,,
Abbeyfield House - New Malden,1-137749858,SCL,California Road,,,New Malden,Surrey,KT3 3RL,Tel: 02089490022,1 rating Rate it yourself - /Services/careproviders/LeaveReview/DefaultView.aspx?id=1-137749858,,,,
Yucca Recruitment Agency Limited,1-11940140797,SCL,Falcon House,19 Deer Park Road,,London,,SW19 3UX,Tel: 02071752798,No ratings yet Rate it yourself - /Services/careproviders/LeaveReview/DefaultView.aspx?id=1-11940140797,0,0,,
Trinity Homecare (Worcester Park),1-1864053896,SCL,1-15 Central Road,,,Worcester Park,Surrey,KT4 8EG,Tel: 02071834884,54 ratings Rate it yourself - /Services/careproviders/LeaveReview/DefaultView.aspx?id=1-1864053896,,,,
Berkeley Home Care Surrey,1-7100828370,SCL,1-15 Central Road,Central House (2nd Floor),,Worcester Park,,KT4 8EG,Tel: 02083993388,No ratings yet Rate it yourself - /Services/careproviders/LeaveReview/DefaultView.aspx?id=1-7100828370,0,0,,
Berkeley Home Health - Southeast,1-13175323612,SCL,Central House (2nd Floor),1-15 Central Road,,Worcester Park,,KT4 8EG,Tel: 01252852100,No ratings yet Rate it yourself - /Services/careproviders/LeaveReview/DefaultView.aspx?id=1-13175323612,0,0,,
Florence Care and Consultancy Service Ltd,1-14787848004,SCL,The Grange,1 Central Road,,Morden,,SM4 5PQ,Tel: 07766233213,No ratings yet Rate it yourself - /Services/careproviders/LeaveReview/DefaultView.aspx?id=1-14787848004,0,0,,
Lona Lodge,1-2026102362,SCL,307 Sutton Common Road,,,Sutton,Surrey,SM3 9NH,Tel: 02086444824,No ratings yet Rate it yourself - /Services/careproviders/LeaveReview/DefaultView.aspx?id=1-2026102362,0,0,,
Ashbrook House,1-127903675,SCL,20 St Helier Avenue,,,Morden,Surrey,SM4 6LF,Tel: 02086463096,No ratings yet Rate it yourself - /Services/careproviders/LeaveReview/DefaultView.aspx?id=1-127903675,0,0,,
Capitol House,1-11589208706,SCL,662 London Road,Cheam,,Sutton,,SM3 9BY,Tel: 0193285923,No ratings yet Rate it yourself - /Services/careproviders/LeaveReview/DefaultView.aspx?id=1-11589208706,0,0,,
Bright Homecare,1-4735084577,SCL,8 Cerne Road,,,Morden,Surrey,SM4 6QQ,Tel: 02086489525,No ratings yet Rate it yourself - /Services/careproviders/LeaveReview/DefaultView.aspx?id=1-4735084577,0,0,,
Forever Good Care Ltd T/A Caremark Merton,1-1290162465,SCL,"Upper Hall, First Floor Chaucer Centre",Canterbury Road,,Morden,,SM4 6PX,Tel: 02086876633,No ratings yet Rate it yourself - /Services/careproviders/LeaveReview/DefaultView.aspx?id=1-1290162465,0,0,,
Trueblue Nurses,1-549006793,SCL,Flat 2,444 Kingston Road,,Kingston Upon Thames,Surrey,KT1 3PB,Tel: 07875417474,No ratings yet Rate it yourself - /Services/careproviders/LeaveReview/DefaultView.aspx?id=1-549006793,0,0,,
Raza Homecare Limited,1-2595655524,SCL,215 St Helier Avenue,,,Morden,Surrey,SM4 6JH,Tel: 02087154268,No ratings yet Rate it yourself - /Services/careproviders/LeaveReview/DefaultView.aspx?id=1-2595655524,0,0,,
The Porthouse,1-4827121503,SCL,141 Cheam Common Road,,,Worcester Park,,KT4 8SY,Tel: 02082243495,No ratings yet Rate it yourself - /Services/careproviders/LeaveReview/DefaultView.aspx?id=1-4827121503,0,0,,
South Park Residential Home,1-115048678,SCL,193 South Park Road,Wimbledon,,London,,SW19 8RY,Tel: 02082969602,No ratings yet Rate it yourself - /Services/careproviders/LeaveReview/DefaultView.aspx?id=1-115048678,0,0,,
Mayfair Homecare - Trellis House,1-7293235251,SCL,Office,"Trellis House, 1 Mill Road",,London,,SW19 2NE,Tel: 02085407950,No ratings yet Rate it yourself - /Services/careproviders/LeaveReview/DefaultView.aspx?id=1-7293235251,0,0,,
Kingston Care Home,1-2454623227,SCL,Jemmett Close,,,Kingston Upon Thames,Surrey,KT2 7AJ,Tel: 02085470498,1 rating Rate it yourself - /Services/careproviders/LeaveReview/DefaultView.aspx?id=1-2454623227,,,,
43 Florence Avenue,1-2931871759,SCL,43 Florence Avenue,,,Morden,Surrey,SM4 6EX,Tel: 02086465921,No ratings yet Rate it yourself - /Services/careproviders/LeaveReview/DefaultView.aspx?id=1-2931871759,0,0,,
374 St Helier Avenue,1-9655829638,SCL,374 St. Helier Avenue,,,Morden,,SM4 6JU,Tel: 02086480661,No ratings yet Rate it yourself - /Services/careproviders/LeaveReview/DefaultView.aspx?id=1-9655829638,0,0,,
Haydons Lodge,1-121419770,SCL,6c & 6d North Road,Wimbledon,,London,,SW19 1DB,Tel: 02085434027,No ratings yet Rate it yourself - /Services/careproviders/LeaveReview/DefaultView.aspx?id=1-121419770,0,0,,
Avenues London South West,1-6432223608,SCL,1-4 Coombe Oak,Warren Road,,Kingston Upon Thames,,KT2 7HY,Tel: 02085473777,No ratings yet Rate it yourself - /Services/careproviders/LeaveReview/DefaultView.aspx?id=1-6432223608,0,0,,
Sherwood Grange,1-2857843249,SCL,1a Robin Hood Lane,,,London,,SW15 3PU,Tel: 02082479110,No ratings yet Rate it yourself - /Services/careproviders/LeaveReview/DefaultView.aspx?id=1-2857843249,0,0,,
Haydon Park Lodge,1-118875948,SCL,7 Haydon Park Road,Wimbledon,,London,,SW19 8JQ,Tel: 02085400172,No ratings yet Rate it yourself - /Services/careproviders/LeaveReview/DefaultView.aspx?id=1-118875948,0,0,,
Heathland Court Care Home,1-124610828,SCL,56 Parkside,Wimbledon,,London,,SW19 5NJ,Tel: 02080034727,No ratings yet Rate it yourself - /Services/careproviders/LeaveReview/DefaultView.aspx?id=1-124610828,0,0,,
Polly Care Services,1-8424693316,SCL,Room 9118 Access House,141 Morden Road,,Mitcham,,CR4 4DG,Tel: 02086851777,No ratings yet Rate it yourself - /Services/careproviders/LeaveReview/DefaultView.aspx?id=1-8424693316,0,0,,
Professional Care Support Services Ltd,1-3240003570,SCL,Access House,141 Morden Road,,Mitcham,Surrey,CR4 4DG,Tel: 02082869177,1 rating Rate it yourself - /Services/careproviders/LeaveReview/DefaultView.aspx?id=1-3240003570,,,,
MICBEE CARE & EMPLOYMENT LIMITED,1-2440912641,SCL,141 Morden Road,,,Mitcham,Surrey,CR4 4DG,,1 rating Rate it yourself - /Services/careproviders/LeaveReview/DefaultView.aspx?id=1-2440912641,,,,
Vibrance 138 All Saints Road,1-1428113496,SCL,138 All Saints Road,,,London,,SW19 1BZ,Tel: 02085420260,No ratings yet Rate it yourself - /Services/careproviders/LeaveReview/DefaultView.aspx?id=1-1428113496,0,0,,