Organisation Name,NACS Code,Organisation Type,Address1,Address2,Address3,Address4,Address5,PostCode,Telephone Number,NHS.UK users rating,Value  (NHS.UK users rating),Banding Classification  (NHS.UK users rating),Car parking (Is there car parking at this organisation?),Disabled access (Disabled access)
Brett Vale Residential Home,1-9177993068,SCL,Granary Barn,"Sulleys Hill, Lower Raydon",,Ipswich,Suffolk,IP7 5QQ,Tel: 01473827497,No ratings yet Rate it yourself - /Services/careproviders/LeaveReview/DefaultView.aspx?id=1-9177993068,0,0,,
Ann Mason Care Ltd,1-8928891318,SCL,Unit 1 Holton Park,"Hadleigh Road, Holton St. Mary",,Colchester,,CO7 6NN,Tel: 01206233372,No ratings yet Rate it yourself - /Services/careproviders/LeaveReview/DefaultView.aspx?id=1-8928891318,0,0,,
The Field Lane Foundation - 7 Station Road,1-11700317258,SCL,7 Station Road,Hadleigh,,Ipswich,Suffolk,IP7 5NA,Tel: 01473822699,No ratings yet Rate it yourself - /Services/careproviders/LeaveReview/DefaultView.aspx?id=1-11700317258,0,0,,
Sydney Brown Court,1-220311573,SCL,Sydney Brown Court,Tayler Road,,Hadleigh,Suffolk,IP7 5JJ,,No ratings yet Rate it yourself - /Services/careproviders/LeaveReview/DefaultView.aspx?id=1-220311573,0,0,,
Magdalen House Care Home,1-436222801,SCL,Magdalen Road,Hadliegh,,Ipswich,Suffolk,IP7 5AD,Tel: 01473829411,No ratings yet Rate it yourself - /Services/careproviders/LeaveReview/DefaultView.aspx?id=1-436222801,0,0,,
Waterfield House,1-244023659,SCL,Grays Close,Hadleigh,,Ipswich,Suffolk,IP7 6AG,Tel: 01473829103,1 rating Rate it yourself - /Services/careproviders/LeaveReview/DefaultView.aspx?id=1-244023659,,,,
Complexus Spinal Care Limited,1-13945514400,SCL,Crockatt Road,Hadleigh,,Ipswich,,IP7 6RH,Tel: 07399893662,1 rating Rate it yourself - /Services/careproviders/LeaveReview/DefaultView.aspx?id=1-13945514400,,,,
Inroads Open Care,1-119710745,SCL,Hadleigh Business and Learning Centre,Crockatt Road,,Hadleigh,Suffolk,IP7 6RH,Tel: 01473826192,No ratings yet Rate it yourself - /Services/careproviders/LeaveReview/DefaultView.aspx?id=1-119710745,0,0,,
Hadleigh Nursing Home,1-4715570705,SCL,1 Friars Road,Hadleigh,,Ipswich,Suffolk,IP7 6DF,Tel: 01502502702,No ratings yet Rate it yourself - /Services/careproviders/LeaveReview/DefaultView.aspx?id=1-4715570705,0,0,,
Blackbrook House,1-3306579618,SCL,Gun Hill,Dedham,,Colchester,Essex,CO7 6HP,Tel: 01206321150,No ratings yet Rate it yourself - /Services/careproviders/LeaveReview/DefaultView.aspx?id=1-3306579618,0,0,,
Canterbury House,1-3306736007,SCL,Gallows Hill,Hadleigh,,Ipswich,Suffolk,IP7 6JQ,Tel: 01473824242,No ratings yet Rate it yourself - /Services/careproviders/LeaveReview/DefaultView.aspx?id=1-3306736007,0,0,,
Calma House,1-4745799490,SCL,16 Dedham Vale Business Park,"Manningtree Road, Dedham",,Colchester,Essex,CO7 6BL,Tel: 07714252505,No ratings yet Rate it yourself - /Services/careproviders/LeaveReview/DefaultView.aspx?id=1-4745799490,0,0,,
The Lodge,1-119827616,SCL,Old London Road,Copdock,,Ipswich,Suffolk,IP8 3JD,Tel: 01473730245,No ratings yet Rate it yourself - /Services/careproviders/LeaveReview/DefaultView.aspx?id=1-119827616,0,0,,
Daisy Chain Home Support Limited,1-1715688073,SCL,,2 Dairy Barn Mews,,Manningtree,Essex,CO11 2BZ,Tel: 01206394545,No ratings yet Rate it yourself - /Services/careproviders/LeaveReview/DefaultView.aspx?id=1-1715688073,0,0,,
Nayland House Care Home,1-10615566937,SCL,Off Bear Street,Nayland,,Colchester,,CO6 4LA,Tel: 0000000000,No ratings yet Rate it yourself - /Services/careproviders/LeaveReview/DefaultView.aspx?id=1-10615566937,0,0,,
Mistley Manor,1-1778522028,SCL,2 Long Road,Mistley,,Manningtree,Essex,CO11 2HN,Tel: 01206 391488,1 rating Rate it yourself - /Services/careproviders/LeaveReview/DefaultView.aspx?id=1-1778522028,,,,
Ashwood Care Colchester,1-19060985990,SCL,"Door 4, First Floor East, Nags Corner, Wiston Road",Nayland,,Colchester,,CO6 4LT,Tel: 02033759403,No ratings yet Rate it yourself - /Services/careproviders/LeaveReview/DefaultView.aspx?id=1-19060985990,0,0,,
Vivid Community Care Limited,1-2830423225,SCL,Nags Corner,"Wiston Road, Nayland",,Colchester,Essex,CO6 4LT,Tel: 01206264173,No ratings yet Rate it yourself - /Services/careproviders/LeaveReview/DefaultView.aspx?id=1-2830423225,0,0,,
Acorn Village,1-116706534,SCL,Mistley Hall,"Clacton Road, Mistley",,Manningtree,Essex,CO11 2NJ,Tel: 01206394124,No ratings yet Rate it yourself - /Services/careproviders/LeaveReview/DefaultView.aspx?id=1-116706534,0,0,,
Morrow House,1-17883053664,SCL,Morrow House,"Morrow Lane, Ardleigh",,Colchester,,CO7 7NG,Tel: 01206688901,No ratings yet Rate it yourself - /Services/careproviders/LeaveReview/DefaultView.aspx?id=1-17883053664,0,0,,
Home Instead Senior Care,1-2497269420,SCL,The North Colchester Business Centre,"Office No. 14 & 15, 340 The Crescent",,Colchester,Essex,CO4 9AD,Tel: 01206848427,No ratings yet Rate it yourself - /Services/careproviders/LeaveReview/DefaultView.aspx?id=1-2497269420,0,0,,
Reed Care Services Ltd,1-1895189972,SCL,Unit 24,340 The Crescent,,Colchester,Essex,CO4 9AD,Tel: 01206848445,No ratings yet Rate it yourself - /Services/careproviders/LeaveReview/DefaultView.aspx?id=1-1895189972,0,0,,
Care Quality Services Colchester,1-6192307116,SCL,Crown House,"Stephenson Road, Severalls Industrial Park",,Colchester,,CO4 9QR,Tel: 01206710748,No ratings yet Rate it yourself - /Services/careproviders/LeaveReview/DefaultView.aspx?id=1-6192307116,0,0,,
Jamesons Care,1-9036251685,SCL,Suite 7,"The Centre, The Crescent, Colchester Business Park",,Colchester,,CO4 9QQ,Tel: 01206241967,No ratings yet Rate it yourself - /Services/careproviders/LeaveReview/DefaultView.aspx?id=1-9036251685,0,0,,
Nurse Plus UK - Colchester,1-9226432775,SCL,655 The Crescent,Colchester Business Park,,Colchester,Essex,CO4 9YQ,Tel: 01206845069,No ratings yet Rate it yourself - /Services/careproviders/LeaveReview/DefaultView.aspx?id=1-9226432775,0,0,,
Living Ambitions Limited - Essex,1-721211510,SCL,780 The Crescent,Colchester Business Park,,Colchester,,CO4 9YQ,Tel: 01206849888,No ratings yet Rate it yourself - /Services/careproviders/LeaveReview/DefaultView.aspx?id=1-721211510,0,0,,
Asterbury Place,1-1445127860,SCL,76 Aster Road,,,Ipswich,Suffolk,IP2 0NR,Tel: 03333211990,No ratings yet Rate it yourself - /Services/careproviders/LeaveReview/DefaultView.aspx?id=1-1445127860,0,0,,
Bixley Road Scheme,1-17128344268,SCL,"The Stables, Chantry Park",Hadleigh Road,,Ipswich,,IP2 0BP,Tel: 01473295200,No ratings yet Rate it yourself - /Services/careproviders/LeaveReview/DefaultView.aspx?id=1-17128344268,0,0,,
The Chantry,1-17128344241,SCL,Chantry Park,Hadleigh Road,,Ipswich,Suffolk,IP2 0BP,Tel: 01473295200,No ratings yet Rate it yourself - /Services/careproviders/LeaveReview/DefaultView.aspx?id=1-17128344241,0,0,,
Ben Holden Ltd,1-13726613500,SCL,"Unit 5,  Alton Business Centre, Valley Farm","Valley Lane, Wherstead",,Ipswich,,IP9 2AX,Tel: 01449737046,No ratings yet Rate it yourself - /Services/careproviders/LeaveReview/DefaultView.aspx?id=1-13726613500,0,0,,
3HA Care Services,1-2370329125,SCL,17 De Grey Square,De Grey Road,,Colchester,,CO4 5YQ,Tel: 01376440002,No ratings yet Rate it yourself - /Services/careproviders/LeaveReview/DefaultView.aspx?id=1-2370329125,0,0,,
Housing 21 - Oak House,1-125497944,SCL,Bentley Lane,Stutton,,Ipswich,Suffolk,IP9 2RS,Tel: 03701924390,No ratings yet Rate it yourself - /Services/careproviders/LeaveReview/DefaultView.aspx?id=1-125497944,0,0,,
Nayland Care Agency Limited,1-125043696,SCL,"Unit 1, Manor Farm Business Centre",Manor Farm Lane,,Stutton,Suffolk,IP9 2TD,Tel: 01473 550480,No ratings yet Rate it yourself - /Services/careproviders/LeaveReview/DefaultView.aspx?id=1-125043696,0,0,,
The Bungalow,1-449582967,SCL,Plains Farm Close,Ardleigh,,Colchester,Essex,CO7 7QU,Tel: 01206843661,No ratings yet Rate it yourself - /Services/careproviders/LeaveReview/DefaultView.aspx?id=1-449582967,0,0,,
Park View Care Home,1-5339649357,SCL,1 Chantry Close,,,Ipswich,Suffolk,IP2 0QR,Tel: 01473228890,No ratings yet Rate it yourself - /Services/careproviders/LeaveReview/DefaultView.aspx?id=1-5339649357,0,0,,
Swanton Community Service Suffolk,1-7054107402,SCL,2 Stella Maris,,,Ipswich,,IP2 0DF,Tel: 01473350390,No ratings yet Rate it yourself - /Services/careproviders/LeaveReview/DefaultView.aspx?id=1-7054107402,0,0,,
Orwell Central Supported Living Domiciliary Care Service,1-11343657274,SCL,Crane Hill Lodge,325 London Road,,Ipswich,Suffolk,IP2 0BE,Tel: 07969222603,No ratings yet Rate it yourself - /Services/careproviders/LeaveReview/DefaultView.aspx?id=1-11343657274,0,0,,
Sunflower Homecare,1-8279498524,SCL,"The Brewhouse, Tudor Grange",Nettlestead,,Ipswich,,IP8 4QL,Tel: 01473924224,No ratings yet Rate it yourself - /Services/careproviders/LeaveReview/DefaultView.aspx?id=1-8279498524,0,0,,
Elton Park Care Home,1-10752742520,SCL,Elton Park Hadleigh Road,,,Ipswich,Suffolk,IP2 0DG,Tel: 07825362906,No ratings yet Rate it yourself - /Services/careproviders/LeaveReview/DefaultView.aspx?id=1-10752742520,0,0,,
Hazeldell Residential Home,1-1918166366,SCL,Elton Park,Hadleigh Road,,Ipswich,Suffolk,IP2 0DG,Tel: 01473252933,No ratings yet Rate it yourself - /Services/careproviders/LeaveReview/DefaultView.aspx?id=1-1918166366,0,0,,
Newlands,1-127549230,SCL,578 Ipswich Road,,,Colchester,Essex,CO4 9HB,Tel: 01206844906,No ratings yet Rate it yourself - /Services/careproviders/LeaveReview/DefaultView.aspx?id=1-127549230,0,0,,
Lavenham Place,1-18025453028,SCL,143 Lavenham Road,,,Ipswich,,IP2 0LD,,No ratings yet Rate it yourself - /Services/careproviders/LeaveReview/DefaultView.aspx?id=1-18025453028,0,0,,
A1 Care Ipswich,1-12379112044,SCL,Unit 1 B,"Penny Corner, Farthing Road",,Ipswich,,IP1 5AP,Tel: 01473806640,No ratings yet Rate it yourself - /Services/careproviders/LeaveReview/DefaultView.aspx?id=1-12379112044,0,0,,
CARING WINGS LTD,1-11959935168,SCL,Unit 4,"The Peninsula Business Centre, Wherstead",,Ipswich,,IP9 2BB,Tel: 01473898987,No ratings yet Rate it yourself - /Services/careproviders/LeaveReview/DefaultView.aspx?id=1-11959935168,0,0,,
Multi-Care Community Services Witham Ltd,1-6252713723,SCL,"Suite 4, Oyster House",Severalls Lane,,Colchester,,CO4 9PD,Tel: 01376513316,1 rating Rate it yourself - /Services/careproviders/LeaveReview/DefaultView.aspx?id=1-6252713723,,,,
Advantage Healthcare - Suffolk and Essex,1-16430335885,SCL,6 The Courtyard Phoenix Square,Wyncolls Road,,Colchester,,CO4 9PE,Tel: 01206228333,No ratings yet Rate it yourself - /Services/careproviders/LeaveReview/DefaultView.aspx?id=1-16430335885,0,0,,
Fame 24hour Care Limited,1-10090641315,SCL,160 Hadleigh Road,,,Ipswich,Suffolk,IP2 0HH,,No ratings yet Rate it yourself - /Services/careproviders/LeaveReview/DefaultView.aspx?id=1-10090641315,0,0,,
Silver Birch Care Home,1-9630029223,SCL,3 Europa Way,,,Ipswich,,IP1 5DL,Tel: 01473937990,1 rating Rate it yourself - /Services/careproviders/LeaveReview/DefaultView.aspx?id=1-9630029223,,,,
Rawlings House,1-121856038,SCL,45 Rawlings Crescent,Highwoods,,Colchester,Essex,CO4 9FB,Tel: 01206842550,No ratings yet Rate it yourself - /Services/careproviders/LeaveReview/DefaultView.aspx?id=1-121856038,0,0,,
481 Ipswich Road,1-12687573042,SCL,481 Ipswich Road,,,Colchester,,CO4 0HQ,Tel: 07507704495,No ratings yet Rate it yourself - /Services/careproviders/LeaveReview/DefaultView.aspx?id=1-12687573042,0,0,,
Kacee Lodge,1-117302395,SCL,Ivy Lodge Road,Great Horkesley,,Colchester,Essex,CO6 4EN,Tel: 01206272108,No ratings yet Rate it yourself - /Services/careproviders/LeaveReview/DefaultView.aspx?id=1-117302395,0,0,,
Avocet Court,1-6192575446,SCL,Monmouth Close,,,Ipswich,Suffolk,IP2 8RS,Tel: 01473 786980,1 rating Rate it yourself - /Services/careproviders/LeaveReview/DefaultView.aspx?id=1-6192575446,,,,
Fuchsia Homecare Ltd,1-2432642975,SCL,"Unit 1, Rutherford Centre","Dunlop Road, Hadleigh Road Industrial Estate",,Ipswich,Suffolk,IP2 0UG,Tel: 01473233797,No ratings yet Rate it yourself - /Services/careproviders/LeaveReview/DefaultView.aspx?id=1-2432642975,0,0,,
Prince of Wales House,1-121065943,SCL,"18, Prince of Wales Drive",,,Ipswich,Suffolk,IP2 8PY,,No ratings yet Rate it yourself - /Services/careproviders/LeaveReview/DefaultView.aspx?id=1-121065943,0,0,,
Great Horkesley Manor,1-13725020178,SCL,Nayland Road,Great Horkesley,,Colchester,Essex,CO6 4ET,Tel: 01206988977,No ratings yet Rate it yourself - /Services/careproviders/LeaveReview/DefaultView.aspx?id=1-13725020178,0,0,,
St Marys,1-3306736565,SCL,Woodlands Road,Holbrook,,Ipswich,Suffolk,IP9 2PS,Tel: 01473328111,No ratings yet Rate it yourself - /Services/careproviders/LeaveReview/DefaultView.aspx?id=1-3306736565,0,0,,
Suffolk Home First South,1-459262293,SCL,Floor 2 Landmark House,4 Egerton Road,,Ipswich,Suffolk,IP1 5PF,Tel: 01473263290,No ratings yet Rate it yourself - /Services/careproviders/LeaveReview/DefaultView.aspx?id=1-459262293,0,0,,
Care Givers - 11 Barnfield Road,1-15643435432,SCL,11 Barnfield Road,Great Horkesley,,Colchester,,CO6 4TR,Tel: 01206890904,No ratings yet Rate it yourself - /Services/careproviders/LeaveReview/DefaultView.aspx?id=1-15643435432,0,0,,
Livability Treetops,1-119325051,SCL,94 Victoria Gardens,Highwoods,,Colchester,Essex,CO4 9YE,Tel: 01206844121,No ratings yet Rate it yourself - /Services/careproviders/LeaveReview/DefaultView.aspx?id=1-119325051,0,0,,
Orchard Brooks Healthcare Limited,1-14835979229,SCL,32 Eastwood Drive,Highwoods,,Colchester,,CO4 9EB,Tel: 07855791315,No ratings yet Rate it yourself - /Services/careproviders/LeaveReview/DefaultView.aspx?id=1-14835979229,0,0,,
Welshwood Manor,1-109740645,SCL,37 Welshwood Park Road,,,Colchester,Essex,CO4 3HZ,Tel: 01206868483,1 rating Rate it yourself - /Services/careproviders/LeaveReview/DefaultView.aspx?id=1-109740645,,,,
Mill House,1-122537731,SCL,102 Mill Road,Mile End,,Colchester,Essex,CO4 5LJ,Tel: 01206845378,No ratings yet Rate it yourself - /Services/careproviders/LeaveReview/DefaultView.aspx?id=1-122537731,0,0,,
Valmark House,1-122537715,SCL,90 Mill Road,Mile End,,Colchester,Essex,CO4 5LJ,Tel: 01206853539,No ratings yet Rate it yourself - /Services/careproviders/LeaveReview/DefaultView.aspx?id=1-122537715,0,0,,
Your Life (Ipswich),1-784998993,SCL,Booth Court,Handford Road,,Ipswich,Suffolk,IP1 2GD,Tel: 01473211505,No ratings yet Rate it yourself - /Services/careproviders/LeaveReview/DefaultView.aspx?id=1-784998993,0,0,,
Duncannons,1-18844902334,SCL,Bromley Road,Ardleigh,,Colchester,,CO7 7SF,Tel: 01206547737,No ratings yet Rate it yourself - /Services/careproviders/LeaveReview/DefaultView.aspx?id=1-18844902334,0,0,,
Active Care & Training Solutions,1-5778583718,SCL,Whitehouse Distribution Centre,46 White House Road,,Ipswich,,IP1 5NX,Tel: 01473517883,No ratings yet Rate it yourself - /Services/careproviders/LeaveReview/DefaultView.aspx?id=1-5778583718,0,0,,
Care Signature Christian Homecare Services Limited,1-3535087252,SCL,Whitehouse Distribution Centre,White House Road,,Ipswich,Suffolk,IP1 5NX,Tel: 01473809694,No ratings yet Rate it yourself - /Services/careproviders/LeaveReview/DefaultView.aspx?id=1-3535087252,0,0,,
Meadowcroft Residential Care Home,1-130146501,SCL,Steam Mill Road,,,Bradfield,Essex,CO11 2QY,,No ratings yet Rate it yourself - /Services/careproviders/LeaveReview/DefaultView.aspx?id=1-130146501,0,0,,
"Right at Home Ipswich, Woodbridge and Felixstowe",1-8622733735,SCL,9 Dencora House,34 White House Road,,Ipswich,,IP1 5LU,Tel: 01473561212,No ratings yet Rate it yourself - /Services/careproviders/LeaveReview/DefaultView.aspx?id=1-8622733735,0,0,,
Radfield Home Care Colchester,1-12053693486,SCL,Myland Hall,Barncroft Close,,Colchester,,CO4 9JU,Tel: 01206646822,No ratings yet Rate it yourself - /Services/careproviders/LeaveReview/DefaultView.aspx?id=1-12053693486,0,0,,
1 Lufkin Road,1-18442818029,SCL,1 Lufkin Road,,,Colchester,,CO4 5JN,Tel: 03337727345,No ratings yet Rate it yourself - /Services/careproviders/LeaveReview/DefaultView.aspx?id=1-18442818029,0,0,,
Bluebird Care (Ipswich),1-292048963,SCL,Durham Suite,"Dencora Business Centre, 36 White House Road",,Ipswich,Suffolk,IP1 5LT,Tel: 01473748931,No ratings yet Rate it yourself - /Services/careproviders/LeaveReview/DefaultView.aspx?id=1-292048963,0,0,,
Bloomsbury Home Care - Suffolk,1-12912428405,SCL,Hereford Suite,"Dencora Business Centre, 36 White House Road",,Ipswich,,IP1 5LT,Tel: 07801832378,No ratings yet Rate it yourself - /Services/careproviders/LeaveReview/DefaultView.aspx?id=1-12912428405,0,0,,
Nayland Lodge,1-330076541,SCL,44 - 46 Nayland Road,Mile End,,Colchester,Essex,CO4 5EN,Tel: 01206853070,No ratings yet Rate it yourself - /Services/careproviders/LeaveReview/DefaultView.aspx?id=1-330076541,0,0,,
Norwich Road,1-12429143533,SCL,315 Norwich Road,,,Ipswich,Suffolk,IP1 4BW,Tel: 01473747247,No ratings yet Rate it yourself - /Services/careproviders/LeaveReview/DefaultView.aspx?id=1-12429143533,0,0,,
The White House,1-3497081558,SCL,Limerick Close,,,Ipswich,Suffolk,IP1 5LR,Tel: 01473740872,No ratings yet Rate it yourself - /Services/careproviders/LeaveReview/DefaultView.aspx?id=1-3497081558,0,0,,
Frantec,1-136359355,SCL,Offices 301 & 305 Franciscan House,51 Princes Street,,Ipswich,,IP1 1UR,Tel: 01473604464,1 rating Rate it yourself - /Services/careproviders/LeaveReview/DefaultView.aspx?id=1-136359355,,,,
Claire Bees Healthcare Ltd,1-18240097373,SCL,"3rd and 4th Floors, Franciscan House",51 Princes St,,Ipswich,,IP1 1UR,,No ratings yet Rate it yourself - /Services/careproviders/LeaveReview/DefaultView.aspx?id=1-18240097373,0,0,,
GKM Divine Services Limited Trading as GKM Home Care,1-18623446930,SCL,"4th Floor, Franciscan House, Suite 423",51 Princess Street,,Ipswich,,IP1 1UR,Tel: 01473954848,No ratings yet Rate it yourself - /Services/careproviders/LeaveReview/DefaultView.aspx?id=1-18623446930,0,0,,
Handford House,1-1317119509,SCL,27a Cumberland Street,,,Ipswich,Suffolk,IP1 3PA,Tel: 01473 231111,No ratings yet Rate it yourself - /Services/careproviders/LeaveReview/DefaultView.aspx?id=1-1317119509,0,0,,
Peppercorn House,1-119792118,SCL,31 Peppercorn Way,Wherstead Road,,Ipswich,Suffolk,IP2 8RT,Tel: 01473603850,No ratings yet Rate it yourself - /Services/careproviders/LeaveReview/DefaultView.aspx?id=1-119792118,0,0,,
Milton Lodge Retirement Home,1-1817647353,SCL,288-290,Ipswich Road,,Colchester,,CO4 0ES,Tel: 01206841215,No ratings yet Rate it yourself - /Services/careproviders/LeaveReview/DefaultView.aspx?id=1-1817647353,0,0,,
Seven Rivers - Care Home with Nursing Physical Disabilities,1-120087314,SCL,Hall Road,Great Bromley,,Colchester,Essex,CO7 7TR,Tel: 01206230345,No ratings yet Rate it yourself - /Services/careproviders/LeaveReview/DefaultView.aspx?id=1-120087314,0,0,,
United Response - Ipswich DCA,1-123006558,SCL,26 Raphael Court,Highfield Road,,Ipswich,,IP1 6DA,Tel: 01473836160,No ratings yet Rate it yourself - /Services/careproviders/LeaveReview/DefaultView.aspx?id=1-123006558,0,0,,
Green Rose Care Head Office,1-15888213725,SCL,"The Hub Business Centre, 2 Civic Drive",,,Ipswich,,IP1 2QA,Tel: 01473381440,No ratings yet Rate it yourself - /Services/careproviders/LeaveReview/DefaultView.aspx?id=1-15888213725,0,0,,
FJK Healthcare Limited,1-18140303145,SCL,The Hub Business Centre,"Hubbard Way, 2 Civic Drive",,Ipswich,,IP1 2QA,,No ratings yet Rate it yourself - /Services/careproviders/LeaveReview/DefaultView.aspx?id=1-18140303145,0,0,,
Rula Homecare Limited,1-10651342076,SCL,Office 22/23,"The Hub Business Centre, 2 Civic Drive",,Ipswich,,IP1 2QA,,1 rating Rate it yourself - /Services/careproviders/LeaveReview/DefaultView.aspx?id=1-10651342076,,,,
Helping Hands Ipswich,1-5612700468,SCL,"Unit 1, Friars Courtyard",Princes Street,,Ipswich,,IP1 1RJ,Tel: 01473927756,No ratings yet Rate it yourself - /Services/careproviders/LeaveReview/DefaultView.aspx?id=1-5612700468,0,0,,
U in Mind Care Limited,1-17713497635,SCL,4 Friars Courtyard,Princes Street,,Ipswich,,IP1 1RJ,Tel: 01473553672,No ratings yet Rate it yourself - /Services/careproviders/LeaveReview/DefaultView.aspx?id=1-17713497635,0,0,,
A Class Care Ipswich,1-8542756342,SCL,3 Cromwell Court,Greyfriars Road,,Ipswich,,IP1 1XG,Tel: 01223864066,No ratings yet Rate it yourself - /Services/careproviders/LeaveReview/DefaultView.aspx?id=1-8542756342,0,0,,
St Fillans Care Home,1-445602335,SCL,St Fillan Road,,,Colchester,Essex,CO4 0PT,Tel: 01206 700373,No ratings yet Rate it yourself - /Services/careproviders/LeaveReview/DefaultView.aspx?id=1-445602335,0,0,,
Sherrington House,1-121065959,SCL,71 Sherrington Road,,,Ipswich,Suffolk,IP1 4HT,,No ratings yet Rate it yourself - /Services/careproviders/LeaveReview/DefaultView.aspx?id=1-121065959,0,0,,
Consensus Community Support Limited- Redan Street,1-2154192756,SCL,15 Redan Street,,,Ipswich,Suffolk,IP1 3PQ,Tel: 01473226399,No ratings yet Rate it yourself - /Services/careproviders/LeaveReview/DefaultView.aspx?id=1-2154192756,0,0,,
"Supported Independence East, Personal Assistance & Domiciliary",1-385503588,SCL,12 Great Whip Street,,,Ipswich,Suffolk,IP2 8EZ,Tel: 01473400855,No ratings yet Rate it yourself - /Services/careproviders/LeaveReview/DefaultView.aspx?id=1-385503588,0,0,,
Woodland View,1-2209923573,SCL,216 Turner Road,,,Colchester,Essex,CO4 5JR,Tel: 01206855390,No ratings yet Rate it yourself - /Services/careproviders/LeaveReview/DefaultView.aspx?id=1-2209923573,0,0,,
Vital Healthcare Services,1-18331767105,SCL,4 College Street,,,Ipswich,,IP4 1BF,Tel: 01473212089,No ratings yet Rate it yourself - /Services/careproviders/LeaveReview/DefaultView.aspx?id=1-18331767105,0,0,,
Gables,1-2259433481,SCL,262 Ipswich Road,,,Colchester,Essex,CO4 0ER,Tel: 01206841515,No ratings yet Rate it yourself - /Services/careproviders/LeaveReview/DefaultView.aspx?id=1-2259433481,0,0,,
Choices Healthcare Ltd Suffolk,1-2040478577,SCL,25 Princes Street,,,Ipswich,,IP1 1PH,Tel: 01473212120,No ratings yet Rate it yourself - /Services/careproviders/LeaveReview/DefaultView.aspx?id=1-2040478577,0,0,,
Master Care Ipswich,1-17188093512,SCL,17 Princes Street,,,Ipswich,,IP1 1PH,Tel: 07460903601,No ratings yet Rate it yourself - /Services/careproviders/LeaveReview/DefaultView.aspx?id=1-17188093512,0,0,,
Westminster Homecare Limited (Ipswich),1-126215594,SCL,"First Floor, 20 Queens Street",,,Ipswich,Suffolk,IP1 1SS,Tel: 01473226868,1 rating Rate it yourself - /Services/careproviders/LeaveReview/DefaultView.aspx?id=1-126215594,,,,
Xen Care Services,1-9983501615,SCL,30 Queen Street,,,Ipswich,,IP1 1SS,Tel: 01473557670,No ratings yet Rate it yourself - /Services/careproviders/LeaveReview/DefaultView.aspx?id=1-9983501615,0,0,,
B & H Care,1-13928127893,SCL,First Floor,32 Queen Street,,Ipswich,,IP1 1SS,Tel: 01473937018,No ratings yet Rate it yourself - /Services/careproviders/LeaveReview/DefaultView.aspx?id=1-13928127893,0,0,,
Sanctuary Supported Living - Suffolk Domiciliary Care,1-2345448935,SCL,"1st Floor, Avalon Court",1 Great Whip Street,,Ipswich,Suffolk,IP2 8FA,Tel: 01473603133,No ratings yet Rate it yourself - /Services/careproviders/LeaveReview/DefaultView.aspx?id=1-2345448935,0,0,,
Prestige Nursing Ipswich,1-126658920,SCL,28 Silent Street,,,Ipswich,Suffolk,IP1 1TF,Tel: 01473559750,No ratings yet Rate it yourself - /Services/careproviders/LeaveReview/DefaultView.aspx?id=1-126658920,0,0,,
Support Unlimited Uk Ltd,1-3866065632,SCL,"Unit  2, IP City Centre",1 Bath Street,,Ipswich,,IP2 8SD,Tel: 01473551270,No ratings yet Rate it yourself - /Services/careproviders/LeaveReview/DefaultView.aspx?id=1-3866065632,0,0,,
Head Office,1-16614175173,SCL,39 Stratford Road,,,Ipswich,,IP1 6EF,Tel: 07834172468,No ratings yet Rate it yourself - /Services/careproviders/LeaveReview/DefaultView.aspx?id=1-16614175173,0,0,,
Butterfly's Care Home,1-1193336686,SCL,1-3 Bromley Road,,,Colchester,Essex,CO4 3JE,Tel: 01206861482,No ratings yet Rate it yourself - /Services/careproviders/LeaveReview/DefaultView.aspx?id=1-1193336686,0,0,,