Organisation Name,NACS Code,Organisation Type,Address1,Address2,Address3,Address4,Address5,PostCode,Telephone Number,NHS.UK users rating,Value  (NHS.UK users rating),Banding Classification  (NHS.UK users rating),Car parking (Is there car parking at this organisation?),Disabled access (Disabled access)
Cedars Place Care Home,1-9705246152,SCL,Sudbury Road,,,Halstead,Essex,CO9 2BB,Tel: 01787472418,No ratings yet Rate it yourself - /Services/careproviders/LeaveReview/DefaultView.aspx?id=1-9705246152,0,0,,
Colne House,1-122652732,SCL,Station Road,Earls Colne,,Colchester,Essex,CO6 2LT,Tel: 01787222227,No ratings yet Rate it yourself - /Services/careproviders/LeaveReview/DefaultView.aspx?id=1-122652732,0,0,,
Colne View,1-413132531,SCL,Dame Mary Walk,,,Halstead,Essex,CO9 2FF,Tel: 01787478473,No ratings yet Rate it yourself - /Services/careproviders/LeaveReview/DefaultView.aspx?id=1-413132531,0,0,,
Blamster's Link,1-9188107863,SCL,Blamsters Link,Howe Chase,,Halstead,Essex,CO9 2QJ,Tel: 01787479346,No ratings yet Rate it yourself - /Services/careproviders/LeaveReview/DefaultView.aspx?id=1-9188107863,0,0,,
Grammar School House,1-290583411,SCL,York Road,Earls Colne,,Colchester,Essex,CO6 2RN,Tel: 01787222412,No ratings yet Rate it yourself - /Services/careproviders/LeaveReview/DefaultView.aspx?id=1-290583411,0,0,,
Priory House,1-302838540,SCL,2 Kestrel Rise,,,Halstead,Essex,CO9 2TU,Tel: 01787479172,No ratings yet Rate it yourself - /Services/careproviders/LeaveReview/DefaultView.aspx?id=1-302838540,0,0,,
Brook House,1-12718124805,SCL,47 Colchester Road,White Colne,,Colchester,Essex,CO6 2PW,Tel: 01787222377,No ratings yet Rate it yourself - /Services/careproviders/LeaveReview/DefaultView.aspx?id=1-12718124805,0,0,,
Meadowview Care Limited,1-8970882576,SCL,8-10 The Centre,High Street,,Halstead,,CO9 2AJ,Tel: 01787476679,No ratings yet Rate it yourself - /Services/careproviders/LeaveReview/DefaultView.aspx?id=1-8970882576,0,0,,
Crossfields Lodge,1-10239195055,SCL,18 Crossfields,,,Halstead,,CO9 1UY,Tel: 01787476679,1 rating Rate it yourself - /Services/careproviders/LeaveReview/DefaultView.aspx?id=1-10239195055,,,,
Hillside Lodge,1-10592451713,SCL,12 Crossfields,,,Halstead,,CO9 1UY,,No ratings yet Rate it yourself - /Services/careproviders/LeaveReview/DefaultView.aspx?id=1-10592451713,0,0,,
Brewery House,1-321118559,SCL,28 Brewery Drive,,,Halstead,Essex,CO9 1EF,Tel: 01787 472046,No ratings yet Rate it yourself - /Services/careproviders/LeaveReview/DefaultView.aspx?id=1-321118559,0,0,,
Bethany House,1-342331191,SCL,32 Brewery Drive,,,Halstead,Essex,CO9 1EF,Tel: 01787 472613,No ratings yet Rate it yourself - /Services/careproviders/LeaveReview/DefaultView.aspx?id=1-342331191,0,0,,
The Tidings,1-320941043,SCL,9 Brewery Drive,,,Halstead,Essex,CO9 1BS,Tel: 01787479244,No ratings yet Rate it yourself - /Services/careproviders/LeaveReview/DefaultView.aspx?id=1-320941043,0,0,,
Bethel Place,1-3942625345,SCL,9 St James Close,,,Halstead,Essex,CO9 1GX,Tel: 07572626452,No ratings yet Rate it yourself - /Services/careproviders/LeaveReview/DefaultView.aspx?id=1-3942625345,0,0,,
Blackthorns,1-131482122,SCL,21-29 Dooley Road,,,Halstead,Essex,CO9 1JW,Tel: 01787472170,No ratings yet Rate it yourself - /Services/careproviders/LeaveReview/DefaultView.aspx?id=1-131482122,0,0,,
Bamburgh Supported Living,1-2799424316,SCL,"8c, Wakes Hall Business Centre","Colchester Road, Wakes Colne",,Colchester,,CO6 2DY,Tel: 01206252491,No ratings yet Rate it yourself - /Services/careproviders/LeaveReview/DefaultView.aspx?id=1-2799424316,0,0,,
18 Acorn Avenue,1-9188107801,SCL,18 Acorn Avenue,,,Halstead,,CO9 1LQ,Tel: 01787479491,No ratings yet Rate it yourself - /Services/careproviders/LeaveReview/DefaultView.aspx?id=1-9188107801,0,0,,
Blamster's Farm,1-9187964192,SCL,Mount Hill,,,Halstead,Essex,CO9 1LR,Tel: 01255823547,No ratings yet Rate it yourself - /Services/careproviders/LeaveReview/DefaultView.aspx?id=1-9187964192,0,0,,
ivolve Mid Essex Supported Living,1-15520678460,SCL,Blamsters Farm - Office,Mount Hill,,Halstead,,CO9 1LR,Tel: 07495386490,No ratings yet Rate it yourself - /Services/careproviders/LeaveReview/DefaultView.aspx?id=1-15520678460,0,0,,
Hyacinth Care Ltd,1-15217417998,SCL,25 Digby Way,,,Halstead,,CO9 1FT,,No ratings yet Rate it yourself - /Services/careproviders/LeaveReview/DefaultView.aspx?id=1-15217417998,0,0,,
Halstead Hall Care Home,1-4487228008,SCL,"Mount Hill, Braintree Road",,,Halstead,Essex,CO9 1SL,Tel: 01787476892,No ratings yet Rate it yourself - /Services/careproviders/LeaveReview/DefaultView.aspx?id=1-4487228008,0,0,,
SureCare Colchester & Braintree,1-14831941050,SCL,Blackwells House,"Coggeshall Road, Earls Colne",,Colchester,,CO6 2JX,Tel: 01787335105,No ratings yet Rate it yourself - /Services/careproviders/LeaveReview/DefaultView.aspx?id=1-14831941050,0,0,,
Crosspath Care LTD,1-3605361393,SCL,"Suite 9 , Blackwell House","Coggeshall Road, Earls Colne",,Colchester,,CO6 2JX,Tel: 01787827570,No ratings yet Rate it yourself - /Services/careproviders/LeaveReview/DefaultView.aspx?id=1-3605361393,0,0,,
Ogilvie Court,1-130318587,SCL,America Road,Earls Colne,,Colchester,Essex,CO6 2LB,Tel: 01787222355,1 rating Rate it yourself - /Services/careproviders/LeaveReview/DefaultView.aspx?id=1-130318587,,,,
Ivolve Colchester Supported Living,1-18743185383,SCL,"Unit 15e Field House, Earls Colne Business Park",Earls Colne,,Colchester,,CO6 2NS,Tel: 01787479491,No ratings yet Rate it yourself - /Services/careproviders/LeaveReview/DefaultView.aspx?id=1-18743185383,0,0,,
Forest Homecare Limited,1-128899446,SCL,"The Old Coalyard, 61 Alderford Street",Sible Hedingham,,Halstead,Essex,CO9 3HX,Tel: 01787463222,No ratings yet Rate it yourself - /Services/careproviders/LeaveReview/DefaultView.aspx?id=1-128899446,0,0,,
Forest Home,1-111230952,SCL,58 Swan Street,Sible Hedingham,,Halstead,Essex,CO9 3HT,Tel: 01787460361,No ratings yet Rate it yourself - /Services/careproviders/LeaveReview/DefaultView.aspx?id=1-111230952,0,0,,
C09 SENIOR HOMEHELP LIMITED,1-12112547739,SCL,Falcon House,"3 King Street, Castle Hedingham",,Halstead,,CO9 3ER,Tel: 01787813127,No ratings yet Rate it yourself - /Services/careproviders/LeaveReview/DefaultView.aspx?id=1-12112547739,0,0,,
Mellish House Residential Home,1-127865573,SCL,20a Kings Hill,Great Cornard,,Sudbury,Suffolk,CO10 0EH,Tel: 080 8223 5523,No ratings yet Rate it yourself - /Services/careproviders/LeaveReview/DefaultView.aspx?id=1-127865573,0,0,,
Hillside Care Home,1-127865590,SCL,20 Kings Hill,Great Cornard,,Sudbury,Suffolk,CO10 0EH,Tel: 080 8223 5511,No ratings yet Rate it yourself - /Services/careproviders/LeaveReview/DefaultView.aspx?id=1-127865590,0,0,,
The Red House Welfare & Housing Society,1-110186419,SCL,Meadow Lane,,,Sudbury,Suffolk,CO10 2TD,Tel: 01787372948,No ratings yet Rate it yourself - /Services/careproviders/LeaveReview/DefaultView.aspx?id=1-110186419,0,0,,
William Wood House,1-220311555,SCL,School Street,,,Sudbury,Suffolk,CO10 2AW,,No ratings yet Rate it yourself - /Services/careproviders/LeaveReview/DefaultView.aspx?id=1-220311555,0,0,,
Catchpole Court,1-17709036421,SCL,Walnut Tree Lane,,,Sudbury,Suffolk,CO10 1BD,Tel: 01787882023,No ratings yet Rate it yourself - /Services/careproviders/LeaveReview/DefaultView.aspx?id=1-17709036421,0,0,,
Ivolve Shawlands Supported Living,1-18773168970,SCL,"Fieldview, Hare Field, Woodpecke","Shawlands Avenue, Great Cornard",,Sudbury,,CO10 0EW,,No ratings yet Rate it yourself - /Services/careproviders/LeaveReview/DefaultView.aspx?id=1-18773168970,0,0,,
Jamesons RCH Wormingford Road,1-126342958,SCL,Wormingford Road,Fordham,,Colchester,Essex,CO6 3NS,Tel: 01206809736,No ratings yet Rate it yourself - /Services/careproviders/LeaveReview/DefaultView.aspx?id=1-126342958,0,0,,
The Conifers,1-9176432858,SCL,"Wormingford Road,",Fordham,,Colchester,,CO6 3NS,Tel: 01206241366,No ratings yet Rate it yourself - /Services/careproviders/LeaveReview/DefaultView.aspx?id=1-9176432858,0,0,,
ivolve Suffolk Supported Living,1-15521798386,SCL,"Peter Dodd Mews, Shawlands Avenue",Great Cornard,,Sudbury,,CO10 0FY,Tel: 07495398447,No ratings yet Rate it yourself - /Services/careproviders/LeaveReview/DefaultView.aspx?id=1-15521798386,0,0,,
Chilton Croft Nursing Home,1-138373825,SCL,Newton Road,,,Sudbury,Suffolk,CO10 2RN,Tel: 01787374146,No ratings yet Rate it yourself - /Services/careproviders/LeaveReview/DefaultView.aspx?id=1-138373825,0,0,,
St Josephs,1-3306736467,SCL,The Croft,,,Sudbury,Suffolk,CO10 1HR,Tel: 01787888460,No ratings yet Rate it yourself - /Services/careproviders/LeaveReview/DefaultView.aspx?id=1-3306736467,0,0,,
Supporting An Independent Life,1-19025823882,SCL,Unit 14,"South Suffolk Business Centre, Alexandra Road",,Sudbury,,CO10 2ZX,Tel: 07961329802,No ratings yet Rate it yourself - /Services/careproviders/LeaveReview/DefaultView.aspx?id=1-19025823882,0,0,,
Trust Homecare Solution South Suffolk Limited,1-14526433151,SCL,Unit 13,"South Suffolk Business Centre, Alexandra Road",,Sudbury,,CO10 2ZX,Tel: 07846858595,No ratings yet Rate it yourself - /Services/careproviders/LeaveReview/DefaultView.aspx?id=1-14526433151,0,0,,
Forest Homecare Suffolk,1-1006660964,SCL,Unit 22 South Suffolk Business Centre,Alexandra Road,,Sudbury,Suffolk,CO10 2XH,Tel: 01787463222,No ratings yet Rate it yourself - /Services/careproviders/LeaveReview/DefaultView.aspx?id=1-1006660964,0,0,,
Girling Street,1-136882841,SCL,34 Girling Street,,,Sudbury,Suffolk,CO10 1PG,Tel: 01787882082,No ratings yet Rate it yourself - /Services/careproviders/LeaveReview/DefaultView.aspx?id=1-136882841,0,0,,
St Faith's Villa,1-490382352,SCL,90 Queens Road,,,Sudbury,Suffolk,CO10 1PG,Tel: 01787370036,No ratings yet Rate it yourself - /Services/careproviders/LeaveReview/DefaultView.aspx?id=1-490382352,0,0,,
Hazell Court,1-121065927,SCL,Acton Lane,,,Sudbury,Suffolk,CO10 1QN,,2 ratings Rate it yourself - /Services/careproviders/LeaveReview/DefaultView.aspx?id=1-121065927,,,,
Greenacres,1-9883250821,SCL,"Greenacres, Joes Road","Cornard Tye, Great Cornard",,Sudbury,,CO10 0QB,Tel: 01449888110,No ratings yet Rate it yourself - /Services/careproviders/LeaveReview/DefaultView.aspx?id=1-9883250821,0,0,,
Barleycombe,1-2989956028,SCL,Sudbury Road,Long Melford,,Sudbury,Suffolk,CO10 9HE,Tel: 01787880203,No ratings yet Rate it yourself - /Services/careproviders/LeaveReview/DefaultView.aspx?id=1-2989956028,0,0,,
Rainbow Trust Children's Charity 7,1-2398630556,SCL,2 Godbolts Business Park,"Coggeshall Road, Marks Tey",,Colchester,,CO6 1HS,Tel: 07825601360,No ratings yet Rate it yourself - /Services/careproviders/LeaveReview/DefaultView.aspx?id=1-2398630556,0,0,,
Prince Edward Duke of Kent Court,1-2506628801,SCL,Stisted Hall,"Kings Lane, Stisted",,Braintree,Essex,CM77 8AG,Tel: 01376345534,No ratings yet Rate it yourself - /Services/careproviders/LeaveReview/DefaultView.aspx?id=1-2506628801,0,0,,
Millard House,1-2480907055,SCL,Church Street,Bocking,,Braintree,Essex,CM7 5LL,Tel: 07748903235,No ratings yet Rate it yourself - /Services/careproviders/LeaveReview/DefaultView.aspx?id=1-2480907055,0,0,,
Essex Care Consortium - Marks Tey,1-111168950,SCL,Laurels,"Station Road, Marks Tey",,Colchester,Essex,CO6 1EE,Tel: 01206211825,No ratings yet Rate it yourself - /Services/careproviders/LeaveReview/DefaultView.aspx?id=1-111168950,0,0,,
Vivid Community Care Limited,1-2830423225,SCL,Nags Corner,"Wiston Road, Nayland",,Colchester,Essex,CO6 4LT,Tel: 01206264173,No ratings yet Rate it yourself - /Services/careproviders/LeaveReview/DefaultView.aspx?id=1-2830423225,0,0,,
Ashwood Care Colchester,1-19060985990,SCL,"Door 4, First Floor East, Nags Corner, Wiston Road",Nayland,,Colchester,,CO6 4LT,Tel: 02033759403,No ratings yet Rate it yourself - /Services/careproviders/LeaveReview/DefaultView.aspx?id=1-19060985990,0,0,,
The Ridings,1-166355947,SCL,52 Spring Lane,Fordham Heath,,Colchester,Essex,CO3 9TG,Tel: 07507704495,No ratings yet Rate it yourself - /Services/careproviders/LeaveReview/DefaultView.aspx?id=1-166355947,0,0,,
Creative Support - Thistley Green,1-5892162801,SCL,3 Thistley Green,Thistley Green Road,,Braintree,,CM7 9SE,Tel: 01612360829,No ratings yet Rate it yourself - /Services/careproviders/LeaveReview/DefaultView.aspx?id=1-5892162801,0,0,,
Nayland House Care Home,1-10615566937,SCL,Off Bear Street,Nayland,,Colchester,,CO6 4LA,Tel: 0000000000,No ratings yet Rate it yourself - /Services/careproviders/LeaveReview/DefaultView.aspx?id=1-10615566937,0,0,,
Progressive Mews,1-6754364087,SCL,Halstead Road,Eight Ash Green,,Colchester,Essex,CO6 3QH,Tel: 01206587070,1 rating Rate it yourself - /Services/careproviders/LeaveReview/DefaultView.aspx?id=1-6754364087,,,,
Acorn Lodge Care Home,1-132080995,SCL,"Bovington Road, Bezley End",Beazley End,,Braintree,Essex,CM7 5JH,Tel: 01371851172,No ratings yet Rate it yourself - /Services/careproviders/LeaveReview/DefaultView.aspx?id=1-132080995,0,0,,
Fern Lodge,1-16310357719,SCL,108 Broad Road,,,Braintree,,CM7 9RX,Tel: 03003032642,No ratings yet Rate it yourself - /Services/careproviders/LeaveReview/DefaultView.aspx?id=1-16310357719,0,0,,
Larchwood Care Home,1-320814478,SCL,108 Broad Road,Bocking,,Braintree,Essex,CM7 9RX,Tel: 01376347777,No ratings yet Rate it yourself - /Services/careproviders/LeaveReview/DefaultView.aspx?id=1-320814478,0,0,,
New Copford Place Residential Care Home,1-117316885,SCL,London Road,Copford,,Colchester,Essex,CO6 1YR,Tel: 01206210397,No ratings yet Rate it yourself - /Services/careproviders/LeaveReview/DefaultView.aspx?id=1-117316885,0,0,,
Pathways Care Centre,1-2464490818,SCL,"Brickstables Barn, Halstead Road",Lexden Heath,,Colchester,Essex,CO3 0JU,Tel: 01206367650,No ratings yet Rate it yourself - /Services/careproviders/LeaveReview/DefaultView.aspx?id=1-2464490818,0,0,,
Melford Court Care Home,1-4335876242,SCL,Hall Street,Long Melford,,Sudbury,Suffolk,CO10 9JA,Tel: 01787880545,No ratings yet Rate it yourself - /Services/careproviders/LeaveReview/DefaultView.aspx?id=1-4335876242,0,0,,
Bocking Alms Houses,1-3119749527,SCL,1-20 Deans Walk,Bocking,,Braintree,Essex,CM7 5JN,Tel: 01376345865,No ratings yet Rate it yourself - /Services/careproviders/LeaveReview/DefaultView.aspx?id=1-3119749527,0,0,,
Spring Success Home Care Limited,1-18268525847,SCL,4 Flamingo Crescent,Stanway,,Colchester,,CO3 8BX,Tel: 07440653094,1 rating Rate it yourself - /Services/careproviders/LeaveReview/DefaultView.aspx?id=1-18268525847,,,,
St Mary's Court,1-121361003,SCL,Deanery Hill,Bocking,,Braintree,Essex,CM7 5SR,Tel: 01376328600,No ratings yet Rate it yourself - /Services/careproviders/LeaveReview/DefaultView.aspx?id=1-121361003,0,0,,
The New Deanery Care Home,1-121360985,SCL,Deanery Hill,Bocking,,Braintree,Essex,CM7 5SR,Tel: 01376558555,No ratings yet Rate it yourself - /Services/careproviders/LeaveReview/DefaultView.aspx?id=1-121360985,0,0,,
Kilkee Lodge Residential Home,1-121042031,SCL,Coggeshall Road,,,Braintree,Essex,CM7 9ED,Tel: 01376342455,1 rating Rate it yourself - /Services/careproviders/LeaveReview/DefaultView.aspx?id=1-121042031,,,,
Harmonize Care,1-3087260524,SCL,The Old Pharmacy,"Hall Street, Long Melford",,Sudbury,,CO10 9JQ,Tel: 07539348263,2 ratings Rate it yourself - /Services/careproviders/LeaveReview/DefaultView.aspx?id=1-3087260524,,,,
Bloomcare Ltd,1-6553491625,SCL,98 Clay Pits,,,Braintree,,CM7 3LP,Tel: 07496328262,No ratings yet Rate it yourself - /Services/careproviders/LeaveReview/DefaultView.aspx?id=1-6553491625,0,0,,
Braintree Mews Care Home,1-17967432115,SCL,Church Lane,,,Braintree,,CM7 5SE,Tel: 01376778219,No ratings yet Rate it yourself - /Services/careproviders/LeaveReview/DefaultView.aspx?id=1-17967432115,0,0,,
1 Oak Home Care,1-3857492640,SCL,Unit 1 & 2 Woodview,"Bull Lane Industrial Estate, Bull Lane, Acton",,Sudbury,,CO10 0FD,Tel: 01787326555,No ratings yet Rate it yourself - /Services/careproviders/LeaveReview/DefaultView.aspx?id=1-3857492640,0,0,,
Briarcare Recruitment Agency,1-4624516852,SCL,Unit 3,"Woodview, Bull Lane Industrial Estate, Bull Lane, Acton",,Sudbury,Suffolk,CO10 0FD,Tel: 01787881185,No ratings yet Rate it yourself - /Services/careproviders/LeaveReview/DefaultView.aspx?id=1-4624516852,0,0,,
Drummonds,1-2962220721,SCL,The Street,Feering,,Colchester,Essex,CO5 9QJ,Tel: 01376570711,No ratings yet Rate it yourself - /Services/careproviders/LeaveReview/DefaultView.aspx?id=1-2962220721,0,0,,
Springfields Residential Home,1-130156298,SCL,Rectory Road,Copford Green,,Colchester,Essex,CO6 1DH,Tel: 01206211065,No ratings yet Rate it yourself - /Services/careproviders/LeaveReview/DefaultView.aspx?id=1-130156298,0,0,,
Springfields Nursing Home,1-130156282,SCL,Rectory Road,Copford Green,,Colchester,Essex,CO6 1DH,,No ratings yet Rate it yourself - /Services/careproviders/LeaveReview/DefaultView.aspx?id=1-130156282,0,0,,
Linmar Care Ltd,1-5270616816,SCL,"Unit 2, 99 London Road",Stanway,,Colchester,,CO3 0NY,Tel: 01376802011,1 rating Rate it yourself - /Services/careproviders/LeaveReview/DefaultView.aspx?id=1-5270616816,,,,
Great Bradfords House,1-3697900506,SCL,159 Coggeshall Road,,,Braintree,Essex,CM7 9GD,Tel: 01376326196,No ratings yet Rate it yourself - /Services/careproviders/LeaveReview/DefaultView.aspx?id=1-3697900506,0,0,,
Imola,1-120448382,SCL,Lanham Green,Cressing,,Braintree,Essex,CM77 8DT,Tel: 01376584352,1 rating Rate it yourself - /Services/careproviders/LeaveReview/DefaultView.aspx?id=1-120448382,,,,
Poplars,1-143392589,SCL,Clockhouse Way,,,Braintree,Essex,CM7 3RD,Tel: 01376342772,No ratings yet Rate it yourself - /Services/careproviders/LeaveReview/DefaultView.aspx?id=1-143392589,0,0,,
Marsh House,1-1501270015,SCL,4 Villa Road,Stanway,,Colchester,Essex,CO3 0RH,Tel: 01206762885,No ratings yet Rate it yourself - /Services/careproviders/LeaveReview/DefaultView.aspx?id=1-1501270015,0,0,,
Kacee Lodge,1-117302395,SCL,Ivy Lodge Road,Great Horkesley,,Colchester,Essex,CO6 4EN,Tel: 01206272108,No ratings yet Rate it yourself - /Services/careproviders/LeaveReview/DefaultView.aspx?id=1-117302395,0,0,,
Tudor House,1-133814075,SCL,47A London Road,Stanway,,Colchester,Essex,CO3 0NR,Tel: 01206562790,No ratings yet Rate it yourself - /Services/careproviders/LeaveReview/DefaultView.aspx?id=1-133814075,0,0,,
Shammah Care Service Ltd,1-9528974096,SCL,7 Blackbird Close,Stanway,,Colchester,,CO3 8BG,Tel: 01268260773,No ratings yet Rate it yourself - /Services/careproviders/LeaveReview/DefaultView.aspx?id=1-9528974096,0,0,,
Health Care Hut Ltd,1-13180286444,SCL,32 Martin Hunt Drive,Stanway,,Colchester,,CO3 8AY,Tel: 07402360606,No ratings yet Rate it yourself - /Services/careproviders/LeaveReview/DefaultView.aspx?id=1-13180286444,0,0,,
Aspen Grange Care Home,1-1530924983,SCL,Coldnailhurst Avenue,,,Braintree,,CM7 5PY,Tel: 01376550764,No ratings yet Rate it yourself - /Services/careproviders/LeaveReview/DefaultView.aspx?id=1-1530924983,0,0,,
Care Givers - 11 Barnfield Road,1-15643435432,SCL,11 Barnfield Road,Great Horkesley,,Colchester,,CO6 4TR,Tel: 01206890904,No ratings yet Rate it yourself - /Services/careproviders/LeaveReview/DefaultView.aspx?id=1-15643435432,0,0,,
Great Horkesley Manor,1-13725020178,SCL,Nayland Road,Great Horkesley,,Colchester,Essex,CO6 4ET,Tel: 01206988977,No ratings yet Rate it yourself - /Services/careproviders/LeaveReview/DefaultView.aspx?id=1-13725020178,0,0,,
Stanway Villa,1-127549214,SCL,9 Nursery Close,Stanway,,Colchester,Essex,CO3 0RL,Tel: 01206769400,No ratings yet Rate it yourself - /Services/careproviders/LeaveReview/DefaultView.aspx?id=1-127549214,0,0,,
Loganberry Lodge,1-131481789,SCL,79-81 New Farm Road,Stanway,,Colchester,Essex,CO3 0PG,Tel: 01206563791,1 rating Rate it yourself - /Services/careproviders/LeaveReview/DefaultView.aspx?id=1-131481789,,,,
Zero Three Domiciliary Care,1-6987994157,SCL,1 Exchange Court,"London Road, Feering",,Colchester,,CO5 9FB,,No ratings yet Rate it yourself - /Services/careproviders/LeaveReview/DefaultView.aspx?id=1-6987994157,0,0,,
Good Life Care Limited,1-6791556177,SCL,40 Stilemans Wood,Cressing,,Braintree,,CM77 8GR,Tel: 07940373598,No ratings yet Rate it yourself - /Services/careproviders/LeaveReview/DefaultView.aspx?id=1-6791556177,0,0,,
Bluebird Care Braintree and Uttlesford,1-2932089597,SCL,Century House,"12 Freeport Office Village, Century Drive",,Braintree,,CM77 8YG,Tel: 01376314090,1 rating Rate it yourself - /Services/careproviders/LeaveReview/DefaultView.aspx?id=1-2932089597,,,,
1 STOP REC LIMITED,1-13765726722,SCL,35-39,London Road,,Colchester,,CO3 9AJ,Tel: 01206616171,No ratings yet Rate it yourself - /Services/careproviders/LeaveReview/DefaultView.aspx?id=1-13765726722,0,0,,
Braintree Nursing Home,1-14905851890,SCL,11 Coggeshall Road,,,Braintree,Essex,CM7 9DB,Tel: 01376552391,No ratings yet Rate it yourself - /Services/careproviders/LeaveReview/DefaultView.aspx?id=1-14905851890,0,0,,
Rascasse,1-224756649,SCL,Sheepcotes Lane,Silver End,,Witham,Essex,CM8 3PJ,Tel: 01376574900,No ratings yet Rate it yourself - /Services/careproviders/LeaveReview/DefaultView.aspx?id=1-224756649,0,0,,
Mirabeau,1-120448364,SCL,Sheepcotes Lane,Silver End,,Witham,Essex,CM8 3PJ,Tel: 01376585599,No ratings yet Rate it yourself - /Services/careproviders/LeaveReview/DefaultView.aspx?id=1-120448364,0,0,,
Yarra Respite,1-6051656220,SCL,67 Collingwood Road,,,Colchester,Essex,CO3 9AY,Tel: 07510055378,No ratings yet Rate it yourself - /Services/careproviders/LeaveReview/DefaultView.aspx?id=1-6051656220,0,0,,
Devonshire House,1-3306736227,SCL,High Street,Cavendish,,Sudbury,Suffolk,CO10 8AS,Tel: 01787283240,No ratings yet Rate it yourself - /Services/careproviders/LeaveReview/DefaultView.aspx?id=1-3306736227,0,0,,
Riverdale Care Home,1-5784652772,SCL,65 Duggers Lane,,,Braintree,Essex,CM7 1BA,Tel: 01376 349643,No ratings yet Rate it yourself - /Services/careproviders/LeaveReview/DefaultView.aspx?id=1-5784652772,0,0,,
Fareni Lifecare Ltd,1-15913546707,SCL,3-5 New Street,,,Braintree,,CM7 1ER,,No ratings yet Rate it yourself - /Services/careproviders/LeaveReview/DefaultView.aspx?id=1-15913546707,0,0,,
Chinite Resourcing Limited (Chinite Home Care),1-18984531742,SCL,22A New Street,,,Braintree,,CM7 1ES,Tel: 01376433917,No ratings yet Rate it yourself - /Services/careproviders/LeaveReview/DefaultView.aspx?id=1-18984531742,0,0,,
Bradbury House,1-784337395,SCL,New Street,,,Braintree,Essex,CM7 1ES,Tel: 01376348181,No ratings yet Rate it yourself - /Services/careproviders/LeaveReview/DefaultView.aspx?id=1-784337395,0,0,,
Boars Tye Farm Residential Home,1-705171944,SCL,20 Boars Tye Road,Silver End,,Witham,Essex,CM8 3QA,Tel: 01376584515,No ratings yet Rate it yourself - /Services/careproviders/LeaveReview/DefaultView.aspx?id=1-705171944,0,0,,
Home instead Braintree,1-12075342677,SCL,"Unit 5/6 Ignite House, Braintree Enterprise Centre",46 Springwood Drive,,Braintree,,CM7 2YN,Tel: 01376319100,No ratings yet Rate it yourself - /Services/careproviders/LeaveReview/DefaultView.aspx?id=1-12075342677,0,0,,
Helping Hands Braintree,1-9829286146,SCL,83 High Street,,,Braintree,,CM7 1JS,Tel: 07443 772520,No ratings yet Rate it yourself - /Services/careproviders/LeaveReview/DefaultView.aspx?id=1-9829286146,0,0,,
Westminster Homecare Limited (Chelmsford),1-8744694351,SCL,1a Cooper Drive,Springwood Industrial Estate,,Braintree,,CM7 2RF,Tel: 01376440523,No ratings yet Rate it yourself - /Services/careproviders/LeaveReview/DefaultView.aspx?id=1-8744694351,0,0,,
Christchurch Care Agency,1-165432259,SCL,132 High Street,,,Braintree,Essex,CM7 1LB,Tel: 01376343223,1 rating Rate it yourself - /Services/careproviders/LeaveReview/DefaultView.aspx?id=1-165432259,,,,
Joseph Gardens,1-1588829407,SCL,7 Joseph Gardens,,,Silver End,Essex,CM8 3SN,,No ratings yet Rate it yourself - /Services/careproviders/LeaveReview/DefaultView.aspx?id=1-1588829407,0,0,,