Organisation Name,NACS Code,Organisation Type,Address1,Address2,Address3,Address4,Address5,PostCode,Telephone Number,NHS.UK users rating,Value  (NHS.UK users rating),Banding Classification  (NHS.UK users rating),Car parking (Is there car parking at this organisation?),Disabled access (Disabled access)
Rosehill House,1-118587664,SCL,Moresby,,,Whitehaven,Cumbria,CA28 6SF,Tel: 01946695235,No ratings yet Rate it yourself - /Services/careproviders/LeaveReview/DefaultView.aspx?id=1-118587664,0,0,,
Harbour View Care Home,1-128584563,SCL,14A Bransty Road,,,Whitehaven,Cumbria,CA28 6HA,Tel: 01946599963,No ratings yet Rate it yourself - /Services/careproviders/LeaveReview/DefaultView.aspx?id=1-128584563,0,0,,
Walsingham Support - Moresby Parks,1-124120160,SCL,Walsingham,"Main Road, Moresby Parks",,Whitehaven,Cumbria,CA28 8XG,Tel: 01946599772,No ratings yet Rate it yourself - /Services/careproviders/LeaveReview/DefaultView.aspx?id=1-124120160,0,0,,
Cumbria Emmaus Trust,1-17130532373,SCL,Walkmill Close,Moresby Parks,,Whitehaven,Cumbria,CA28 8XR,Tel: 01946591362,No ratings yet Rate it yourself - /Services/careproviders/LeaveReview/DefaultView.aspx?id=1-17130532373,0,0,,
Bethany House Limited,1-121574533,SCL,Bethany House,20 Front Corkickle,,Whitehaven,Cumbria,CA28 8AA,Tel: 01946695556,No ratings yet Rate it yourself - /Services/careproviders/LeaveReview/DefaultView.aspx?id=1-121574533,0,0,,
Human Support Group Limited - Whitehaven,1-1921487957,SCL,Unit 8,"Hensingham Business Park, Hensingham",,Whitehaven,Cumbria,CA28 8YU,Tel: 01946695552,No ratings yet Rate it yourself - /Services/careproviders/LeaveReview/DefaultView.aspx?id=1-1921487957,0,0,,
The Gables,1-15199227104,SCL,The Gables,Cleator Moor Road,,Whitehaven,,CA28 8TX,Tel: 01946505577,No ratings yet Rate it yourself - /Services/careproviders/LeaveReview/DefaultView.aspx?id=1-15199227104,0,0,,
Cumberland Extra Care Housing,1-15199227471,SCL,Monkwray Court,"Monkwray Road, Kells",,Whitehaven,,CA28 9HD,Tel: 07825340203,No ratings yet Rate it yourself - /Services/careproviders/LeaveReview/DefaultView.aspx?id=1-15199227471,0,0,,
Whitehaven,1-17889729655,SCL,103 Main Street,Hensingham,,Whitehaven,,CA28 8QD,Tel: 07570084284,No ratings yet Rate it yourself - /Services/careproviders/LeaveReview/DefaultView.aspx?id=1-17889729655,0,0,,
West House - 3&4 Glebe Lane,1-133330298,SCL,Distington,,,Workington,Cumbria,CA14 5SQ,Tel: 01946831629,No ratings yet Rate it yourself - /Services/careproviders/LeaveReview/DefaultView.aspx?id=1-133330298,0,0,,
Bethshan Nursing Home Limited,1-149779009,SCL,Yewbarrow Close,,,Whitehaven,Cumbria,CA28 8HB,Tel: 01946590071,1 rating Rate it yourself - /Services/careproviders/LeaveReview/DefaultView.aspx?id=1-149779009,,,,
Highfield House,1-137305399,SCL,St Bees Road,,,Whitehaven,Cumbria,CA28 9UB,Tel: 01946695557,1 rating Rate it yourself - /Services/careproviders/LeaveReview/DefaultView.aspx?id=1-137305399,,,,
Westwinds Residential Home,1-114118727,SCL,North Side,Harrington,,Workington,Cumbria,CA14 5QW,Tel: 01946830232,No ratings yet Rate it yourself - /Services/careproviders/LeaveReview/DefaultView.aspx?id=1-114118727,0,0,,
Walsingham Support - Griffin Close,1-124120113,SCL,Walsingham,Griffin Close,,Frizington,Cumbria,CA26 3SH,Tel: 01946813402,No ratings yet Rate it yourself - /Services/careproviders/LeaveReview/DefaultView.aspx?id=1-124120113,0,0,,
East Croft Grange,1-128559265,SCL,Scaw Road,High Harrington,,Workington,Cumbria,CA14 4LY,Tel: 01946832754,No ratings yet Rate it yourself - /Services/careproviders/LeaveReview/DefaultView.aspx?id=1-128559265,0,0,,
Wyndham Manor Care Home,1-129570281,SCL,Wyndham Street,,,Cleator Moor,Cumbria,CA25 5AN,Tel: 01946810020,No ratings yet Rate it yourself - /Services/careproviders/LeaveReview/DefaultView.aspx?id=1-129570281,0,0,,
121 Care,1-1612764464,SCL,Stirling Place 22-24,High Street,,Cleator Moor,Cumbria,CA25 5LB,Tel: 01946815706,1 rating Rate it yourself - /Services/careproviders/LeaveReview/DefaultView.aspx?id=1-1612764464,,,,
Cumberland Care Reablement and Domiciliary Service - West,1-15199237174,SCL,West Cumbria House,Jubilee Road,,Workington,,CA14 4HB,Tel: 07919070245,No ratings yet Rate it yourself - /Services/careproviders/LeaveReview/DefaultView.aspx?id=1-15199237174,0,0,,
Rosecroft Residential Home,1-125582642,SCL,Westfield Drive,,,Workington,Cumbria,CA14 5AZ,Tel: 01900 604814,No ratings yet Rate it yourself - /Services/careproviders/LeaveReview/DefaultView.aspx?id=1-125582642,0,0,,
The Fairways,1-1458070571,SCL,Branthwaite Road,,,Workington,Cumbria,CA14 4SS,Tel: 0190067111,No ratings yet Rate it yourself - /Services/careproviders/LeaveReview/DefaultView.aspx?id=1-1458070571,0,0,,
Floshfield,1-133330229,SCL,Floshfield Bungalow,,,Cleator,Cumbria,CA23 3DT,Tel: 01946810987,No ratings yet Rate it yourself - /Services/careproviders/LeaveReview/DefaultView.aspx?id=1-133330229,0,0,,
Walsingham Support - Crummock Road,1-124120066,SCL,Walsingham,Moor Close,,Workington,Cumbria,CA14 3RP,Tel: 01900606170,No ratings yet Rate it yourself - /Services/careproviders/LeaveReview/DefaultView.aspx?id=1-124120066,0,0,,
Gregory House,1-1985447227,SCL,Furness Road,,,Workington,Cumbria,CA14 3PD,Tel: 01900602320,No ratings yet Rate it yourself - /Services/careproviders/LeaveReview/DefaultView.aspx?id=1-1985447227,0,0,,
Cera - Cumbria,1-2576930435,SCL,3 Solway Road,Clay Flatts Industrial Estate,,Workington,,CA14 3YA,Tel: 01228642327,No ratings yet Rate it yourself - /Services/careproviders/LeaveReview/DefaultView.aspx?id=1-2576930435,0,0,,
Always Here Limited,1-4017239800,SCL,Unit 4-5,"Peart Road, Derwent Howe Industrial Estate",,Workington,Cumbria,CA14 3YT,Tel: 0190062577,No ratings yet Rate it yourself - /Services/careproviders/LeaveReview/DefaultView.aspx?id=1-4017239800,0,0,,
Bellcare Domiciliary Care Services Ltd,1-9195057908,SCL,"Offices 8 & 10 Tarn Howe,","Lakes Road, Derwent Howe Industrial Estate",,Workington,,CA14 3YP,Tel: 01900872030,No ratings yet Rate it yourself - /Services/careproviders/LeaveReview/DefaultView.aspx?id=1-9195057908,0,0,,
Walsingham Support - Supported Living West Cumbria,1-5154422910,SCL,"2nd Floor Offices, Suites 11 and 12, Tarn Howe","Lakes Road, Derwent Howe Industrial Estate",,Workington,,CA14 3YP,Tel: 01900606142,No ratings yet Rate it yourself - /Services/careproviders/LeaveReview/DefaultView.aspx?id=1-5154422910,0,0,,
Eagles Wing Healthcare Solutions Ltd,1-14259121959,SCL,St Bees Management Centre,The Whitelaw Building,,St. Bees,,CA27 0DU,Tel: 07426055744,No ratings yet Rate it yourself - /Services/careproviders/LeaveReview/DefaultView.aspx?id=1-14259121959,0,0,,
Newlands,1-125861703,SCL,Newlands Park,,,Workington,Cumbria,CA14 3NE,Tel: 01900872257,No ratings yet Rate it yourself - /Services/careproviders/LeaveReview/DefaultView.aspx?id=1-125861703,0,0,,
Amathea,1-312173875,SCL,Newlands Lane,,,Workington,Cumbria,CA14 3JG,Tel: 0190063259,No ratings yet Rate it yourself - /Services/careproviders/LeaveReview/DefaultView.aspx?id=1-312173875,0,0,,
Richmond Park,1-15199058583,SCL,High Street,,,Workington,Cumbria,CA14 4ES,Tel: 01900706103,No ratings yet Rate it yourself - /Services/careproviders/LeaveReview/DefaultView.aspx?id=1-15199058583,0,0,,
Stanbeck Residential Care Home,1-118932472,SCL,8 Stainburn Road,,,Workington,Cumbria,CA14 4EA,Tel: 01900603611,No ratings yet Rate it yourself - /Services/careproviders/LeaveReview/DefaultView.aspx?id=1-118932472,0,0,,
West House Domiciliary Service,1-133264006,SCL,West House,26 Stanley Street,,Workington,Cumbria,CA14 2JD,Tel: 0190067777,No ratings yet Rate it yourself - /Services/careproviders/LeaveReview/DefaultView.aspx?id=1-133264006,0,0,,
Shared Lives Cumberland,1-16996613297,SCL,Allerdale House,New Bridge Road,,Workington,,CA14 3YJ,,No ratings yet Rate it yourself - /Services/careproviders/LeaveReview/DefaultView.aspx?id=1-16996613297,0,0,,
Walsingham Support - 19 Beech Avenue,1-124119961,SCL,Walsingham,Smithfield,,Egremont,Cumbria,CA22 2QA,Tel: 01946824885,No ratings yet Rate it yourself - /Services/careproviders/LeaveReview/DefaultView.aspx?id=1-124119961,0,0,,
Briarfield,1-133330170,SCL,42 Stainburn Road,,,Workington,Cumbria,CA14 1SN,Tel: 0190066733,No ratings yet Rate it yourself - /Services/careproviders/LeaveReview/DefaultView.aspx?id=1-133330170,0,0,,
Stilecroft Residential Home,1-125582624,SCL,51 Stainburn Road,Stainburn,,Workington,Cumbria,CA14 1SS,Tel: 01900 603776,1 rating Rate it yourself - /Services/careproviders/LeaveReview/DefaultView.aspx?id=1-125582624,,,,
Living For Life Cumbria Ltd,1-359950740,SCL,Northside Community Centre,"Trinity Drive, Northside",,Workington,,CA14 1AX,,1 rating Rate it yourself - /Services/careproviders/LeaveReview/DefaultView.aspx?id=1-359950740,,,,
Clarendon Grange,1-128559280,SCL,Main Road,Great Clifton,,Workington,Cumbria,CA14 1TR,Tel: 01900605316,No ratings yet Rate it yourself - /Services/careproviders/LeaveReview/DefaultView.aspx?id=1-128559280,0,0,,
Home Farm,1-7682196872,SCL,Camerton,,,Workington,Cumbria,CA14 1LS,Tel: 01900604315,No ratings yet Rate it yourself - /Services/careproviders/LeaveReview/DefaultView.aspx?id=1-7682196872,0,0,,
Jemcare,1-126410350,SCL,Main Road,Flimby,,Maryport,,CA15 8RP,Tel: 01900602200,1 rating Rate it yourself - /Services/careproviders/LeaveReview/DefaultView.aspx?id=1-126410350,,,,
Allanby House,1-129164995,SCL,Wedgewood Drive,Flimby,,Maryport,Cumbria,CA15 8QX,Tel: 01900819039,No ratings yet Rate it yourself - /Services/careproviders/LeaveReview/DefaultView.aspx?id=1-129164995,0,0,,
Midtown Farm,1-923388486,SCL,Seaton Road,Broughton Moor,,Maryport,Cumbria,CA15 8ST,Tel: 0190067777,No ratings yet Rate it yourself - /Services/careproviders/LeaveReview/DefaultView.aspx?id=1-923388486,0,0,,
Gatesgarth,1-129164700,SCL,The Green,Little Broughton,,Cockermouth,Cumbria,CA13 0YG,Tel: 01900828487,No ratings yet Rate it yourself - /Services/careproviders/LeaveReview/DefaultView.aspx?id=1-129164700,0,0,,
G Care,1-7779933565,SCL,Unit 19i,Solway Trading Estate,,Maryport,,CA15 8NF,Tel: 07495351053,No ratings yet Rate it yourself - /Services/careproviders/LeaveReview/DefaultView.aspx?id=1-7779933565,0,0,,
Dalton Court Care Home,1-126476560,SCL,Europe Way,,,Cockermouth,Cumbria,CA13 0RJ,Tel: 01900898640,No ratings yet Rate it yourself - /Services/careproviders/LeaveReview/DefaultView.aspx?id=1-126476560,0,0,,
Ava House,1-10935516401,SCL,16 Loweswater Road,,,Maryport,Cumbria,CA15 8JR,Tel: 0190067501,No ratings yet Rate it yourself - /Services/careproviders/LeaveReview/DefaultView.aspx?id=1-10935516401,0,0,,
Holmewood Residential Care Home,1-123902961,SCL,Lamplugh Road,,,Cockermouth,Cumbria,CA13 0DP,Tel: 01900828664,No ratings yet Rate it yourself - /Services/careproviders/LeaveReview/DefaultView.aspx?id=1-123902961,0,0,,
Riverside Court Care Home,1-128588753,SCL,31 Irish Street,Salmoor Way,,Maryport,Cumbria,CA15 8AZ,Tel: 01900815323,No ratings yet Rate it yourself - /Services/careproviders/LeaveReview/DefaultView.aspx?id=1-128588753,0,0,,
Jah Jireh Maryport,1-156503696,SCL,74 Main Street,Ellenborough,,Maryport,Cumbria,CA15 7DX,Tel: 01900813640,1 rating Rate it yourself - /Services/careproviders/LeaveReview/DefaultView.aspx?id=1-156503696,,,,
The Dales,1-125911635,SCL,Main Street,Ellenborough,,Maryport,Cumbria,CA15 7DX,Tel: 01900817977,No ratings yet Rate it yourself - /Services/careproviders/LeaveReview/DefaultView.aspx?id=1-125911635,0,0,,
Kirklands,1-5801706504,SCL,Sullart Street,,,Cockermouth,Cumbria,CA13 0EE,,No ratings yet Rate it yourself - /Services/careproviders/LeaveReview/DefaultView.aspx?id=1-5801706504,0,0,,
Granville Court Care Home,1-13122282450,SCL,19 Station Street,,,Maryport,Cumbria,CA15 6LT,Tel: 01900818513,No ratings yet Rate it yourself - /Services/careproviders/LeaveReview/DefaultView.aspx?id=1-13122282450,0,0,,
Hames Hall Residential Care Home,1-136488898,SCL,Gote Road,,,Cockermouth,Cumbria,CA13 0NN,Tel: 01900827601,No ratings yet Rate it yourself - /Services/careproviders/LeaveReview/DefaultView.aspx?id=1-136488898,0,0,,
Solway House,1-109788014,SCL,Solway Terrace,,,Maryport,Cumbria,CA15 6EL,Tel: 01900817651,No ratings yet Rate it yourself - /Services/careproviders/LeaveReview/DefaultView.aspx?id=1-109788014,0,0,,
Parkside,1-15199226928,SCL,Netherhall Road,,,Maryport,Cumbria,CA15 6NT,Tel: 01900706973,No ratings yet Rate it yourself - /Services/careproviders/LeaveReview/DefaultView.aspx?id=1-15199226928,0,0,,
Bradbury House,1-137749798,SCL,Wasdale Road,Gosforth,,Seascale,Cumbria,CA20 1AU,Tel: 01946725061,No ratings yet Rate it yourself - /Services/careproviders/LeaveReview/DefaultView.aspx?id=1-137749798,0,0,,
Seaview House,1-129266709,SCL,Crosscanonby,,,Maryport,Cumbria,CA15 6SJ,Tel: 01900819041,1 rating Rate it yourself - /Services/careproviders/LeaveReview/DefaultView.aspx?id=1-129266709,,,,
Park Lodge,1-15199133356,SCL,Outgang Road,Aspatria,,Wigton,Cumbria,CA7 3HP,Tel: 01228227866,No ratings yet Rate it yourself - /Services/careproviders/LeaveReview/DefaultView.aspx?id=1-15199133356,0,0,,
The Millfield,1-113073175,SCL,28 Penrith Road,,,Keswick,Cumbria,CA12 4HB,Tel: 01768772099,No ratings yet Rate it yourself - /Services/careproviders/LeaveReview/DefaultView.aspx?id=1-113073175,0,0,,
Calvert Reconnections,1-11174352865,SCL,Old Windebrowe,Brundholme Road,,Keswick,,CA12 4NT,Tel: 0176885381,No ratings yet Rate it yourself - /Services/careproviders/LeaveReview/DefaultView.aspx?id=1-11174352865,0,0,,
Nether Place Nursing Home,1-117053231,SCL,Chestnut Hill,,,Keswick,Cumbria,CA12 4LS,Tel: 01768773267,No ratings yet Rate it yourself - /Services/careproviders/LeaveReview/DefaultView.aspx?id=1-117053231,0,0,,
Silloth Nursing and Residential Care Home,1-108803271,SCL,Convalescent Home,Silloth,,Wigton,Cumbria,CA7 4JH,,1 rating Rate it yourself - /Services/careproviders/LeaveReview/DefaultView.aspx?id=1-108803271,,,,
The Good Companions (Cumbria) Limited,1-123015125,SCL,Criffel Street,Silloth,,Wigton,Cumbria,CA7 4BT,Tel: 01697331553,1 rating Rate it yourself - /Services/careproviders/LeaveReview/DefaultView.aspx?id=1-123015125,,,,
Springfield House,1-131961391,SCL,Moor Row,,,Wigton,Cumbria,CA7 0DL,Tel: 01697345530,No ratings yet Rate it yourself - /Services/careproviders/LeaveReview/DefaultView.aspx?id=1-131961391,0,0,,
Little Acre Care Home,1-9013150964,SCL,82 Skinburness Road,Silloth,,Wigton,Cumbria,CA7 4QH,Tel: 01697332105,No ratings yet Rate it yourself - /Services/careproviders/LeaveReview/DefaultView.aspx?id=1-9013150964,0,0,,
Ralle Health Limited,1-2043031407,SCL,Bridge View,Waverbridge,,Wigton,Cumbria,CA7 0DT,Tel: 07920442198,No ratings yet Rate it yourself - /Services/careproviders/LeaveReview/DefaultView.aspx?id=1-2043031407,0,0,,
Chichester Hall Care Home,1-123902977,SCL,Dick Trod Lane,Skinburness,,Wigton,Cumbria,CA7 4QZ,Tel: 01697332478,No ratings yet Rate it yourself - /Services/careproviders/LeaveReview/DefaultView.aspx?id=1-123902977,0,0,,
Chrysalis,1-840308337,SCL,Leaside,Longthwaite Road,,Wigton,Cumbria,CA7 9JR,Tel: 01697344751,No ratings yet Rate it yourself - /Services/careproviders/LeaveReview/DefaultView.aspx?id=1-840308337,0,0,,
Inglewood,1-15199058477,SCL,Lowmoor Road,,,Wigton,Cumbria,CA7 9QL,Tel: 01228226065,No ratings yet Rate it yourself - /Services/careproviders/LeaveReview/DefaultView.aspx?id=1-15199058477,0,0,,
Coniston Care Scheme Limited,1-113913510,SCL,Coniston Institute,15 Yewdale Road,,Coniston,Cumbria,LA21 8DU,Tel: 01539441868,No ratings yet Rate it yourself - /Services/careproviders/LeaveReview/DefaultView.aspx?id=1-113913510,0,0,,
Rydal Mount,1-129266341,SCL,Station Hill,,,Wigton,Cumbria,CA7 9BJ,Tel: 01697349266,No ratings yet Rate it yourself - /Services/careproviders/LeaveReview/DefaultView.aspx?id=1-129266341,0,0,,
Redmayne House,1-129266281,SCL,Redmayne Close,off Station Road,,Wigton,Cumbria,CA7 9AF,Tel: 01697349313,No ratings yet Rate it yourself - /Services/careproviders/LeaveReview/DefaultView.aspx?id=1-129266281,0,0,,
Kirksanton Care Centre,1-129132380,SCL,Kirksanton,,,Millom,Cumbria,LA18 4NN,Tel: 01229772868,No ratings yet Rate it yourself - /Services/careproviders/LeaveReview/DefaultView.aspx?id=1-129132380,0,0,,
St George's Residential Care Home,1-6916902771,SCL,St. Georges Road,,,Millom,,LA18 4JE,Tel: 01229773959,No ratings yet Rate it yourself - /Services/careproviders/LeaveReview/DefaultView.aspx?id=1-6916902771,0,0,,
Lapstone House,1-15199134508,SCL,Lapstone Road,,,Millom,Cumbria,LA18 4BY,Tel: 01229404060,No ratings yet Rate it yourself - /Services/careproviders/LeaveReview/DefaultView.aspx?id=1-15199134508,0,0,,
Combe Domiciliary Care Limited,1-6187575686,SCL,26 Wellington Street,,,Millom,,LA18 4DE,Tel: 01229777101,2 ratings Rate it yourself - /Services/careproviders/LeaveReview/DefaultView.aspx?id=1-6187575686,,,,
Lakeland Care & Support Services Limited,1-993429928,SCL,The Offices at Bortree Stile,Osmotherly,,Ulverston,Cumbria,LA12 7PB,Tel: 01229585693,No ratings yet Rate it yourself - /Services/careproviders/LeaveReview/DefaultView.aspx?id=1-993429928,0,0,,
Hollow Oak Nursing Home Limited,1-119945305,SCL,Haverthwaite,,,Ulverston,Cumbria,LA12 8AD,Tel: 01539531246,1 rating Rate it yourself - /Services/careproviders/LeaveReview/DefaultView.aspx?id=1-119945305,,,,
Morton Cottage Residential Home,1-121874200,SCL,Morton Cottage,210-212 Wigton Road,,Carlisle,Cumbria,CA2 6JZ,Tel: 01228515757,No ratings yet Rate it yourself - /Services/careproviders/LeaveReview/DefaultView.aspx?id=1-121874200,0,0,,
Burnrigg Court,1-15199081768,SCL,Burnrigg,,,Carlisle,,CA2 6JU,Tel: 01228221322,No ratings yet Rate it yourself - /Services/careproviders/LeaveReview/DefaultView.aspx?id=1-15199081768,0,0,,
Eden Manor Care Home,1-13942756555,SCL,Langrigg Road,Morton,,Carlisle,Cumbria,CA2 6DT,Tel: 01423531186,No ratings yet Rate it yourself - /Services/careproviders/LeaveReview/DefaultView.aspx?id=1-13942756555,0,0,,
Lanercost House - Carlyle Suite,1-125856299,SCL,Berkley Grange,Newtown Road,,Carlisle,Cumbria,CA2 7PW,Tel: 01228552550,No ratings yet Rate it yourself - /Services/careproviders/LeaveReview/DefaultView.aspx?id=1-125856299,0,0,,
Lanercost House,1-125856282,SCL,Berkley Grange,Newtown Road,,Carlisle,Cumbria,CA2 7PW,Tel: 01228595138,No ratings yet Rate it yourself - /Services/careproviders/LeaveReview/DefaultView.aspx?id=1-125856282,0,0,,
Creative Support - Heysham Gardens,1-2791673204,SCL,Low Meadows,,,Carlisle,Cumbria,CA2 7RN,Tel: 01228818095,No ratings yet Rate it yourself - /Services/careproviders/LeaveReview/DefaultView.aspx?id=1-2791673204,0,0,,
Applegarth Nursing Home,1-3733288172,SCL,243 Newtown Road,,,Carlisle,Cumbria,CA2 7LT,Tel: 01228810103,No ratings yet Rate it yourself - /Services/careproviders/LeaveReview/DefaultView.aspx?id=1-3733288172,0,0,,
Kingston Court Care Home,1-6922730100,SCL,Newtown Road,,,Carlisle,Cumbria,CA2 7JH,Tel: 01228528542,1 rating Rate it yourself - /Services/careproviders/LeaveReview/DefaultView.aspx?id=1-6922730100,,,,
