Organisation Name,NACS Code,Organisation Type,Address1,Address2,Address3,Address4,Address5,PostCode,Telephone Number,NHS.UK users rating,Value  (NHS.UK users rating),Banding Classification  (NHS.UK users rating),Car parking (Is there car parking at this organisation?),Disabled access (Disabled access)
Bluebird Care (Wolverhampton),1-11341974910,SCL,Unit 5E& 5F,"Merryhills Enterprise Park, Park Lane",,Wolverhampton,,WV10 9TJ,Tel: 07585161313,1 rating Rate it yourself - /Services/careproviders/LeaveReview/DefaultView.aspx?id=1-11341974910,,,,
Verona Court,1-12898053955,SCL,Longford Road,,,Wolverhampton,,WV10 0UB,Tel: 01902863238,No ratings yet Rate it yourself - /Services/careproviders/LeaveReview/DefaultView.aspx?id=1-12898053955,0,0,,
Wolverhampton,1-15112169053,SCL,14 Tudor Road,,,Wolverhampton,,WV10 0LT,Tel: 07946298202,No ratings yet Rate it yourself - /Services/careproviders/LeaveReview/DefaultView.aspx?id=1-15112169053,0,0,,
CARE-A-LOT LIMITED,1-12083470911,SCL,43 Guy Avenue,,,Wolverhampton,,WV10 9SB,,No ratings yet Rate it yourself - /Services/careproviders/LeaveReview/DefaultView.aspx?id=1-12083470911,0,0,,
Newcross Care Home,1-419650270,SCL,378 Prestwood Road,,,Wolverhampton,West Midlands,WV11 1RH,Tel: 01902866890,No ratings yet Rate it yourself - /Services/careproviders/LeaveReview/DefaultView.aspx?id=1-419650270,0,0,,
Isabella Homes Limited,1-6973317111,SCL,60 Cadman Crescent,,,Wolverhampton,,WV10 0SJ,Tel: 01902687286,No ratings yet Rate it yourself - /Services/careproviders/LeaveReview/DefaultView.aspx?id=1-6973317111,0,0,,
Varsity Healthcare Ltd,1-16610917399,SCL,48 Inkerman Street,,,Wolverhampton,,WV10 0EP,Tel: 07985417480,No ratings yet Rate it yourself - /Services/careproviders/LeaveReview/DefaultView.aspx?id=1-16610917399,0,0,,
Showell Court,1-122285673,SCL,Othello Road,Low Hill,,Wolverhampton,West Midlands,WV10 9NN,Tel: 03001112511,No ratings yet Rate it yourself - /Services/careproviders/LeaveReview/DefaultView.aspx?id=1-122285673,0,0,,
Ezekiel 37 Care Ltd,1-17195953857,SCL,93 Humphries Road,,,Wolverhampton,,WV10 9NA,,No ratings yet Rate it yourself - /Services/careproviders/LeaveReview/DefaultView.aspx?id=1-17195953857,0,0,,
Victoria Court,1-17920435005,SCL,Memory Lane,Wednesfield,,Wolverhampton,West Midlands,WV11 1SD,,No ratings yet Rate it yourself - /Services/careproviders/LeaveReview/DefaultView.aspx?id=1-17920435005,0,0,,
Primrose Hill Nursing Home,1-6322922247,SCL,99 A Old Fallings Lane,,,Wolverhampton,,WV10 8BJ,Tel: 01902864627,1 rating Rate it yourself - /Services/careproviders/LeaveReview/DefaultView.aspx?id=1-6322922247,,,,
Welbeck House,1-138480271,SCL,42 Welbeck Avenue,,,Wolverhampton,West Midlands,WV10 9LS,Tel: 01902681909,No ratings yet Rate it yourself - /Services/careproviders/LeaveReview/DefaultView.aspx?id=1-138480271,0,0,,
New Light Healthcare Limited,1-17050149236,SCL,28 Hawksford Crescent,,,Wolverhampton,,WV10 9SQ,Tel: 07704511296,No ratings yet Rate it yourself - /Services/careproviders/LeaveReview/DefaultView.aspx?id=1-17050149236,0,0,,
85 Hawksford Crescent,1-14715827599,SCL,85 Hawksford Crescent,,,Wolverhampton,,WV10 9SP,Tel: 07533159282,No ratings yet Rate it yourself - /Services/careproviders/LeaveReview/DefaultView.aspx?id=1-14715827599,0,0,,
Enduring Hearts Limited,1-18722845359,SCL,85 Hawksford Crescent,,,Wolverhampton,,WV10 9SP,,No ratings yet Rate it yourself - /Services/careproviders/LeaveReview/DefaultView.aspx?id=1-18722845359,0,0,,
Secure Healthcare Limited,1-2920287949,SCL,"Suite One, Grand Station",Sun Street,,Wolverhampton,West Midlands,WV10 0BF,Tel: 01902302017,No ratings yet Rate it yourself - /Services/careproviders/LeaveReview/DefaultView.aspx?id=1-2920287949,0,0,,
Bentley Court Care Home,1-10881303514,SCL,29 Nordley Road,,,Wolverhampton,West Midlands,WV11 1PX,Tel: 01902722100,No ratings yet Rate it yourself - /Services/careproviders/LeaveReview/DefaultView.aspx?id=1-10881303514,0,0,,
ABC Care and Support Services Limited,1-16436271853,SCL,Westbury House,Westbury Street,,Wolverhampton,West Midlands,WV1 1JD,Tel: 01902393940,No ratings yet Rate it yourself - /Services/careproviders/LeaveReview/DefaultView.aspx?id=1-16436271853,0,0,,
ABC Support Limited,1-15763848918,SCL,Westbury House,Westbury Street,,Wolverhampton,West Midlands,WV1 1JD,Tel: 01902393940,No ratings yet Rate it yourself - /Services/careproviders/LeaveReview/DefaultView.aspx?id=1-15763848918,0,0,,
Sinai Care Solutions Limited,1-2950714170,SCL,"Office Suite 2, 178 Stafford Street",,,Wolverhampton,,WV1 1NA,,1 rating Rate it yourself - /Services/careproviders/LeaveReview/DefaultView.aspx?id=1-2950714170,,,,
Abimatic Care Ltd,1-15356238395,SCL,178 Goodwood Drive,,,Wolverhampton,,WV10 6GP,Tel: 07954853554,No ratings yet Rate it yourself - /Services/careproviders/LeaveReview/DefaultView.aspx?id=1-15356238395,0,0,,
Meadowcroft Residential Care Home,1-113064953,SCL,197-199 Bushbury Lane,,,Wolverhampton,West Midlands,WV10 9TY,Tel: 01902307170,No ratings yet Rate it yourself - /Services/careproviders/LeaveReview/DefaultView.aspx?id=1-113064953,0,0,,
Absolute Care Solutions Limited,1-4410548150,SCL,"Trilogy Suite, Church Street",Wednesfield,,Wolverhampton,,WV11 1SR,Tel: 07728544550,No ratings yet Rate it yourself - /Services/careproviders/LeaveReview/DefaultView.aspx?id=1-4410548150,0,0,,
Qualita Healthcare and Recruitment Ltd,1-18687996064,SCL,22 Fordhouse Road,,,Wolverhampton,,WV10 9EA,Tel: 07727304799,No ratings yet Rate it yourself - /Services/careproviders/LeaveReview/DefaultView.aspx?id=1-18687996064,0,0,,
Majestic Healthcare LTD,1-14234228045,SCL,"Unit 20, The Pressworks 36-38",Berry Street,,Wolverhampton,,WV1 1HA,,No ratings yet Rate it yourself - /Services/careproviders/LeaveReview/DefaultView.aspx?id=1-14234228045,0,0,,
Santos Care Limited,1-12038361290,SCL,36 -38  Berry Street,,,Wolverhampton,,WV1 1HA,Tel: 01902427605,2 ratings Rate it yourself - /Services/careproviders/LeaveReview/DefaultView.aspx?id=1-12038361290,,,,
Cyprus Care Ltd,1-18531153973,SCL,36 -38 Berry Street,,,Wolverhampton,,WV1 1HA,,No ratings yet Rate it yourself - /Services/careproviders/LeaveReview/DefaultView.aspx?id=1-18531153973,0,0,,
Sublime Care Solution,1-5987198251,SCL,Office 1-3 Pressworks,36-38 Berry Street,,Wolverhampton,,WV1 1HA,Tel: 01902239014,No ratings yet Rate it yourself - /Services/careproviders/LeaveReview/DefaultView.aspx?id=1-5987198251,0,0,,
3 Angels Complex Care Services,1-12725754333,SCL,"Unit 18, The Pressworks",36 - 38 Berry Street,,Wolverhampton,,WV1 1HA,Tel: 07940778772,No ratings yet Rate it yourself - /Services/careproviders/LeaveReview/DefaultView.aspx?id=1-12725754333,0,0,,
Advance Healthcare (Pine Court),1-8457527466,SCL,Cottage Close,Wednesfield,,Wolverhampton,,WV11 1NG,Tel: 01902723220,No ratings yet Rate it yourself - /Services/careproviders/LeaveReview/DefaultView.aspx?id=1-8457527466,0,0,,
Serenity - Birmingham,1-5838473837,SCL,"Serenity Homecare Limited, Corporate Centre, Suite 2",149 Willenhall Road,,Wolverhampton,,WV1 2HR,Tel: 01212854122,No ratings yet Rate it yourself - /Services/careproviders/LeaveReview/DefaultView.aspx?id=1-5838473837,0,0,,
Eden Support Ltd,1-1456310911,SCL,Newhampton Arts Centre,Dunkley Street,,Wolverhampton,West Midlands,WV1 4AN,Tel: 01902771778,No ratings yet Rate it yourself - /Services/careproviders/LeaveReview/DefaultView.aspx?id=1-1456310911,0,0,,
Highcroft Hall Residential Care Home,1-453123432,SCL,Old Fallings Lane,,,Wolverhampton,,WV10 8BU,Tel: 01902866802,No ratings yet Rate it yourself - /Services/careproviders/LeaveReview/DefaultView.aspx?id=1-453123432,0,0,,
ANIF CARE,1-15977015036,SCL,Planetary Business Centre,Planetary Road,,Willenhall,West Midlands,WV13 3SW,Tel: 07538825279,No ratings yet Rate it yourself - /Services/careproviders/LeaveReview/DefaultView.aspx?id=1-15977015036,0,0,,
Charter Care  -  Caring for You,1-17858721401,SCL,"Planetary Business Centre, Planetary House, Business Park",Planetary Road,,Willenhall,,WV13 3SW,Tel: 01902602877,No ratings yet Rate it yourself - /Services/careproviders/LeaveReview/DefaultView.aspx?id=1-17858721401,0,0,,
Healthcare 1st Choice Wolverhampton,1-14246478435,SCL,Planetary House,"Business Park, Planetary Road",,Willenhall,,WV13 3SW,,No ratings yet Rate it yourself - /Services/careproviders/LeaveReview/DefaultView.aspx?id=1-14246478435,0,0,,
Duke Street Bungalows,1-118364206,SCL,21-25 Duke Street,Wednesfield,,Wolverhampton,West Midlands,WV11 1TH,Tel: 01902553356,No ratings yet Rate it yourself - /Services/careproviders/LeaveReview/DefaultView.aspx?id=1-118364206,0,0,,
Nationwide Care Services Ltd (Wolverhampton),1-11809448494,SCL,The Old Rectory,57 Waterloo Road,,Wolverhampton,,WV1 4QH,Tel: 01902587121,No ratings yet Rate it yourself - /Services/careproviders/LeaveReview/DefaultView.aspx?id=1-11809448494,0,0,,
GSS Healthcare Ltd,1-13931190885,SCL,Office 13b,"York Chambers, 33 York Street",,Wolverhampton,,WV1 3RN,Tel: 07966270229,No ratings yet Rate it yourself - /Services/careproviders/LeaveReview/DefaultView.aspx?id=1-13931190885,0,0,,
Elakay Home Care Ltd,1-16311552807,SCL,York Chambers Business Centre,33 York Street,,Wolverhampton,,WV1 3RN,Tel: 07707430323,No ratings yet Rate it yourself - /Services/careproviders/LeaveReview/DefaultView.aspx?id=1-16311552807,0,0,,
Clarriots Care (Wolverhampton),1-2041386142,SCL,The Boot Factory,Cleveland Road,,Wolverhampton,West Midlands,WV2 1BP,Tel: 01902 456725,No ratings yet Rate it yourself - /Services/careproviders/LeaveReview/DefaultView.aspx?id=1-2041386142,0,0,,
Prospect Tree Health Care (Midlands) Ltd,1-2142610059,SCL,"First Floor Office Suite, The Boot Factory",Cleveland Road,,Wolverhampton,West Midlands,WV2 1BP,,1 rating Rate it yourself - /Services/careproviders/LeaveReview/DefaultView.aspx?id=1-2142610059,,,,
Prayngel Healthcare Limited,1-2110699995,SCL,Derwent House 42-46,Waterloo Road,,Wolverhampton,,WV1 4XB,Tel: 03303909535,1 rating Rate it yourself - /Services/careproviders/LeaveReview/DefaultView.aspx?id=1-2110699995,,,,
Carelight Healthcare Limited,1-16863469148,SCL,42-46 Waterloo Road,,,Wolverhampton,,WV1 4XB,,No ratings yet Rate it yourself - /Services/careproviders/LeaveReview/DefaultView.aspx?id=1-16863469148,0,0,,
Brown Glass Ltd trading Brown Glass Health Care Services,1-11331685094,SCL,2 Mayflower Gardens,,,Wolverhampton,,WV10 6EF,,No ratings yet Rate it yourself - /Services/careproviders/LeaveReview/DefaultView.aspx?id=1-11331685094,0,0,,
Pear Tree House,1-18686640914,SCL,19 Park Avenue,,,Wolverhampton,,WV1 4AH,Tel: 07311357919,No ratings yet Rate it yourself - /Services/careproviders/LeaveReview/DefaultView.aspx?id=1-18686640914,0,0,,
Alie Limited,1-10710205051,SCL,36 Waterloo Road,,,Wolverhampton,,WV1 4BL,Tel: 07533058309,No ratings yet Rate it yourself - /Services/careproviders/LeaveReview/DefaultView.aspx?id=1-10710205051,0,0,,
Pathways of Hope Wolverhampton,1-16414250065,SCL,"Suite 1, Infinity House",14 Waterloo Road,,Wolverhampton,,WV1 4BL,Tel: 01902229624,No ratings yet Rate it yourself - /Services/careproviders/LeaveReview/DefaultView.aspx?id=1-16414250065,0,0,,
Pear Tree Lane,1-3562085022,SCL,198A Cannock Road,Wednesfield,,Wolverhampton,West Midlands,WV10 8PT,Tel: 01902305862,No ratings yet Rate it yourself - /Services/careproviders/LeaveReview/DefaultView.aspx?id=1-3562085022,0,0,,
Breeze Support Solutions,1-16389238020,SCL,Regent House,Bath Avenue,,Wolverhampton,West Midlands,WV1 4EG,Tel: 07983883566,No ratings yet Rate it yourself - /Services/careproviders/LeaveReview/DefaultView.aspx?id=1-16389238020,0,0,,
Geocare Services Wolverhampton,1-9440117254,SCL,Regent House,Bath Avenue,,Wolverhampton,West Midlands,WV1 4EG,Tel: 01902810119,No ratings yet Rate it yourself - /Services/careproviders/LeaveReview/DefaultView.aspx?id=1-9440117254,0,0,,
Sunshine Recruitments Ltd,1-15980891601,SCL,"Regent House, Bath Avenue",,,Wolverhampton,,WV1 4EG,Tel: 07412223085,No ratings yet Rate it yourself - /Services/careproviders/LeaveReview/DefaultView.aspx?id=1-15980891601,0,0,,
Ignite Nursing,1-14582792368,SCL,Regent House,Bath Avenue,,Wolverhampton,West Midlands,WV1 4EG,,No ratings yet Rate it yourself - /Services/careproviders/LeaveReview/DefaultView.aspx?id=1-14582792368,0,0,,
C & S Care Services Limited,1-112784475,SCL,Regent House,Bath Avenue,,Wolverhampton,West Midlands,WV1 4EG,,3 ratings Rate it yourself - /Services/careproviders/LeaveReview/DefaultView.aspx?id=1-112784475,,,,
Medirite Healthcare,1-2159545366,SCL,Regent House,Bath Avenue,,Wolverhampton,West Midlands,WV1 4EG,Tel: 01902823438,No ratings yet Rate it yourself - /Services/careproviders/LeaveReview/DefaultView.aspx?id=1-2159545366,0,0,,
Edith healthcare Wolverhampton,1-9006652069,SCL,S2 Regent House,Bath Avenue,,Wolverhampton,,WV1 4EG,,No ratings yet Rate it yourself - /Services/careproviders/LeaveReview/DefaultView.aspx?id=1-9006652069,0,0,,
101 Healthcare Ltd,1-12941557120,SCL,"Infinity House, 14 Waterloo Road",,,Wolverhampton,,WV1 4BS,Tel: 01902283101,No ratings yet Rate it yourself - /Services/careproviders/LeaveReview/DefaultView.aspx?id=1-12941557120,0,0,,
Quality Care Services 4U Ltd,1-17769315957,SCL,14 Waterloo Road,,,Wolverhampton,,WV1 4BS,Tel: 03445070132,No ratings yet Rate it yourself - /Services/careproviders/LeaveReview/DefaultView.aspx?id=1-17769315957,0,0,,
Care Angels Homecare Ltd,1-7694244777,SCL,9 Waterloo Road,,,Wolverhampton,West Midlands,WV1 4DJ,Tel: 01902275780,No ratings yet Rate it yourself - /Services/careproviders/LeaveReview/DefaultView.aspx?id=1-7694244777,0,0,,
Martworld Care Services Limited,1-2937441998,SCL,"Waterloo Court, Offices 7 & 9",31 Waterloo Road,,Wolverhampton,,WV1 4DJ,Tel: 01902256397,1 rating Rate it yourself - /Services/careproviders/LeaveReview/DefaultView.aspx?id=1-2937441998,,,,
Zion Care Services Limited,1-10644063424,SCL,9 Waterloo Road,,,Wolverhampton,West Midlands,WV1 4DJ,Tel: 07368934880,1 rating Rate it yourself - /Services/careproviders/LeaveReview/DefaultView.aspx?id=1-10644063424,,,,
TS Healthcare Limited,1-7566958465,SCL,11 Waterloo Road,,,Wolverhampton,West Midlands,WV1 4DJ,,No ratings yet Rate it yourself - /Services/careproviders/LeaveReview/DefaultView.aspx?id=1-7566958465,0,0,,
Gillz Care Ltd,1-15068901059,SCL,"Suite 1-3, 31 Waterloo Court",13 Waterloo Road,,Wolverhampton,,WV1 4DJ,Tel: 07481908194,No ratings yet Rate it yourself - /Services/careproviders/LeaveReview/DefaultView.aspx?id=1-15068901059,0,0,,
Complesso Healthcare Solutions,1-2440773264,SCL,Suite 8 The Boot Factory,22 Cleveland Road,,Wolverhampton,,WV2 1BH,Tel: 07496363510,No ratings yet Rate it yourself - /Services/careproviders/LeaveReview/DefaultView.aspx?id=1-2440773264,0,0,,
Creative Support - Wolverhampton Services,1-133366769,SCL,The Boot Factory,22 Cleveland Road,,Wolverhampton,West Midlands,WV2 1BH,Tel: 01902458797,No ratings yet Rate it yourself - /Services/careproviders/LeaveReview/DefaultView.aspx?id=1-133366769,0,0,,
Smithridge main office,1-13981573792,SCL,22 Darlington Street,,,Wolverhampton,,WV1 4HW,,No ratings yet Rate it yourself - /Services/careproviders/LeaveReview/DefaultView.aspx?id=1-13981573792,0,0,,
Midas Care Solutions Ltd,1-3071594767,SCL,Trafalgar House,81-83 Darlington Street,,Wolverhampton,,WV1 4JD,Tel: 01902587062,1 rating Rate it yourself - /Services/careproviders/LeaveReview/DefaultView.aspx?id=1-3071594767,,,,
Promises of Care,1-2501499161,SCL,80 Darlington Street,,,Wolverhampton,West Midlands,WV1 4JD,Tel: 01902587099,No ratings yet Rate it yourself - /Services/careproviders/LeaveReview/DefaultView.aspx?id=1-2501499161,0,0,,
Goldcrest Healthcare Service (Midlands),1-10233651067,SCL,28 Cleveland Street,,,Wolverhampton,,WV1 3HT,Tel: 01902972055,No ratings yet Rate it yourself - /Services/careproviders/LeaveReview/DefaultView.aspx?id=1-10233651067,0,0,,
Stalwart Care Services,1-16479521559,SCL,56 Mattox Road,,,Wolverhampton,,WV11 3TQ,,No ratings yet Rate it yourself - /Services/careproviders/LeaveReview/DefaultView.aspx?id=1-16479521559,0,0,,
Harper House - Wolverhampton,1-126657424,SCL,1 Moathouse Lane West,Wednesfield,,Wolverhampton,West Midlands,WV11 3HB,Tel: 01902731732,No ratings yet Rate it yourself - /Services/careproviders/LeaveReview/DefaultView.aspx?id=1-126657424,0,0,,
Revelation 22 Care,1-2154152080,SCL,182-183 Newhampton Road East,,,Wolverhampton,West Midlands,WV1 4PQ,Tel: 07979371663,No ratings yet Rate it yourself - /Services/careproviders/LeaveReview/DefaultView.aspx?id=1-2154152080,0,0,,
Essentia Health Pro Office,1-14431717122,SCL,118-119,Salop Street,,Wolverhampton,,WV3 0RX,Tel: 07722526149,No ratings yet Rate it yourself - /Services/careproviders/LeaveReview/DefaultView.aspx?id=1-14431717122,0,0,,
Swan Care Solutions,1-9267859487,SCL,Suite 203 Denning House,1a George Street,,Wolverhampton,,WV2 4DP,Tel: 07925665692,2 ratings Rate it yourself - /Services/careproviders/LeaveReview/DefaultView.aspx?id=1-9267859487,,,,
Truth Recruitment Ltd,1-19059589481,SCL,1a,George Street,,Wolverhampton,,WV2 4DP,,No ratings yet Rate it yourself - /Services/careproviders/LeaveReview/DefaultView.aspx?id=1-19059589481,0,0,,
Blu-Sky Care Limited,1-446703229,SCL,Flat 1,"Hanover House, 11 George Street",,Wolverhampton,,WV2 4DG,Tel: 01902420571,No ratings yet Rate it yourself - /Services/careproviders/LeaveReview/DefaultView.aspx?id=1-446703229,0,0,,
Ave Maria Care (Wolverhampton),1-10090641405,SCL,Kings House,St. Johns Square,,Wolverhampton,,WV2 4DT,Tel: 03301075949,No ratings yet Rate it yourself - /Services/careproviders/LeaveReview/DefaultView.aspx?id=1-10090641405,0,0,,
Waterside House,1-117976852,SCL,41 Moathouse Lane West,,,Wolverhampton,West Midlands,WV11 3HA,Tel: 01902727766,No ratings yet Rate it yourself - /Services/careproviders/LeaveReview/DefaultView.aspx?id=1-117976852,0,0,,
Cergus Group Limited,1-13594347857,SCL,84 Salop Street,,,Wolverhampton,,WV3 0SR,Tel: 01902973456,No ratings yet Rate it yourself - /Services/careproviders/LeaveReview/DefaultView.aspx?id=1-13594347857,0,0,,
Lovage Homecare Ltd,1-12903720590,SCL,"Office 424, 4th Floor, 84 Salop Street",,,Wolverhampton,,WV3 0SR,Tel: 07411757500,No ratings yet Rate it yourself - /Services/careproviders/LeaveReview/DefaultView.aspx?id=1-12903720590,0,0,,
CeeTee Healthcare Services,1-14383210881,SCL,"Regus, 84 Salop Street",,,Wolverhampton,,WV3 0SR,Tel: 01902973481,No ratings yet Rate it yourself - /Services/careproviders/LeaveReview/DefaultView.aspx?id=1-14383210881,0,0,,
Head Office,1-13945958923,SCL,317 Regus 3rd Floor,84 Salop Street,,Wolverhampton,,WV3 0SR,Tel: 07932028658,No ratings yet Rate it yourself - /Services/careproviders/LeaveReview/DefaultView.aspx?id=1-13945958923,0,0,,
"Whiteshed Healthcare, Wolverhampton",1-14567008830,SCL,84 Salop Street,"3rd & 4th Floors,",,Wolverhampton,,WV3 0SR,Tel: 07445031390,No ratings yet Rate it yourself - /Services/careproviders/LeaveReview/DefaultView.aspx?id=1-14567008830,0,0,,
Woodford Homecare,1-1233887220,SCL,84 Salop Street,3rd Floor Office Suite 319,,Wolverhampton,,WV3 0SR,Tel: 07764664084,1 rating Rate it yourself - /Services/careproviders/LeaveReview/DefaultView.aspx?id=1-1233887220,,,,
Rance Healthcare Services Ltd,1-11775024685,SCL,84 Salop Street,3rd and 4th Floors,,Wolverhampton,,WV3 0SR,Tel: 01902973451,No ratings yet Rate it yourself - /Services/careproviders/LeaveReview/DefaultView.aspx?id=1-11775024685,0,0,,
Sylviancare Wolverhampton,1-14920409702,SCL,84 Salop Street,,,Wolverhampton,,WV3 0SR,Tel: 01902229544,No ratings yet Rate it yourself - /Services/careproviders/LeaveReview/DefaultView.aspx?id=1-14920409702,0,0,,
Acton Banks Homecare Limited,1-10153709583,SCL,84 Salop Street,,,Wolverhampton,,WV3 0SR,Tel: 01902711855,No ratings yet Rate it yourself - /Services/careproviders/LeaveReview/DefaultView.aspx?id=1-10153709583,0,0,,
ONECARE WORLD HEALTH LIMITED,1-14683734761,SCL,"3rd and 4th Floor, 84 Salop Street",Office 427,,Wolverhampton,,WV3 0SR,Tel: 07464462997,No ratings yet Rate it yourself - /Services/careproviders/LeaveReview/DefaultView.aspx?id=1-14683734761,0,0,,
Beyond Support Limited,1-4187252777,SCL,Regus 84 Salop Street,3rd & 4th floors,,Wolverhampton,,WV3 0SR,Tel: 01217924377,No ratings yet Rate it yourself - /Services/careproviders/LeaveReview/DefaultView.aspx?id=1-4187252777,0,0,,
Lonsdale Midlands DCA,1-131377984,SCL,1st Floor St. Georges House,Lever Street,,Wolverhampton,,WV2 1EZ,Tel: 01905798247,No ratings yet Rate it yourself - /Services/careproviders/LeaveReview/DefaultView.aspx?id=1-131377984,0,0,,
Bridge Court,1-117977197,SCL,43 Moathouse Lane West,Wednesfield,,Wolverhampton,West Midlands,WV11 3HE,Tel: 01902738124,No ratings yet Rate it yourself - /Services/careproviders/LeaveReview/DefaultView.aspx?id=1-117977197,0,0,,
Brightside Carers Ltd,1-11945047228,SCL,"Room 4, The Workspace",All Saints Road,,Wolverhampton,,WV2 1EL,Tel: 01214489950,No ratings yet Rate it yourself - /Services/careproviders/LeaveReview/DefaultView.aspx?id=1-11945047228,0,0,,
Wulfrun Rose Nursing Home,1-2449164012,SCL,Underhill,Underhill Lane,,Wolverhampton,West Midlands,WV10 8LP,Tel: 01902653284,No ratings yet Rate it yourself - /Services/careproviders/LeaveReview/DefaultView.aspx?id=1-2449164012,0,0,,
L&J Agape Healthcare LTD,1-17590385781,SCL,32 Crathorne Avenue,,,Wolverhampton,,WV10 6BT,Tel: 07874290538,No ratings yet Rate it yourself - /Services/careproviders/LeaveReview/DefaultView.aspx?id=1-17590385781,0,0,,
Park Road CCT,1-6809185747,SCL,22 Park Road West,,,Wolverhampton,,WV1 4PN,Tel: 01902854259,No ratings yet Rate it yourself - /Services/careproviders/LeaveReview/DefaultView.aspx?id=1-6809185747,0,0,,
CM Community Care Services Limited,1-126016558,SCL,Lincoln Lodge,2 Tettenhall Road,,Wolverhampton,,WV1 4SA,Tel: 01902426364,1 rating Rate it yourself - /Services/careproviders/LeaveReview/DefaultView.aspx?id=1-126016558,,,,
Atiba House,1-2261088546,SCL,50-51 Sweetman Street,,,Wolverhampton,West Midlands,WV6 0EN,Tel: 01902425627,2 ratings Rate it yourself - /Services/careproviders/LeaveReview/DefaultView.aspx?id=1-2261088546,,,,
Enable Carers Limited,1-12501881509,SCL,Stewart House,18 Stewart Street,,Wolverhampton,,WV2 4JW,,No ratings yet Rate it yourself - /Services/careproviders/LeaveReview/DefaultView.aspx?id=1-12501881509,0,0,,
The Cedar Grange Care Home,1-17933794373,SCL,453 Stafford Road,,,Wolverhampton,,WV10 6RR,,No ratings yet Rate it yourself - /Services/careproviders/LeaveReview/DefaultView.aspx?id=1-17933794373,0,0,,
Totally Care Limited,1-7388600925,SCL,4 Compton Road,,,Wolverhampton,,WV3 9PH,Tel: 01902973222,No ratings yet Rate it yourself - /Services/careproviders/LeaveReview/DefaultView.aspx?id=1-7388600925,0,0,,
Eversleigh Care Centre,1-173717262,SCL,52-62 Albert Road,West Park,,Wolverhampton,West Midlands,WV6 0AF,Tel: 01902426323,No ratings yet Rate it yourself - /Services/careproviders/LeaveReview/DefaultView.aspx?id=1-173717262,0,0,,
Apple Tree,1-12045246469,SCL,74 Albert Road,,,Wolverhampton,,WV6 0AF,Tel: 07530880120,No ratings yet Rate it yourself - /Services/careproviders/LeaveReview/DefaultView.aspx?id=1-12045246469,0,0,,
Royal Park,1-5100060774,SCL,Major Street,,,Wolverhampton,,WV2 2BL,Tel: 01902870349,2 ratings Rate it yourself - /Services/careproviders/LeaveReview/DefaultView.aspx?id=1-5100060774,,,,
Trinity Court,1-5100060734,SCL,Kent Road,,,Wolverhampton,,WV2 2AY,Tel: 01384217900,No ratings yet Rate it yourself - /Services/careproviders/LeaveReview/DefaultView.aspx?id=1-5100060734,0,0,,
Integra Supported Housing,1-498786000,SCL,Integra Support - Office S4,"Deansgate Offices, Tettenhall Road",,Wolverhampton,,WV1 4TH,Tel: 01384288220,3 ratings Rate it yourself - /Services/careproviders/LeaveReview/DefaultView.aspx?id=1-498786000,,,,
East Park Court Residential Care Home,1-453238555,SCL,29 Holloway Street,Bilston,,Wolverhampton,,WV1 2SY,Tel: 01902494525,No ratings yet Rate it yourself - /Services/careproviders/LeaveReview/DefaultView.aspx?id=1-453238555,0,0,,