Organisation Name,NACS Code,Organisation Type,Address1,Address2,Address3,Address4,Address5,PostCode,Telephone Number,NHS.UK users rating,Value  (NHS.UK users rating),Banding Classification  (NHS.UK users rating),Car parking (Is there car parking at this organisation?),Disabled access (Disabled access)
Melody Lodge,1-113439924,SCL,West Keal Hall,"Hall Lane, West Keal",,Spilsby,Lincolnshire,PE23 4BJ,Tel: 01790752700,No ratings yet Rate it yourself - /Services/careproviders/LeaveReview/DefaultView.aspx?id=1-113439924,0,0,,
Manor Care Centre,1-126718252,SCL,Fen Road,East Kirkby,,Spilsby,Lincolnshire,PE23 4DB,Tel: 01790763381,No ratings yet Rate it yourself - /Services/careproviders/LeaveReview/DefaultView.aspx?id=1-126718252,0,0,,
Vale View,1-127620228,SCL,Toynton All Saints,,,Spilsby,Lincolnshire,PE23 5AE,Tel: 01790755504,No ratings yet Rate it yourself - /Services/careproviders/LeaveReview/DefaultView.aspx?id=1-127620228,0,0,,
Desboro House,1-127620033,SCL,Toynton All Saints,,,Spilsby,Lincolnshire,PE23 5AE,Tel: 01790753049,No ratings yet Rate it yourself - /Services/careproviders/LeaveReview/DefaultView.aspx?id=1-127620033,0,0,,
Spencers Lodge,1-127619929,SCL,Toynton All Saints,,,Spilsby,Lincolnshire,PE23 5AE,Tel: 01790752499,No ratings yet Rate it yourself - /Services/careproviders/LeaveReview/DefaultView.aspx?id=1-127619929,0,0,,
Keal View,1-195645320,SCL,Toynton All Saints,,,Spilsby,Lincolnshire,PE23 5AE,Tel: 01790754926,No ratings yet Rate it yourself - /Services/careproviders/LeaveReview/DefaultView.aspx?id=1-195645320,0,0,,
CSL Spilsby,1-16326644009,SCL,Toynton Hall,"Main Road, Toynton All Saints",,Spilsby,Lincolnshire,PE23 5AE,Tel: 01790752499,No ratings yet Rate it yourself - /Services/careproviders/LeaveReview/DefaultView.aspx?id=1-16326644009,0,0,,
Welham House,1-445796933,SCL,Hundleby Road,,,Spilsby,Lincolnshire,PE23 5LP,Tel: 01790752989,No ratings yet Rate it yourself - /Services/careproviders/LeaveReview/DefaultView.aspx?id=1-445796933,0,0,,
Bumblebee Lodge,1-6145140760,SCL,6 Hundleby Road,Hundleby,,Spilsby,,PE23 5LP,Tel: 01754811002,No ratings yet Rate it yourself - /Services/careproviders/LeaveReview/DefaultView.aspx?id=1-6145140760,0,0,,
Dunsford,1-127620198,SCL,24a Partney Road,,,Spilsby,Lincolnshire,PE23 5EH,Tel: 01790753106,No ratings yet Rate it yourself - /Services/careproviders/LeaveReview/DefaultView.aspx?id=1-127620198,0,0,,
OSJCT Eresby Hall,1-122145113,SCL,Ancaster Avenue,,,Spilsby,Lincolnshire,PE23 5HT,Tel: 01790752495,No ratings yet Rate it yourself - /Services/careproviders/LeaveReview/DefaultView.aspx?id=1-122145113,0,0,,
Ashby Court,1-445783813,SCL,1-6 Ashby Road,,,Spilsby,Lincolnshire,PE23 5DR,Tel: 01790753432,No ratings yet Rate it yourself - /Services/careproviders/LeaveReview/DefaultView.aspx?id=1-445783813,0,0,,
The Old Hall Residential Care Home,1-109994781,SCL,Northorpe Road,Halton Holegate,,Spilsby,Lincolnshire,PE23 5NZ,Tel: 01790 753503,No ratings yet Rate it yourself - /Services/careproviders/LeaveReview/DefaultView.aspx?id=1-109994781,0,0,,
The Old Rectory,1-131820373,SCL,Main Road,Stickney,,Nr Boston,Lincolnshire,PE22 8AY,Tel: 01205480885,No ratings yet Rate it yourself - /Services/careproviders/LeaveReview/DefaultView.aspx?id=1-131820373,0,0,,
Scremby Grange,1-127611788,SCL,Scremby,,,Near Spilsby,Lincolnshire,PE23 5RW,Tel: 01754890521,No ratings yet Rate it yourself - /Services/careproviders/LeaveReview/DefaultView.aspx?id=1-127611788,0,0,,
South Wold Nursing Home,1-130412550,SCL,South Road,Tetford,,Horncastle,Lincolnshire,LN9 6QB,Tel: 01507533393,No ratings yet Rate it yourself - /Services/careproviders/LeaveReview/DefaultView.aspx?id=1-130412550,0,0,,
Netherlands,1-131815497,SCL,Spilsby Road,,,Horncastle,Lincolnshire,LN9 6AL,Tel: 01507522009,No ratings yet Rate it yourself - /Services/careproviders/LeaveReview/DefaultView.aspx?id=1-131815497,0,0,,
Tanglewood Care Home,1-7510814497,SCL,36 Louth Road,,,Horncastle,Lincolnshire,LN9 5EN,Tel: 01507527265,No ratings yet Rate it yourself - /Services/careproviders/LeaveReview/DefaultView.aspx?id=1-7510814497,0,0,,
Clarence House & The Granary,1-131820085,SCL,53 West Street,,,Horncastle,Lincolnshire,LN9 5JE,Tel: 01507524466,No ratings yet Rate it yourself - /Services/careproviders/LeaveReview/DefaultView.aspx?id=1-131820085,0,0,,
The Grove Residential Care Home,1-344231398,SCL,Main Street,West Ashby,,Horncastle,Lincolnshire,LN9 5PT,Tel: 01507522507,No ratings yet Rate it yourself - /Services/careproviders/LeaveReview/DefaultView.aspx?id=1-344231398,0,0,,
Thimbleby Court,1-16488851500,SCL,Thimbleby Road,,,Horncastle,,LN9 5RA,Tel: 01507304320,No ratings yet Rate it yourself - /Services/careproviders/LeaveReview/DefaultView.aspx?id=1-16488851500,0,0,,
Orby House,1-464806807,SCL,Gunby Road,,,Orby,Lincolnshire,PE23 5SW,Tel: 01754811354,No ratings yet Rate it yourself - /Services/careproviders/LeaveReview/DefaultView.aspx?id=1-464806807,0,0,,
Victoria House Residential Home,1-113800798,SCL,31 Station Road,,,Alford,Lincolnshire,LN13 9JB,Tel: 01507463292,No ratings yet Rate it yourself - /Services/careproviders/LeaveReview/DefaultView.aspx?id=1-113800798,0,0,,
The Chimneys Care Home,1-118651529,SCL,1 Station Road,,,Alford,Lincolnshire,LN13 9HY,Tel: 01507462789,No ratings yet Rate it yourself - /Services/careproviders/LeaveReview/DefaultView.aspx?id=1-118651529,0,0,,
Toray Pines Care Home,1-7522526707,SCL,School Lane,Coningsby,,Lincoln,,LN4 4SJ,Tel: 01526344361,No ratings yet Rate it yourself - /Services/careproviders/LeaveReview/DefaultView.aspx?id=1-7522526707,0,0,,
Bramhall,1-1681940827,SCL,1 Butt Lane,Tattershall,,Lincoln,Lincolnshire,LN4 4NL,Tel: 01526342632,1 rating Rate it yourself - /Services/careproviders/LeaveReview/DefaultView.aspx?id=1-1681940827,,,,
CSL  Alford,1-16322310395,SCL,The Sycamores,45 South Street,,Alford,,LN13 9AN,Tel: 01507463225,No ratings yet Rate it yourself - /Services/careproviders/LeaveReview/DefaultView.aspx?id=1-16322310395,0,0,,
The Sycamores,1-127619830,SCL,45 South Street,,,Alford,Lincolnshire,LN13 9AN,Tel: 01507463225,No ratings yet Rate it yourself - /Services/careproviders/LeaveReview/DefaultView.aspx?id=1-127619830,0,0,,
Sandpiper Care Home,1-7522526632,SCL,16 South Street,,,Alford,,LN13 9AQ,Tel: 01507462112,No ratings yet Rate it yourself - /Services/careproviders/LeaveReview/DefaultView.aspx?id=1-7522526632,0,0,,
Heatherlea House Residential Care Home,1-3775693908,SCL,109 Tor O Moor Road,,,Woodhall Spa,Lincolnshire,LN10 6SD,Tel: 01526353394,1 rating Rate it yourself - /Services/careproviders/LeaveReview/DefaultView.aspx?id=1-3775693908,,,,
Flo's Friends,1-2201719240,SCL,91 Church Road,Old Leake,,Boston,,PE22 9PA,Tel: 07411846692,2 ratings Rate it yourself - /Services/careproviders/LeaveReview/DefaultView.aspx?id=1-2201719240,,,,
Westerley Residential Care Home for the Elderly - Woodhall Spa,1-112803138,SCL,Westerley,The Broadway,,Woodhall Spa,Lincolnshire,LN10 6SQ,Tel: 01526352231,No ratings yet Rate it yourself - /Services/careproviders/LeaveReview/DefaultView.aspx?id=1-112803138,0,0,,
The Minstrels Residential Home,1-125540589,SCL,Main Road,Wrangle,,Boston,Lincolnshire,PE22 9AJ,Tel: 01205870910,No ratings yet Rate it yourself - /Services/careproviders/LeaveReview/DefaultView.aspx?id=1-125540589,0,0,,
Russell Green Care Home,1-2789942334,SCL,11 Stanhope Avenue,,,Woodhall Spa,Lincolnshire,LN10 6SP,Tel: 01526352879,No ratings yet Rate it yourself - /Services/careproviders/LeaveReview/DefaultView.aspx?id=1-2789942334,0,0,,
Swallowdale,1-127620019,SCL,5 Bilsby Road,,,Alford,Lincolnshire,LN13 9EW,Tel: 01507463833,No ratings yet Rate it yourself - /Services/careproviders/LeaveReview/DefaultView.aspx?id=1-127620019,0,0,,
Wainfleet Care Home,1-1968586108,SCL,Rumbold Lane,Wainfleet,,Skegness,Lincolnshire,PE24 4DS,Tel: 01754881155,No ratings yet Rate it yourself - /Services/careproviders/LeaveReview/DefaultView.aspx?id=1-1968586108,0,0,,
The Gables,1-112754649,SCL,Willoughby Road,Cumberworth,,Alford,Lincolnshire,LN13 9LF,Tel: 01507490171,No ratings yet Rate it yourself - /Services/careproviders/LeaveReview/DefaultView.aspx?id=1-112754649,0,0,,
Walnut Care At Home,1-414082459,SCL,Walnut Cottage,Langrick,,Boston,Lincolnshire,PE22 7AP,Tel: 01205 280101,1 rating Rate it yourself - /Services/careproviders/LeaveReview/DefaultView.aspx?id=1-414082459,,,,
Nightingale House Care Centre,1-134145187,SCL,Main Road,Bucknall,,Lincoln,Lincolnshire,LN10 5DT,Tel: 01526388261,No ratings yet Rate it yourself - /Services/careproviders/LeaveReview/DefaultView.aspx?id=1-134145187,0,0,,
Ashtree House,1-120246729,SCL,Church Lane,Withern,,Alford,Lincolnshire,LN13 0NG,Tel: 01507450373,No ratings yet Rate it yourself - /Services/careproviders/LeaveReview/DefaultView.aspx?id=1-120246729,0,0,,
Link House,1-445784550,SCL,Main Road,,,Withern,Lincolnshire,LN13 0NB,Tel: 01507450403,No ratings yet Rate it yourself - /Services/careproviders/LeaveReview/DefaultView.aspx?id=1-445784550,0,0,,
Meadows Court Care Home,1-5312022711,SCL,West End,Hogsthorpe,,Skegness,Lincolnshire,PE24 5PA,Tel: 01754872302,No ratings yet Rate it yourself - /Services/careproviders/LeaveReview/DefaultView.aspx?id=1-5312022711,0,0,,
Newhaven Residential Home,1-125056575,SCL,Mumby Road,Huttoft,,Alford,Lincolnshire,LN13 9RF,Tel: 01507490294,No ratings yet Rate it yourself - /Services/careproviders/LeaveReview/DefaultView.aspx?id=1-125056575,0,0,,
Aspen Lodge Care home,1-18082890106,SCL,Yarborough Road,,,Skegness,Lincolnshire,PE25 2NX,Tel: 01754610300,No ratings yet Rate it yourself - /Services/careproviders/LeaveReview/DefaultView.aspx?id=1-18082890106,0,0,,
OSJCT Skirbeck Court,1-122145228,SCL,55a Spilsby Road,,,Boston,Lincolnshire,PE21 9NU,Tel: 01205361444,No ratings yet Rate it yourself - /Services/careproviders/LeaveReview/DefaultView.aspx?id=1-122145228,0,0,,
Willoughby Grange Care Home,1-12906862295,SCL,Willoughby Road,,,Boston,Lincolnshire,PE21 9EG,Tel: 01205357836,No ratings yet Rate it yourself - /Services/careproviders/LeaveReview/DefaultView.aspx?id=1-12906862295,0,0,,
CARESHAW LTD,1-8445181103,SCL,Aura Buisness Centre,"Office 5, Heath Road",,Skegness,,PE25 3SJ,Tel: 01754768029,No ratings yet Rate it yourself - /Services/careproviders/LeaveReview/DefaultView.aspx?id=1-8445181103,0,0,,
Pickworth House,1-13141243679,SCL,85 Norfolk Street,,,Boston,,PE21 6PE,Tel: 01205356309,No ratings yet Rate it yourself - /Services/careproviders/LeaveReview/DefaultView.aspx?id=1-13141243679,0,0,,
The Georgians (Boston) Limited - 50 Wide Bargate Boston,1-120074756,SCL,50 Wide Bargate,,,Boston,Lincolnshire,PE21 6RY,Tel: 01205364111,1 rating Rate it yourself - /Services/careproviders/LeaveReview/DefaultView.aspx?id=1-120074756,,,,
Ashridge,1-133287819,SCL,14 Tower Road,,,Boston,Lincolnshire,PE21 9AD,Tel: 01205366922,No ratings yet Rate it yourself - /Services/careproviders/LeaveReview/DefaultView.aspx?id=1-133287819,0,0,,
Pilgrimage Short Stay Recovery Unit,1-13646623902,SCL,47 Punchbowl Lane,,,Boston,,PE21 8HU,,No ratings yet Rate it yourself - /Services/careproviders/LeaveReview/DefaultView.aspx?id=1-13646623902,0,0,,
Town and Country Care,1-3526816857,SCL,13a Pen Street,,,Boston,Lincolnshire,PE21 6TJ,Tel: 01205354329,No ratings yet Rate it yourself - /Services/careproviders/LeaveReview/DefaultView.aspx?id=1-3526816857,0,0,,
Vauxhall Court Care Home,1-139106433,SCL,Vauxhall Court Residential Care Home,Freiston Road,,Boston,Lincolnshire,PE21 0JW,,2 ratings Rate it yourself - /Services/careproviders/LeaveReview/DefaultView.aspx?id=1-139106433,,,,
Westfield Nursing Home,1-1612923151,SCL,34 Sleaford Road,,,Boston,Lincolnshire,PE21 8EU,Tel: 01205365835,No ratings yet Rate it yourself - /Services/careproviders/LeaveReview/DefaultView.aspx?id=1-1612923151,0,0,,
Elmwood House Nursing Home,1-4006290845,SCL,88 Sleaford Road,,,Boston,Lincolnshire,PE21 8EY,Tel: 01205369235,No ratings yet Rate it yourself - /Services/careproviders/LeaveReview/DefaultView.aspx?id=1-4006290845,0,0,,
The Gardens Residential Home,1-4009018329,SCL,88 Sleaford Road,,,Boston,Lincolnshire,PE21 8EY,Tel: 01205359797,No ratings yet Rate it yourself - /Services/careproviders/LeaveReview/DefaultView.aspx?id=1-4009018329,0,0,,
The Angels on Call,1-2915995979,SCL,106 Woad Farm Road,,,Boston,Lincolnshire,PE21 0EW,Tel: 07572592471,1 rating Rate it yourself - /Services/careproviders/LeaveReview/DefaultView.aspx?id=1-2915995979,,,,
County Care Independent Living Ltd (Lincolnshire Office),1-2301635097,SCL,17-19 Lumley Avenue,Lincolnshire,,Skegness,,PE25 2AP,Tel: 01754611153,2 ratings Rate it yourself - /Services/careproviders/LeaveReview/DefaultView.aspx?id=1-2301635097,,,,
Healthy Homecare Services Ltd,1-2551493549,SCL,43 Woodville Road,,,Boston,Lincolnshire,PE21 8AR,Tel: 07951548684,1 rating Rate it yourself - /Services/careproviders/LeaveReview/DefaultView.aspx?id=1-2551493549,,,,
Louth Manor Care Home,1-12864787445,SCL,Legbourne Road,,,Louth,,LN11 8ER,Tel: 01507203203,No ratings yet Rate it yourself - /Services/careproviders/LeaveReview/DefaultView.aspx?id=1-12864787445,0,0,,
Munyasha Ltd,1-16284945975,SCL,Venture House,"Enterprise Way, Wyberton Fen",,Boston,Lincolnshire,PE21 7TW,Tel: 07429017829,No ratings yet Rate it yourself - /Services/careproviders/LeaveReview/DefaultView.aspx?id=1-16284945975,0,0,,
Radis Community Care (Boston Supported Living),1-15878928224,SCL,Venture House,Enterprise Way,,Boston,,PE21 7TW,Tel: 07513713853,No ratings yet Rate it yourself - /Services/careproviders/LeaveReview/DefaultView.aspx?id=1-15878928224,0,0,,
The Palms,1-127620076,SCL,147 Drummond Road,,,Skegness,Lincolnshire,PE25 3BT,Tel: 01754768067,1 rating Rate it yourself - /Services/careproviders/LeaveReview/DefaultView.aspx?id=1-127620076,,,,
Sandbeck House Residential Home,1-2079310232,SCL,77/81 Sandbeck House,,,Skegness,Lincolnshire,PE25 3JX,Tel: 01754766585,No ratings yet Rate it yourself - /Services/careproviders/LeaveReview/DefaultView.aspx?id=1-2079310232,0,0,,
Syne Hills Care Home Limited,1-309482038,SCL,Syne Avenue,,,Skegness,Lincolnshire,PE25 3DJ,Tel: 01754764329,No ratings yet Rate it yourself - /Services/careproviders/LeaveReview/DefaultView.aspx?id=1-309482038,0,0,,
Byron House,1-131820006,SCL,104 Drummond Road,Seacroft,,Skegness,Lincolnshire,PE25 3EH,,No ratings yet Rate it yourself - /Services/careproviders/LeaveReview/DefaultView.aspx?id=1-131820006,0,0,,
Blair House,1-339044286,SCL,Skirth Road,Billinghay,,Lincoln,Lincolnshire,LN4 4AY,Tel: 01526860432,1 rating Rate it yourself - /Services/careproviders/LeaveReview/DefaultView.aspx?id=1-339044286,,,,
Cera - Lincolnshire,1-12339158254,SCL,Mayfields,Broadfield Lane,,Boston,,PE21 8GH,Tel: 01205631101,No ratings yet Rate it yourself - /Services/careproviders/LeaveReview/DefaultView.aspx?id=1-12339158254,0,0,,
Allways Care Community Support Agency,1-2839778869,SCL,113 Drummond Road,,,Skegness,Lincolnshire,PE25 3EP,Tel: 01754612720,No ratings yet Rate it yourself - /Services/careproviders/LeaveReview/DefaultView.aspx?id=1-2839778869,0,0,,
Rayleigh House,1-2839815798,SCL,17 Derby Avenue,,,Skegness,Lincolnshire,PE25 3DH,Tel: 01754764382,No ratings yet Rate it yourself - /Services/careproviders/LeaveReview/DefaultView.aspx?id=1-2839815798,0,0,,
Seacroft Court Nursing Home,1-1031902754,SCL,Seacroft Esplanade,,,Skegness,Lincolnshire,PE25 3BE,Tel: 01754610372,No ratings yet Rate it yourself - /Services/careproviders/LeaveReview/DefaultView.aspx?id=1-1031902754,0,0,,
West Cotes Residential Care Home,1-7839942079,SCL,70 South Parade,,,Skegness,Lincolnshire,PE25 3HP,Tel: 01754610616,No ratings yet Rate it yourself - /Services/careproviders/LeaveReview/DefaultView.aspx?id=1-7839942079,0,0,,
The Haven,1-8526216559,SCL,White House Lane,,,Boston,Lincolnshire,PE21 0BE,Tel: 01205345005,No ratings yet Rate it yourself - /Services/careproviders/LeaveReview/DefaultView.aspx?id=1-8526216559,0,0,,
CSL Skegness,1-16326643927,SCL,87 St. Andrews Drive,,,Skegness,,PE25 1DL,Tel: 01754768067,No ratings yet Rate it yourself - /Services/careproviders/LeaveReview/DefaultView.aspx?id=1-16326643927,0,0,,
St Andrews Drive,1-127620213,SCL,87 St Andrews Drive,,,Skegness,Lincolnshire,PE25 1DL,Tel: 01754898858,No ratings yet Rate it yourself - /Services/careproviders/LeaveReview/DefaultView.aspx?id=1-127620213,0,0,,
Seathorne Court Residential Home,1-129879663,SCL,Winthorpe Avenue,Winthorpe,,Skegness,Lincolnshire,PE25 1RW,Tel: 01754765225,No ratings yet Rate it yourself - /Services/careproviders/LeaveReview/DefaultView.aspx?id=1-129879663,0,0,,
Stewton House Nursing Home,1-10876398000,SCL,28 Stewton Lane,,,Louth,Lincolnshire,LN11 8RZ,Tel: 01507602961,No ratings yet Rate it yourself - /Services/careproviders/LeaveReview/DefaultView.aspx?id=1-10876398000,0,0,,
York House,1-232410795,SCL,15 Waterside,Billinghay,,Lincoln,Lincolnshire,LN4 4BU,Tel: 01526860378,No ratings yet Rate it yourself - /Services/careproviders/LeaveReview/DefaultView.aspx?id=1-232410795,0,0,,
Phoenix Care Centre,1-151677726,SCL,Ancaster Avenue,Chapel St Leonards,,Skegness,Lincolnshire,PE24 5SN,Tel: 01754872645,No ratings yet Rate it yourself - /Services/careproviders/LeaveReview/DefaultView.aspx?id=1-151677726,0,0,,
The Beeches,1-420856889,SCL,28 South Street,,,Louth,Lincolnshire,LN11 9JT,Tel: 01507603862,1 rating Rate it yourself - /Services/careproviders/LeaveReview/DefaultView.aspx?id=1-420856889,,,,
Meadows Edge Care Home,1-117569787,SCL,Wyberton West Road,Wyberton,,Boston,Lincolnshire,PE21 7JU,Tel: 01205353271,No ratings yet Rate it yourself - /Services/careproviders/LeaveReview/DefaultView.aspx?id=1-117569787,0,0,,
Fir Close,1-131820117,SCL,2 Westgate,,,Louth,Lincolnshire,LN11 9YH,Tel: 01507603882,2 ratings Rate it yourself - /Services/careproviders/LeaveReview/DefaultView.aspx?id=1-131820117,,,,
SENSE - 54 Monks Dyke Road,1-120444496,SCL,54 Monks Dyke Road,,,Louth,Lincolnshire,LN11 9AN,Tel: 01507609332,No ratings yet Rate it yourself - /Services/careproviders/LeaveReview/DefaultView.aspx?id=1-120444496,0,0,,
SENSE - 56 Monks Dyke Road,1-120444512,SCL,56 Monks Dyke Road,,,Louth,Lincolnshire,LN11 9AN,Tel: 01507610877,No ratings yet Rate it yourself - /Services/careproviders/LeaveReview/DefaultView.aspx?id=1-120444512,0,0,,
Hunters Creek Care Home,1-7510814594,SCL,130-134,London Road,,Boston,,PE21 7HB,Tel: 01205358034,No ratings yet Rate it yourself - /Services/careproviders/LeaveReview/DefaultView.aspx?id=1-7510814594,0,0,,
LIBERTAS,1-873553651,SCL,133 Eastgate,,,Louth,,LN11 9QE,Tel: 01507206666,No ratings yet Rate it yourself - /Services/careproviders/LeaveReview/DefaultView.aspx?id=1-873553651,0,0,,
Seaton House,1-127619802,SCL,153 Eastgate,,,Louth,Lincolnshire,LN11 9AJ,Tel: 01507611071,No ratings yet Rate it yourself - /Services/careproviders/LeaveReview/DefaultView.aspx?id=1-127619802,0,0,,
The Rowans,1-1438738101,SCL,266 Eastgate,,,Louth,Lincolnshire,LN11 8DJ,Tel: 01507608081,No ratings yet Rate it yourself - /Services/careproviders/LeaveReview/DefaultView.aspx?id=1-1438738101,0,0,,
SENSE - 25 Old Mill Park,1-120444527,SCL,25 Old Mill Park,,,Louth,Lincolnshire,LN11 0NY,Tel: 01507608052,No ratings yet Rate it yourself - /Services/careproviders/LeaveReview/DefaultView.aspx?id=1-120444527,0,0,,
Riverside,1-127611774,SCL,Ramsgate Road,,,Louth,Lincolnshire,LN11 0NJ,Tel: 01507608311,No ratings yet Rate it yourself - /Services/careproviders/LeaveReview/DefaultView.aspx?id=1-127611774,0,0,,
Madeira House Residential Care Home,1-391162423,SCL,129/131 High Holme Road,,,Louth,Lincolnshire,LN11 0HD,Tel: 01507 607452,No ratings yet Rate it yourself - /Services/careproviders/LeaveReview/DefaultView.aspx?id=1-391162423,0,0,,
Martin Hall Nursing Home,1-3658021394,SCL,High Street,Martin,,Lincoln,Lincolnshire,LN4 3QY,Tel: 01526378251,2 ratings Rate it yourself - /Services/careproviders/LeaveReview/DefaultView.aspx?id=1-3658021394,,,,
Meadows Park Care Home,1-11481125908,SCL,Daisy Way,,,Louth,,LN11 0FS,Tel: 01507304344,1 rating Rate it yourself - /Services/careproviders/LeaveReview/DefaultView.aspx?id=1-11481125908,,,,
The Elms Care Home,1-2656875693,SCL,Elm Drive,,,Louth,Lincolnshire,LN11 0DE,Tel: 01507350100,No ratings yet Rate it yourself - /Services/careproviders/LeaveReview/DefaultView.aspx?id=1-2656875693,0,0,,
Avocet House Care Home,1-10216615141,SCL,Parkes Lane,,,Boston,,PE21 7NT,Tel: 01205336897,No ratings yet Rate it yourself - /Services/careproviders/LeaveReview/DefaultView.aspx?id=1-10216615141,0,0,,
The Wolds Care Centre,1-9937742844,SCL,North Holme Road,,,Louth,Lincolnshire,LN11 0JF,Tel: 01507602360,No ratings yet Rate it yourself - /Services/careproviders/LeaveReview/DefaultView.aspx?id=1-9937742844,0,0,,
Doulton Court Lodge Care Home,1-17971152326,SCL,Alford Road,Sutton-on-sea,,Mablethorpe,,LN12 2HF,Tel: 01507623800,No ratings yet Rate it yourself - /Services/careproviders/LeaveReview/DefaultView.aspx?id=1-17971152326,0,0,,
The Hawthorns,1-118422304,SCL,53 Station Road,Bardney,,Lincoln,Lincolnshire,LN3 5UD,Tel: 01526399868,No ratings yet Rate it yourself - /Services/careproviders/LeaveReview/DefaultView.aspx?id=1-118422304,0,0,,
Brambles,1-1125517156,SCL,53 Station Road,Bardney,,Lincoln,Lincolnshire,LN3 5UD,Tel: 01526398010,No ratings yet Rate it yourself - /Services/careproviders/LeaveReview/DefaultView.aspx?id=1-1125517156,0,0,,
The Hollies,1-1302672210,SCL,"The Hawthorns, 53 Station Road",Bardney,,Lincoln,Lincolnshire,LN3 5UD,Tel: 01526398633,No ratings yet Rate it yourself - /Services/careproviders/LeaveReview/DefaultView.aspx?id=1-1302672210,0,0,,
The Oaks,1-2235397512,SCL,51 Station Road,Bardney,,Lincoln,Lincolnshire,LN3 5UD,Tel: 01526399683,No ratings yet Rate it yourself - /Services/careproviders/LeaveReview/DefaultView.aspx?id=1-2235397512,0,0,,
Manor Gate Care Home,1-221399823,SCL,190 Causeway,Wyberton,,Boston,Lincolnshire,PE21 7BS,Tel: 01205366260,2 ratings Rate it yourself - /Services/careproviders/LeaveReview/DefaultView.aspx?id=1-221399823,,,,
Willoughby House,1-445797086,SCL,Willoughby Road,,,Sutton-on-Sea,Lincolnshire,LN12 2NF,Tel: 01507442555,No ratings yet Rate it yourself - /Services/careproviders/LeaveReview/DefaultView.aspx?id=1-445797086,0,0,,
Summerfield Rest Home,1-12465257196,SCL,10-12 Park Road East,Sutton-on-Sea,,Mablethorpe,Lincolnshire,LN12 2NL,Tel: 01507441969,No ratings yet Rate it yourself - /Services/careproviders/LeaveReview/DefaultView.aspx?id=1-12465257196,0,0,,
Ralphland Care Home,1-446850156,SCL,Ralphs Lane,Frampton West,,Boston,Lincolnshire,PE20 1QU,Tel: 01205722332,No ratings yet Rate it yourself - /Services/careproviders/LeaveReview/DefaultView.aspx?id=1-446850156,0,0,,
Wyngate Residential Care Home,1-278910538,SCL,Alford Road,,,Mablethorpe,Lincolnshire,LN12 1PX,Tel: 01507477531,No ratings yet Rate it yourself - /Services/careproviders/LeaveReview/DefaultView.aspx?id=1-278910538,0,0,,
Miramar Nursing Home,1-105247794,SCL,20 Trusthorpe Road,Sutton-on-Sea,,Mablethorpe,Lincolnshire,LN12 2LT,Tel: 01507442484,1 rating Rate it yourself - /Services/careproviders/LeaveReview/DefaultView.aspx?id=1-105247794,,,,
East Midlands Care Agency Services (EMCAS) Ltd,1-13383241826,SCL,Woodlands Office Suite,"Woodlnds, Grimsby Road",,Louth,,LN11 0SX,Tel: 01507499076,No ratings yet Rate it yourself - /Services/careproviders/LeaveReview/DefaultView.aspx?id=1-13383241826,0,0,,
The Great Care Company Lincolnshire North,1-5497080322,SCL,"Suite 27, Fairfield Enterprise Centre","Lincoln Way, Fairfield Industrial Estate",,Louth,,LN11 0LS,Tel: 0333 200 7199,No ratings yet Rate it yourself - /Services/careproviders/LeaveReview/DefaultView.aspx?id=1-5497080322,0,0,,
Sense supported living services ( Lincolnshire),1-15020878192,SCL,22 Nottingham Court,Nottingham Road,,Louth,,LN11 0WP,,No ratings yet Rate it yourself - /Services/careproviders/LeaveReview/DefaultView.aspx?id=1-15020878192,0,0,,