Organisation Name,NACS Code,Organisation Type,Address1,Address2,Address3,Address4,Address5,PostCode,Telephone Number,NHS.UK users rating,Value  (NHS.UK users rating),Banding Classification  (NHS.UK users rating),Car parking (Is there car parking at this organisation?),Disabled access (Disabled access)
Durbia Healthcare Ltd,1-4889728347,SCL,62 Arnold Road,Old Basford,,Nottingham,,NG6 0DZ,Tel: 07393591175,No ratings yet Rate it yourself - /Services/careproviders/LeaveReview/DefaultView.aspx?id=1-4889728347,0,0,,
Crossover Care Ltd,1-1949476904,SCL,Nash Business Centre,62 Arnold Road,,Nottingham,,NG6 0DZ,Tel: 07445851691,No ratings yet Rate it yourself - /Services/careproviders/LeaveReview/DefaultView.aspx?id=1-1949476904,0,0,,
Ardour Healthcare Services Ltd,1-10877107458,SCL,NBV House Enterprise House,6 David Lane,,Nottingham,,NG6 0JU,Tel: 07455137597,No ratings yet Rate it yourself - /Services/careproviders/LeaveReview/DefaultView.aspx?id=1-10877107458,0,0,,
Dove Caring Ltd,1-2929791987,SCL,NBV Enterprise Centre,6 David Lane,,Nottingham,Nottinghamshire,NG6 0JU,Tel: 01159648243,No ratings yet Rate it yourself - /Services/careproviders/LeaveReview/DefaultView.aspx?id=1-2929791987,0,0,,
Heaven Scent Care Services Ltd,1-1269958903,SCL,NBV Enterprise Centre,6 David Lane,,Basford,Nottinghamshire,NG6 0JU,Tel: 01159648241,No ratings yet Rate it yourself - /Services/careproviders/LeaveReview/DefaultView.aspx?id=1-1269958903,0,0,,
Denbridge Care Limited,1-11646485518,SCL,NBV Enterprise Centre,"6 David Lane, New Basford",,Nottingham,,NG6 0JU,Tel: 01157790820,No ratings yet Rate it yourself - /Services/careproviders/LeaveReview/DefaultView.aspx?id=1-11646485518,0,0,,
Clarke house care ltd,1-6252654756,SCL,6 David Lane,,,Nottingham,Nottinghamshire,NG6 0JU,Tel: 01156975756,1 rating Rate it yourself - /Services/careproviders/LeaveReview/DefaultView.aspx?id=1-6252654756,,,,
TRZ Care - Main Office,1-11673194390,SCL,"Office 7, 6 David Lane",Old Basford,,Nottingham,,NG6 0JU,Tel: 01158370470,No ratings yet Rate it yourself - /Services/careproviders/LeaveReview/DefaultView.aspx?id=1-11673194390,0,0,,
Gozian Healthcare Ltd,1-14732188675,SCL,6 David Lane,,,Nottingham,Nottinghamshire,NG6 0JU,Tel: 03330904534,1 rating Rate it yourself - /Services/careproviders/LeaveReview/DefaultView.aspx?id=1-14732188675,,,,
Royal Diadem Care Limited,1-9843383650,SCL,NBV,"Enterprise Centre, Basford",,Nottingham,,NG6 0JU,Tel: 07435566666,No ratings yet Rate it yourself - /Services/careproviders/LeaveReview/DefaultView.aspx?id=1-9843383650,0,0,,
Nottz Care,1-4028861734,SCL,6 David Lane,,,Nottingham,Nottinghamshire,NG6 0JU,Tel: 01159648277,No ratings yet Rate it yourself - /Services/careproviders/LeaveReview/DefaultView.aspx?id=1-4028861734,0,0,,
Raynes Healthcare Ltd,1-12813784454,SCL,NBV Enterprise Centre,"6 David Lane, Old Basford",,Nottingham,,NG6 0JU,Tel: 01158751850,No ratings yet Rate it yourself - /Services/careproviders/LeaveReview/DefaultView.aspx?id=1-12813784454,0,0,,
Spectrum Living Ltd,1-18693279858,SCL,6 David Lane,,,Nottingham,Nottinghamshire,NG6 0JU,,No ratings yet Rate it yourself - /Services/careproviders/LeaveReview/DefaultView.aspx?id=1-18693279858,0,0,,
Ambito Community Services East Midlands,1-7445939923,SCL,121 Park Lane,Basford,,Nottingham,,NG6 0DT,Tel: 07435966748,No ratings yet Rate it yourself - /Services/careproviders/LeaveReview/DefaultView.aspx?id=1-7445939923,0,0,,
Basford,1-879621502,SCL,55A Hadbury Road,,,Nottingham,Nottinghamshire,NG5 1JZ,Tel: 01159704850,No ratings yet Rate it yourself - /Services/careproviders/LeaveReview/DefaultView.aspx?id=1-879621502,0,0,,
Connect House,1-4227838300,SCL,8A Riber Crescent,Basford,,Nottingham,,NG5 1LP,Tel: 01159245467,7 ratings Rate it yourself - /Services/careproviders/LeaveReview/DefaultView.aspx?id=1-4227838300,,,,
NurtureCare Ltd,1-6870907739,SCL,3 Park Lane Business Centre,Park Lane,,Nottingham,,NG6 0DW,Tel: 01159640557,No ratings yet Rate it yourself - /Services/careproviders/LeaveReview/DefaultView.aspx?id=1-6870907739,0,0,,
Nottingham Regional Office,1-2165191724,SCL,Concord Business Centre,Nottingham Road,,New Basford,Nottinghamshire,NG7 7FF,Tel: 01158700316,No ratings yet Rate it yourself - /Services/careproviders/LeaveReview/DefaultView.aspx?id=1-2165191724,0,0,,
JWM Healthcare LTD,1-9560184006,SCL,Concorde Business Centre,Nottingham Road,,Nottingham,,NG7 7FF,Tel: 07413757017,4 ratings Rate it yourself - /Services/careproviders/LeaveReview/DefaultView.aspx?id=1-9560184006,,,,
Yanah Care,1-15261036415,SCL,Concord House C0011,Nottingham Road,,Nottingham,,NG7 7FF,Tel: 01157483626,No ratings yet Rate it yourself - /Services/careproviders/LeaveReview/DefaultView.aspx?id=1-15261036415,0,0,,
Springs Of Joy Care Solution (SOJ) C.I.C,1-2018369036,SCL,91 Isandula Road,Basford,,Nottingham,Nottinghamshire,NG7 7ER,Tel: 01159705982,No ratings yet Rate it yourself - /Services/careproviders/LeaveReview/DefaultView.aspx?id=1-2018369036,0,0,,
14-17 Palmwood Court,1-2008549284,SCL,"16 Palmwood Court, The Woodlands",Highbury Road,,Nottingham,Nottinghamshire,NG6 9BZ,Tel: 01156666745,No ratings yet Rate it yourself - /Services/careproviders/LeaveReview/DefaultView.aspx?id=1-2008549284,0,0,,
16 Totland Drive,1-15828323318,SCL,16 Totland Drive,,,Nottingham,,NG8 5FB,,No ratings yet Rate it yourself - /Services/careproviders/LeaveReview/DefaultView.aspx?id=1-15828323318,0,0,,
Turning Point - Alfred Minto House Care Home,1-124012874,SCL,26-28 Zulu Road,New Basford,,Nottingham,Nottinghamshire,NG7 7DR,Tel: 01159783826,No ratings yet Rate it yourself - /Services/careproviders/LeaveReview/DefaultView.aspx?id=1-124012874,0,0,,
Trevikam Healthcare Office,1-12830115830,SCL,"Concord House, 1 Malton Road",New Basford,,Nottingham,,NG5 1EG,Tel: 07828072060,No ratings yet Rate it yourself - /Services/careproviders/LeaveReview/DefaultView.aspx?id=1-12830115830,0,0,,
Nuthall Road - Supported Living,1-2008548876,SCL,499-509B  Nuthall Road,,,Nottingham,Nottinghamshire,NG8 5DG,Tel: 01159780587,No ratings yet Rate it yourself - /Services/careproviders/LeaveReview/DefaultView.aspx?id=1-2008548876,0,0,,
Lime Lodge,1-425818621,SCL,575 Nuthall Road,,,Nottingham,Nottinghamshire,NG8 6AD,Tel: 01158758349,No ratings yet Rate it yourself - /Services/careproviders/LeaveReview/DefaultView.aspx?id=1-425818621,0,0,,
The Limes,1-1707109586,SCL,6 Lime Tree Avenue,Aspley,,Nottingham,Nottinghamshire,NG8 6AB,Tel: 01158758349,No ratings yet Rate it yourself - /Services/careproviders/LeaveReview/DefaultView.aspx?id=1-1707109586,0,0,,
Greenline Healthcare Group Ltd,1-9434732581,SCL,153a Brooklyn Road,Bulwell,,Nottingham,,NG6 9GN,Tel: 03335778089,No ratings yet Rate it yourself - /Services/careproviders/LeaveReview/DefaultView.aspx?id=1-9434732581,0,0,,
MoreLoved Care Ltd,1-14157488363,SCL,Sovereign House,184 Nottingham Road,,Nottingham,,NG7 7BA,Tel: 01156812514,No ratings yet Rate it yourself - /Services/careproviders/LeaveReview/DefaultView.aspx?id=1-14157488363,0,0,,
Betna Agencies Ltd,1-4135107760,SCL,"Office 12, Sovereign House",184 Nottingham Road,,Nottingham,,NG7 7BA,Tel: 01158379713,No ratings yet Rate it yourself - /Services/careproviders/LeaveReview/DefaultView.aspx?id=1-4135107760,0,0,,
Nottingham,1-15199313197,SCL,Unit 3 Adam Court,North Gate,,Nottingham,,NG7 7GR,Tel: 01159789557,No ratings yet Rate it yourself - /Services/careproviders/LeaveReview/DefaultView.aspx?id=1-15199313197,0,0,,
4 Smedley Close,1-15981239665,SCL,4 Smedley Close,,,Nottingham,Nottinghamshire,NG8 5BZ,,No ratings yet Rate it yourself - /Services/careproviders/LeaveReview/DefaultView.aspx?id=1-15981239665,0,0,,
Talbert Living Care Investment,1-9833753018,SCL,"Office Number 4, JohnPye Serviced Offices","Mercury House, North Gate, Basford",,Nottingham,,NG7 7FN,Tel: 01156971675,No ratings yet Rate it yourself - /Services/careproviders/LeaveReview/DefaultView.aspx?id=1-9833753018,0,0,,
Mercury House,1-15474125950,SCL,Shipstones Business Centre,"North Gate, New Basford",,Nottingham,,NG7 7FN,Tel: 01159648212,No ratings yet Rate it yourself - /Services/careproviders/LeaveReview/DefaultView.aspx?id=1-15474125950,0,0,,
HEAVENLY TOUCH CARE LIMITED,1-13934282816,SCL,"Office 17, Mercury House",North Gate,,Nottingham,,NG7 7FN,,No ratings yet Rate it yourself - /Services/careproviders/LeaveReview/DefaultView.aspx?id=1-13934282816,0,0,,
Insight Care Services Ltd,1-8290133569,SCL,"Unit 18, John Pye Business Offices","Mercury House, Basford, Shipstone",,Nottingham,,NG7 7FN,Tel: 07903152537,No ratings yet Rate it yourself - /Services/careproviders/LeaveReview/DefaultView.aspx?id=1-8290133569,0,0,,
Total Healthcare Solutions Limited,1-4375860228,SCL,John Pye Serviced Offices,"Mercury House, Shipstones Business Centre",,Nottingham,,NG7 7FN,Tel: 07780001439,No ratings yet Rate it yourself - /Services/careproviders/LeaveReview/DefaultView.aspx?id=1-4375860228,0,0,,
DKM Healthcare Limited,1-2326072185,SCL,Mercury House,"Shipstones Business Centre, North Gate",,Nottingham,Nottinghamshire,NG7 7FN,Tel: 07758649066,No ratings yet Rate it yourself - /Services/careproviders/LeaveReview/DefaultView.aspx?id=1-2326072185,0,0,,
Mercury House,1-12119731011,SCL,Shipstone Business Centre,North Gate,,Nottingham,,NG7 7FN,Tel: 01159648280,No ratings yet Rate it yourself - /Services/careproviders/LeaveReview/DefaultView.aspx?id=1-12119731011,0,0,,
JADE Healthcare Services,1-3698403318,SCL,Mercury House,"Shipstones Business Centre, North Gate",,Nottingham,Nottinghamshire,NG7 7FN,Tel: 01159648317,No ratings yet Rate it yourself - /Services/careproviders/LeaveReview/DefaultView.aspx?id=1-3698403318,0,0,,
Staycare Limited,1-17596428018,SCL,Mercury House,,,Nottingham,,NG7 7FN,Tel: 01156715523,No ratings yet Rate it yourself - /Services/careproviders/LeaveReview/DefaultView.aspx?id=1-17596428018,0,0,,
Peacemills Care Home,1-419642375,SCL,132 Perry Road,,,Nottingham,Nottinghamshire,NG5 3AH,Tel: 01159602539,No ratings yet Rate it yourself - /Services/careproviders/LeaveReview/DefaultView.aspx?id=1-419642375,0,0,,
M'kadesh Healthcare Ltd,1-12828883325,SCL,Leen Valley House,Cinderhill Road,,Nottingham,,NG6 8RE,Tel: 07464972611,No ratings yet Rate it yourself - /Services/careproviders/LeaveReview/DefaultView.aspx?id=1-12828883325,0,0,,
ATT Group Limited,1-13946238932,SCL,78 Harwill Crescent,,,Nottingham,,NG8 5LB,,No ratings yet Rate it yourself - /Services/careproviders/LeaveReview/DefaultView.aspx?id=1-13946238932,0,0,,
Park House,1-17883944866,SCL,Cinderhill Road,,,Nottingham,,NG6 8SB,Tel: 01159791234,No ratings yet Rate it yourself - /Services/careproviders/LeaveReview/DefaultView.aspx?id=1-17883944866,0,0,,
Plus Point Care Ltd,1-11904284665,SCL,Chelsea House,"Chelsea Street, New Basford",,Nottingham,,NG7 7HP,Tel: 01157483624,No ratings yet Rate it yourself - /Services/careproviders/LeaveReview/DefaultView.aspx?id=1-11904284665,0,0,,
Kharis Healthcare Ltd,1-2582259089,SCL,"Office 6, Storage King","Unit 1 Lewis Industrial Estate, Radford Road",,Nottingham,,NG7 7NQ,Tel: 07383088631,No ratings yet Rate it yourself - /Services/careproviders/LeaveReview/DefaultView.aspx?id=1-2582259089,0,0,,
Living Well Social Care Services Ltd,1-15554192435,SCL,Unit 1,"Lewis Industrial Estate, Radford Road",,Nottingham,,NG7 7NQ,Tel: 07443163220,No ratings yet Rate it yourself - /Services/careproviders/LeaveReview/DefaultView.aspx?id=1-15554192435,0,0,,
Annabelle Care 2020 Ltd,1-9855549692,SCL,8 Coventry Road,,,Nottingham,,NG6 8RA,Tel: 07838174716,No ratings yet Rate it yourself - /Services/careproviders/LeaveReview/DefaultView.aspx?id=1-9855549692,0,0,,
Fairway View,1-2232775564,SCL,Swale Close,Bulwell,,Nottingham,Nottinghamshire,NG6 9LZ,Tel: 01159758778,No ratings yet Rate it yourself - /Services/careproviders/LeaveReview/DefaultView.aspx?id=1-2232775564,0,0,,
Milberry Care Agency,1-5203432545,SCL,92 Hilcot Drive,,,Nottingham,Nottinghamshire,NG8 5HS,Tel: 01157833493,No ratings yet Rate it yourself - /Services/careproviders/LeaveReview/DefaultView.aspx?id=1-5203432545,0,0,,
Caring Circle Limited,1-2438127431,SCL,Fairdale House,100 Nuthall Road,,Nottingham,Nottinghamshire,NG8 5AB,Tel: 01159298308,No ratings yet Rate it yourself - /Services/careproviders/LeaveReview/DefaultView.aspx?id=1-2438127431,0,0,,
Highfields Nursing Home,1-233717024,SCL,330 Highbury Road,Bulwell,,Nottingham,Nottinghamshire,NG6 9AF,Tel: 01159278847,No ratings yet Rate it yourself - /Services/careproviders/LeaveReview/DefaultView.aspx?id=1-233717024,0,0,,
West Lodge Care Home,1-9624405235,SCL,238 Hucknall Road,,,Nottingham,Nottinghamshire,NG5 1FB,Tel: 01159606075,No ratings yet Rate it yourself - /Services/careproviders/LeaveReview/DefaultView.aspx?id=1-9624405235,0,0,,
Winterfell Care Home,1-5783396824,SCL,23-29 Herbert Road,,,Nottingham,,NG5 1BS,Tel: 07944267002,No ratings yet Rate it yourself - /Services/careproviders/LeaveReview/DefaultView.aspx?id=1-5783396824,0,0,,
Devonshire Manor,1-112779616,SCL,2 Devonshire Road,Sherwood,,Nottingham,Nottinghamshire,NG5 2EW,Tel: 01159622538,No ratings yet Rate it yourself - /Services/careproviders/LeaveReview/DefaultView.aspx?id=1-112779616,0,0,,
Hawthorn Lodge Care Home,1-462824183,SCL,Beckhampton Road,Bestwood Park,,Nottingham,Nottinghamshire,NG5 5LF,Tel: 01159676735,No ratings yet Rate it yourself - /Services/careproviders/LeaveReview/DefaultView.aspx?id=1-462824183,0,0,,
514 Arnold Road,1-129460432,SCL,Bestwood,,,Nottingham,Nottinghamshire,NG5 5HN,Tel: 01159608091,No ratings yet Rate it yourself - /Services/careproviders/LeaveReview/DefaultView.aspx?id=1-129460432,0,0,,
Carrington House Care Home,1-13007562953,SCL,25 Mayo Road,,,Nottingham,Nottinghamshire,NG5 1BL,,No ratings yet Rate it yourself - /Services/careproviders/LeaveReview/DefaultView.aspx?id=1-13007562953,0,0,,
Nottingham Mencap Short Breaks Service,1-115772831,SCL,Harpenden House,"203 Edwards Lane, Sherwood",,Nottingham,Nottinghamshire,NG5 3JA,Tel: 01159204433,No ratings yet Rate it yourself - /Services/careproviders/LeaveReview/DefaultView.aspx?id=1-115772831,0,0,,
Beechwood,1-128953086,SCL,60 Burlington Road,Sherwood,,Nottingham,Nottinghamshire,NG5 2GS,Tel: 01159245893,No ratings yet Rate it yourself - /Services/careproviders/LeaveReview/DefaultView.aspx?id=1-128953086,0,0,,
Belvoir Lodge,1-4658761316,SCL,243 Edwards Lane,,,Nottingham,Nottinghamshire,NG5 6EQ,Tel: 01159679287,No ratings yet Rate it yourself - /Services/careproviders/LeaveReview/DefaultView.aspx?id=1-4658761316,0,0,,
Oxclose Lodge,1-4659619288,SCL,231 Edwards Lane,,,Nottingham,Nottinghamshire,NG5 6EQ,Tel: 01159269617,No ratings yet Rate it yourself - /Services/careproviders/LeaveReview/DefaultView.aspx?id=1-4659619288,0,0,,
Burlington Villa,1-118269753,SCL,15 Burlington Villa,Sherwood,,Nottingham,Nottinghamshire,NG5 2GR,Tel: 01159602738,No ratings yet Rate it yourself - /Services/careproviders/LeaveReview/DefaultView.aspx?id=1-118269753,0,0,,
Links Healthcare,1-18735705381,SCL,31 Bakewell Drive,,,Nottingham,,NG5 9AB,Tel: 07899221417,No ratings yet Rate it yourself - /Services/careproviders/LeaveReview/DefaultView.aspx?id=1-18735705381,0,0,,
"Inner City Care, Lancaster House",1-5506511765,SCL,10 Sherwood Rise,,,Nottingham,,NG7 6JE,Tel: 01158561140,1 rating Rate it yourself - /Services/careproviders/LeaveReview/DefaultView.aspx?id=1-5506511765,,,,
Word of Mouth Care Ltd,1-14444746610,SCL,"Unit 4, Lancaster House",10 Sherwood Rise,,Nottingham,,NG7 6JE,Tel: 01158222144,No ratings yet Rate it yourself - /Services/careproviders/LeaveReview/DefaultView.aspx?id=1-14444746610,0,0,,
Roxy Care Group Ltd,1-15259751559,SCL,110a,Hucknall Road,,Nottingham,,NG5 1AD,,No ratings yet Rate it yourself - /Services/careproviders/LeaveReview/DefaultView.aspx?id=1-15259751559,0,0,,
Acer Court Care Home,1-319747838,SCL,172 Nottingham Road,,,Nuthall,Nottinghamshire,NG8 6AX,Tel: 01159777370,No ratings yet Rate it yourself - /Services/careproviders/LeaveReview/DefaultView.aspx?id=1-319747838,0,0,,
Alder House Care Home,1-1763259648,SCL,172a Nottingham Road,Nuthall,,Nottingham,Nottinghamshire,NG8 6AX,Tel: 01159758110,No ratings yet Rate it yourself - /Services/careproviders/LeaveReview/DefaultView.aspx?id=1-1763259648,0,0,,
Gregory Court,1-131764900,SCL,Noel Street,Hyson Green,,Nottingham,Nottinghamshire,NG7 6AJ,Tel: 01159790750,No ratings yet Rate it yourself - /Services/careproviders/LeaveReview/DefaultView.aspx?id=1-131764900,0,0,,
Ashleigh House,1-120713148,SCL,18-20 Devon Drive,Sherwood,,Nottingham,Nottinghamshire,NG5 2EN,Tel: 01159691165,No ratings yet Rate it yourself - /Services/careproviders/LeaveReview/DefaultView.aspx?id=1-120713148,0,0,,
2-4 Watcombe Circus,1-2008594006,SCL,2-4 Watcombe Circus,Carrington,,Nottingham,Nottinghamshire,NG5 2DT,Tel: 01159609592,No ratings yet Rate it yourself - /Services/careproviders/LeaveReview/DefaultView.aspx?id=1-2008594006,0,0,,
Diverse Home Care Ltd,1-3531088197,SCL,First Enterprise Business Agency,6 Sherwood Rise,,Nottingham,Nottinghamshire,NG7 6JF,Tel: 01159620998,No ratings yet Rate it yourself - /Services/careproviders/LeaveReview/DefaultView.aspx?id=1-3531088197,0,0,,
SPX Healthcare Solutions - Main Office,1-17892416823,SCL,Unit 1,"Tudor Court, Banks Yard",,Nottingham,,NG6 8FE,Tel: 01156776450,No ratings yet Rate it yourself - /Services/careproviders/LeaveReview/DefaultView.aspx?id=1-17892416823,0,0,,
Ascot House - Nottingham,1-120713174,SCL,30-40 Percival Road,Sherwood,,Nottingham,Nottinghamshire,NG5 2EY,Tel: 01159606506,No ratings yet Rate it yourself - /Services/careproviders/LeaveReview/DefaultView.aspx?id=1-120713174,0,0,,
Acorn House,1-1305105437,SCL,1 Oak Street,,,Nottingham,Nottinghamshire,NG5 2AT,Tel: 01159605981,No ratings yet Rate it yourself - /Services/careproviders/LeaveReview/DefaultView.aspx?id=1-1305105437,0,0,,
Carrington Park,1-1042689019,SCL,2 Clinton Avenue,,,Nottingham,Nottinghamshire,NG5 1AW,Tel: 01159624949,No ratings yet Rate it yourself - /Services/careproviders/LeaveReview/DefaultView.aspx?id=1-1042689019,0,0,,
Archangel Home Care,1-2110474820,SCL,Hamilton House,9 Hucknall Road,,Nottingham,Nottinghamshire,NG5 1AE,Tel: 01156977877,No ratings yet Rate it yourself - /Services/careproviders/LeaveReview/DefaultView.aspx?id=1-2110474820,0,0,,
Gregory House II,1-6086402282,SCL,391-393,Mansfield Road,,Nottingham,,NG5 2DG,Tel: 01158412713,No ratings yet Rate it yourself - /Services/careproviders/LeaveReview/DefaultView.aspx?id=1-6086402282,0,0,,
Crossroads Care East Midlands - Nottingham Office,1-133394328,SCL,19 Pelham Road,Sherwood,,Nottingham,Nottinghamshire,NG5 1AP,Tel: 07496778701,No ratings yet Rate it yourself - /Services/careproviders/LeaveReview/DefaultView.aspx?id=1-133394328,0,0,,
Personalised Support Team - Nottingham,1-2008593638,SCL,12-14 Pelham Road,Sherwood Rise,,Nottingham,,NG5 1AP,Tel: 08451960061,No ratings yet Rate it yourself - /Services/careproviders/LeaveReview/DefaultView.aspx?id=1-2008593638,0,0,,
Space Inclusive LTD,1-16282178295,SCL,20 Pelham Road,,,Nottingham,,NG5 1AP,Tel: 07734390887,No ratings yet Rate it yourself - /Services/careproviders/LeaveReview/DefaultView.aspx?id=1-16282178295,0,0,,
Melbourne House,1-17883945666,SCL,Grannis Drive,Aspley,,Nottingham,Nottinghamshire,NG8 5RU,Tel: 01159292784,No ratings yet Rate it yourself - /Services/careproviders/LeaveReview/DefaultView.aspx?id=1-17883945666,0,0,,
Heart Led Homecare (Nottingham),1-10443906376,SCL,Sherwood Business Centre 616a-618a,Mansfield Road,,Nottingham,,NG5 2GA,Tel: 01158543812,No ratings yet Rate it yourself - /Services/careproviders/LeaveReview/DefaultView.aspx?id=1-10443906376,0,0,,
Sherwood Therapy Services,1-10392947960,SCL,Sherwood Business Centre 616a-618a,Mansfield Road,,Nottingham,,NG5 2GA,Tel: 01158500433,No ratings yet Rate it yourself - /Services/careproviders/LeaveReview/DefaultView.aspx?id=1-10392947960,0,0,,
Right at Home Nottingham North,1-12896853885,SCL,616 -618 Mansfield Road,,,Nottingham,,NG5 2GA,Tel: 07786213817,No ratings yet Rate it yourself - /Services/careproviders/LeaveReview/DefaultView.aspx?id=1-12896853885,0,0,,
Westminster Homecare Ltd (Nottingham),1-253032704,SCL,"Foxhall Lodge, Rooms FF13 & FF14",Foxhall Road,,Nottingham,,NG7 6LH,Tel: 01159821331,No ratings yet Rate it yourself - /Services/careproviders/LeaveReview/DefaultView.aspx?id=1-253032704,0,0,,
APT Care Nottingham,1-1928544071,SCL,"Room FF21, Suite 17","Foxhall Lodge, Gregory Boulevard",,Nottingham,,NG7 6LH,Tel: 01157860720,No ratings yet Rate it yourself - /Services/careproviders/LeaveReview/DefaultView.aspx?id=1-1928544071,0,0,,
Primetime Care Services Ltd,1-14280269297,SCL,Foxhall Business Centre,Foxhall Road,,Nottingham,Nottinghamshire,NG7 6LH,,No ratings yet Rate it yourself - /Services/careproviders/LeaveReview/DefaultView.aspx?id=1-14280269297,0,0,,
Amity Care,1-6671770900,SCL,Foxhall Lodge,Foxhall Road,,Nottingham,Nottinghamshire,NG7 6LH,Tel: 07376040205,No ratings yet Rate it yourself - /Services/careproviders/LeaveReview/DefaultView.aspx?id=1-6671770900,0,0,,
Clarendon Court Care Home,1-4404879583,SCL,13-15 Clumber Avenue,Sherwood Rise,,Nottingham,Nottinghamshire,NG5 1AG,Tel: 01159691681,1 rating Rate it yourself - /Services/careproviders/LeaveReview/DefaultView.aspx?id=1-4404879583,,,,
Clarendon Court Nursing Home,1-13941790925,SCL,15 Clumber Avenue,Sherwood Rise,,Nottingham,,NG5 1AG,Tel: 07480142840,No ratings yet Rate it yourself - /Services/careproviders/LeaveReview/DefaultView.aspx?id=1-13941790925,0,0,,
Kingsbury House Limited,1-2703261060,SCL,103-105 Mansfield Street,,,Nottingham,,NG5 4BH,Tel: 01159552917,No ratings yet Rate it yourself - /Services/careproviders/LeaveReview/DefaultView.aspx?id=1-2703261060,0,0,,
Nottingham Regional Office,1-243639548,SCL,11 Fox End,Lloyd Street,,Nottingham,Nottinghamshire,NG5 4BX,Tel: 03300240039,1 rating Rate it yourself - /Services/careproviders/LeaveReview/DefaultView.aspx?id=1-243639548,,,,
Sherwood,1-9827720841,SCL,8 First Avenue,,,Nottingham,Nottinghamshire,NG7 6JL,Tel: 07885203712,No ratings yet Rate it yourself - /Services/careproviders/LeaveReview/DefaultView.aspx?id=1-9827720841,0,0,,
Sandwood Care Home,1-137749727,SCL,700 Mansfield Road,Sherwood,,Nottingham,Nottinghamshire,NG5 3FS,Tel: 01159531123,No ratings yet Rate it yourself - /Services/careproviders/LeaveReview/DefaultView.aspx?id=1-137749727,0,0,,
Glee Care Ltd - Nottingham,1-17430588854,SCL,7 Gregory Boulevard,"Sherwood House, Forest Fields",,Nottingham,,NG7 6LB,Tel: 07886483479,No ratings yet Rate it yourself - /Services/careproviders/LeaveReview/DefaultView.aspx?id=1-17430588854,0,0,,
Involved Care Ltd,1-11314332601,SCL,"Office 1, Jarodale House",7 Gregory Boulevard,,Nottingham,,NG7 6LB,Tel: 01157837561,No ratings yet Rate it yourself - /Services/careproviders/LeaveReview/DefaultView.aspx?id=1-11314332601,0,0,,
Ace Care 4 U Limited,1-1603596214,SCL,Jarodale House,7 Gregory Boulevard,,Nottingham,Nottinghamshire,NG7 6LB,Tel: 01159705832,1 rating Rate it yourself - /Services/careproviders/LeaveReview/DefaultView.aspx?id=1-1603596214,,,,
Servis Personnel,1-15069786999,SCL,Sherwood house,7 Gregory Boulevard,,Nottingham,Nottinghamshire,NG7 6LB,Tel: 01156713555,No ratings yet Rate it yourself - /Services/careproviders/LeaveReview/DefaultView.aspx?id=1-15069786999,0,0,,
Safe Sanctuary Living Ltd,1-10232991068,SCL,Ground Floor,3.3 Clarendon Park Clumber Ave,,Nottingham,,NG5 1AH,Tel: 07841000907,No ratings yet Rate it yourself - /Services/careproviders/LeaveReview/DefaultView.aspx?id=1-10232991068,0,0,,
JRH Support - Head Office,1-115091774,SCL,Clarendon House,Clarendon Park,,Nottingham,Nottinghamshire,NG5 1AH,Tel: 0115 9856000,No ratings yet Rate it yourself - /Services/careproviders/LeaveReview/DefaultView.aspx?id=1-115091774,0,0,,
Topview Healthcare Ltd,1-16858860252,SCL,79 Fenwick Road,,,Nottingham,,NG8 6FU,Tel: 01159771585,No ratings yet Rate it yourself - /Services/careproviders/LeaveReview/DefaultView.aspx?id=1-16858860252,0,0,,