Organisation Name,NACS Code,Organisation Type,Address1,Address2,Address3,Address4,Address5,PostCode,Telephone Number,NHS.UK users rating,Value  (NHS.UK users rating),Banding Classification  (NHS.UK users rating),Car parking (Is there car parking at this organisation?),Disabled access (Disabled access)
Ellacombe,1-285856030,SCL,Ella Road,,,Norwich,Norfolk,NR1 4BP,Tel: 01603519730,No ratings yet Rate it yourself - /Services/careproviders/LeaveReview/DefaultView.aspx?id=1-285856030,0,0,,
Hillcrest,1-307297341,SCL,106 Thorpe Road,Thorpe,,Norwich,Norfolk,NR1 1RT,Tel: 01603626073,No ratings yet Rate it yourself - /Services/careproviders/LeaveReview/DefaultView.aspx?id=1-307297341,0,0,,
Availl (Norwich),1-2747753362,SCL,The Union Building,51-59 Rose Lane,,Norwich,Norfolk,NR1 1BY,Tel: 01603633999,No ratings yet Rate it yourself - /Services/careproviders/LeaveReview/DefaultView.aspx?id=1-2747753362,0,0,,
First Choice Home Care (Norwich),1-8606627372,SCL,"First Floor, 2 Barton Way",,,Norwich,,NR1 1DL,Tel: 01603980394,No ratings yet Rate it yourself - /Services/careproviders/LeaveReview/DefaultView.aspx?id=1-8606627372,0,0,,
Trust Care Agency,1-1924575673,SCL,Rouen House,Rouen Road,,Norwich,Norfolk,NR1 1RB,Tel: 01603617770,No ratings yet Rate it yourself - /Services/careproviders/LeaveReview/DefaultView.aspx?id=1-1924575673,0,0,,
Sterling House,1-12737823598,SCL,150-152 Thorpe Road,,,Norwich,,NR1 1GT,Tel: 01603573591,No ratings yet Rate it yourself - /Services/careproviders/LeaveReview/DefaultView.aspx?id=1-12737823598,0,0,,
LUMINOUS DOMICILIARY CARE LTD,1-15153339060,SCL,36 Ber Street,,,Norwich,,NR1 3EW,Tel: 07960879777,No ratings yet Rate it yourself - /Services/careproviders/LeaveReview/DefaultView.aspx?id=1-15153339060,0,0,,
Nouveau Care,1-2446555592,SCL,,125 Ber Street,,Norwich,Norfolk,NR1 3EY,Tel: 01603765875,No ratings yet Rate it yourself - /Services/careproviders/LeaveReview/DefaultView.aspx?id=1-2446555592,0,0,,
The Great Hospital Domiciliary Service,1-108725481,SCL,Bishopgate,,,Norwich,Norfolk,NR1 4EL,Tel: 01603622022,No ratings yet Rate it yourself - /Services/careproviders/LeaveReview/DefaultView.aspx?id=1-108725481,0,0,,
Roster Home Care Ltd - Norwich Office,1-13942632495,SCL,231 Queens Road,,,Norwich,,NR1 3AE,Tel: 01603323653,No ratings yet Rate it yourself - /Services/careproviders/LeaveReview/DefaultView.aspx?id=1-13942632495,0,0,,
Hales Group Limited - Norwich,1-4920880064,SCL,"First Floor, Jacquard House",Queen Street,,Norwich,Norfolk,NR2 4SX,Tel: 01603358639,No ratings yet Rate it yourself - /Services/careproviders/LeaveReview/DefaultView.aspx?id=1-4920880064,0,0,,
Corton House,1-108960738,SCL,City Road,,,Norwich,Norfolk,NR1 3AP,,No ratings yet Rate it yourself - /Services/careproviders/LeaveReview/DefaultView.aspx?id=1-108960738,0,0,,
Prestige Nursing Norwich,1-126673004,SCL,"Rooms 21 & 23, St Francis House",141-147 Queens Road,,Norwich,Norfolk,NR1 3PN,Tel: 01603666643,No ratings yet Rate it yourself - /Services/careproviders/LeaveReview/DefaultView.aspx?id=1-126673004,0,0,,
Harvey Lane,1-132648081,SCL,9 Harvey Lane,,,Norwich,Norfolk,NR7 0BG,Tel: 01603304655,No ratings yet Rate it yourself - /Services/careproviders/LeaveReview/DefaultView.aspx?id=1-132648081,0,0,,
NCC Swift Response,1-2851011277,SCL,County Hall,Martineau Lane,,Norwich,Norfolk,NR1 2SQ,Tel: 03448008020,No ratings yet Rate it yourself - /Services/careproviders/LeaveReview/DefaultView.aspx?id=1-2851011277,0,0,,
Nightingale Homecare Norfolk (Norwich),1-7497763271,SCL,3 & 4 Taverners Square,Silver Road,,Norwich,,NR3 4SY,Tel: 01603516498,No ratings yet Rate it yourself - /Services/careproviders/LeaveReview/DefaultView.aspx?id=1-7497763271,0,0,,
Doughty's,1-124951805,SCL,Golden Dog Lane,,,Norwich,Norfolk,NR3 1BP,Tel: 01603621857,No ratings yet Rate it yourself - /Services/careproviders/LeaveReview/DefaultView.aspx?id=1-124951805,0,0,,
Harriet Court,1-285222208,SCL,off Stratford Drive,Lakenham,,Norwich,Norfolk,NR1 2DG,Tel: 01603766184,No ratings yet Rate it yourself - /Services/careproviders/LeaveReview/DefaultView.aspx?id=1-285222208,0,0,,
CNS Norfolk,1-18681583465,SCL,"Suite 305, Sackville Place 44-48",Magdalen Street,,Norwich,,NR3 1JU,,No ratings yet Rate it yourself - /Services/careproviders/LeaveReview/DefaultView.aspx?id=1-18681583465,0,0,,
Mimarcare Ltd,1-17708801583,SCL,"Suite 10, Ground Floor, Sackville Place Business Centre",44-48 Magdalen Street,,Norwich,,NR3 1JU,Tel: 01603213830,No ratings yet Rate it yourself - /Services/careproviders/LeaveReview/DefaultView.aspx?id=1-17708801583,0,0,,
Prevail Healthcare,1-9256166519,SCL,Sackville Place 44-48,Magdalen Street,,Norwich,,NR3 1JU,Tel: 01603393515,No ratings yet Rate it yourself - /Services/careproviders/LeaveReview/DefaultView.aspx?id=1-9256166519,0,0,,
Ur Choice Care Limited,1-418831695,SCL,"Suite 215b, Sackville Place Business Centre",44-48 Magdalen Street,,Norwich,Norfolk,NR3 1JU,,No ratings yet Rate it yourself - /Services/careproviders/LeaveReview/DefaultView.aspx?id=1-418831695,0,0,,
Connect Nursing Norwich,1-17942218542,SCL,"Cavell House & Austin House, Stannard Place St",St Crispins Rd,,Norwich,,NR3 1YE,Tel: 01603821000,No ratings yet Rate it yourself - /Services/careproviders/LeaveReview/DefaultView.aspx?id=1-17942218542,0,0,,
Eagles Recruitment and Healthcare,1-2276565350,SCL,Cavell House,"Stannard Place, Saint Crispins Road",,Norwich,Norfolk,NR3 1YE,Tel: 01603514202,No ratings yet Rate it yourself - /Services/careproviders/LeaveReview/DefaultView.aspx?id=1-2276565350,0,0,,
Webster Court,1-2091599951,SCL,13-49 Lakenfields,,,Norwich,Norfolk,NR1 2HB,Tel: 01603699100,No ratings yet Rate it yourself - /Services/careproviders/LeaveReview/DefaultView.aspx?id=1-2091599951,0,0,,
Swanton Community Support,1-126596987,SCL,Treeview Court,Crome Road,,Norwich,Norfolk,NR3 4SL,Tel: 01603285205,No ratings yet Rate it yourself - /Services/careproviders/LeaveReview/DefaultView.aspx?id=1-126596987,0,0,,
Highwater House,1-119736051,SCL,104 Westwick Street,,,Norwich,Norfolk,NR2 4SZ,Tel: 01603766627,No ratings yet Rate it yourself - /Services/careproviders/LeaveReview/DefaultView.aspx?id=1-119736051,0,0,,
The Hamlet Charity,1-11881603489,SCL,Head Office,Johnson Place,,Norwich,,NR2 1SJ,Tel: 01603215193,No ratings yet Rate it yourself - /Services/careproviders/LeaveReview/DefaultView.aspx?id=1-11881603489,0,0,,
Thomas Tawell House,1-13975860644,SCL,106 Magpie Road,,,Norwich,Norfolk,NR3 1JH,Tel: 01603767526,No ratings yet Rate it yourself - /Services/careproviders/LeaveReview/DefaultView.aspx?id=1-13975860644,0,0,,
Bishop Herbert House,1-285666240,SCL,34 Globe Place,,,Norwich,Norfolk,NR2 2SG,Tel: 01603620710,No ratings yet Rate it yourself - /Services/careproviders/LeaveReview/DefaultView.aspx?id=1-285666240,0,0,,
Leaf Care Services,1-154608314,SCL,Unit 4 - St Benedicts View,Grapes Hill,,Norwich,,NR2 4HH,Tel: 01603618111,No ratings yet Rate it yourself - /Services/careproviders/LeaveReview/DefaultView.aspx?id=1-154608314,0,0,,
Floating Support City,1-1207619156,SCL,95 Oak Street,,,Norwich,,NR3 3BP,Tel: 01603222874,No ratings yet Rate it yourself - /Services/careproviders/LeaveReview/DefaultView.aspx?id=1-1207619156,0,0,,
Heathcote,1-121489527,SCL,19-23 Unthank Road,,,Norwich,Norfolk,NR2 2PA,Tel: 01603625639,No ratings yet Rate it yourself - /Services/careproviders/LeaveReview/DefaultView.aspx?id=1-121489527,0,0,,
Point House,1-108755718,SCL,Sprowston Road,,,Norwich,Norfolk,NR3 4QN,Tel: 01603427249,No ratings yet Rate it yourself - /Services/careproviders/LeaveReview/DefaultView.aspx?id=1-108755718,0,0,,
Cromwell House,1-117965487,SCL,Cecil Road,,,Norwich,Norfolk,NR1 2QJ,Tel: 01603625961,No ratings yet Rate it yourself - /Services/careproviders/LeaveReview/DefaultView.aspx?id=1-117965487,0,0,,
Helping Hands Norwich,1-2116779083,SCL,107 Dereham Road,,,Norwich,Norfolk,NR2 4HT,Tel: 01603510005,No ratings yet Rate it yourself - /Services/careproviders/LeaveReview/DefaultView.aspx?id=1-2116779083,0,0,,
Laurel Lodge Care Home,1-2781038298,SCL,19 Ipswich Road,,,Norwich,Norfolk,NR2 2LN,Tel: 01603502371,No ratings yet Rate it yourself - /Services/careproviders/LeaveReview/DefaultView.aspx?id=1-2781038298,0,0,,
Insignia Healthcare (Norwich),1-2318854734,SCL,10-14 Plumstead Road East,Thorpe St. Andrew,,Norwich,Norfolk,NR7 9NE,Tel: 01603952626,No ratings yet Rate it yourself - /Services/careproviders/LeaveReview/DefaultView.aspx?id=1-2318854734,0,0,,
St John's House,1-3043099426,SCL,Heigham Road,,,Norwich,Norfolk,NR2 3AT,Tel: 01603299000,No ratings yet Rate it yourself - /Services/careproviders/LeaveReview/DefaultView.aspx?id=1-3043099426,0,0,,
Livability John Grooms Court,1-119324927,SCL,215 Sprowston Road,,,Norwich,Norfolk,NR3 4HX,Tel: 01603429400,No ratings yet Rate it yourself - /Services/careproviders/LeaveReview/DefaultView.aspx?id=1-119324927,0,0,,
Fisher Healthcare East Anglia - Norwich,1-4598280870,SCL,79A Gordon Avenue,,,Norwich,,NR7 0DR,Tel: 01603612307,No ratings yet Rate it yourself - /Services/careproviders/LeaveReview/DefaultView.aspx?id=1-4598280870,0,0,,
Whitehall Lodge Residential Home,1-112953837,SCL,56-112 Whitehall Road,,,Norwich,Norfolk,NR2 3EW,Tel: 01603618332,No ratings yet Rate it yourself - /Services/careproviders/LeaveReview/DefaultView.aspx?id=1-112953837,0,0,,
Love to Care Home Care Norfolk,1-17935233357,SCL,"Norwich, 154 Dereham Road",,,Norwich,,NR2 3AB,Tel: 01603328328,No ratings yet Rate it yourself - /Services/careproviders/LeaveReview/DefaultView.aspx?id=1-17935233357,0,0,,
Mountfield,1-285970660,SCL,Millcroft,,,Norwich,Norfolk,NR3 3LS,Tel: 01603576180,No ratings yet Rate it yourself - /Services/careproviders/LeaveReview/DefaultView.aspx?id=1-285970660,0,0,,
Your Priority Healthcare Limited,1-14837806945,SCL,Ropemakers Row,,,Norwich,,NR3 2DG,Tel: 07846410347,No ratings yet Rate it yourself - /Services/careproviders/LeaveReview/DefaultView.aspx?id=1-14837806945,0,0,,
Chiswick House,1-121489513,SCL,3 Christchurch Road,,,Norwich,Norfolk,NR2 2AD,Tel: 01603507111,No ratings yet Rate it yourself - /Services/careproviders/LeaveReview/DefaultView.aspx?id=1-121489513,0,0,,
Cascade (Moore House),1-15876953720,SCL,55 Mousehold Lane,,,Norwich,,NR7 8HL,,No ratings yet Rate it yourself - /Services/careproviders/LeaveReview/DefaultView.aspx?id=1-15876953720,0,0,,
Mousehold View Care Home,1-17710168488,SCL,28,Mousehold Lane,,Norwich,,NR7 8HE,Tel: 01603550021,No ratings yet Rate it yourself - /Services/careproviders/LeaveReview/DefaultView.aspx?id=1-17710168488,0,0,,
The Hawthorns Care Home,1-310528556,SCL,270 Unthank Road,,,Norwich,Norfolk,NR2 2AJ,Tel: 01603452302,No ratings yet Rate it yourself - /Services/careproviders/LeaveReview/DefaultView.aspx?id=1-310528556,0,0,,
The Home Team,1-10019352865,SCL,"Unit 2, Bixley Manor",,,Norwich,,NR14 8SJ,Tel: 01603926465,No ratings yet Rate it yourself - /Services/careproviders/LeaveReview/DefaultView.aspx?id=1-10019352865,0,0,,
Woodside House,1-125862038,SCL,Woodside Road,,,Norwich,Norfolk,NR7 9XJ,Tel: 01603702002,No ratings yet Rate it yourself - /Services/careproviders/LeaveReview/DefaultView.aspx?id=1-125862038,0,0,,
Kemps Place,1-2866962136,SCL,Rackham Road,,,Norwich,Norfolk,NR3 3JQ,Tel: 01603301090,No ratings yet Rate it yourself - /Services/careproviders/LeaveReview/DefaultView.aspx?id=1-2866962136,0,0,,
Talbot Care Services Ltd,1-14390315764,SCL,13-15 Constitution Hill,,,Norwich,Norfolk,NR3 4HA,Tel: 01603789450,No ratings yet Rate it yourself - /Services/careproviders/LeaveReview/DefaultView.aspx?id=1-14390315764,0,0,,
TCOU at Home Ltd,1-13879248557,SCL,20 Spinney Close,,,Norwich,,NR7 0PN,Tel: 07368378612,No ratings yet Rate it yourself - /Services/careproviders/LeaveReview/DefaultView.aspx?id=1-13879248557,0,0,,
Norfolk Affinity Care Services Ltd,1-9660469853,SCL,4-6 Belmore Road,Belmore Business Centre,,Norwich,,NR7 0PT,Tel: 07540778571,No ratings yet Rate it yourself - /Services/careproviders/LeaveReview/DefaultView.aspx?id=1-9660469853,0,0,,
St Clements Nursing Home,1-393508228,SCL,170 St Clements Hill,,,Norwich,Norfolk,NR3 4DG,Tel: 01603 851890,No ratings yet Rate it yourself - /Services/careproviders/LeaveReview/DefaultView.aspx?id=1-393508228,0,0,,
Better Oasis Limited,1-15006866913,SCL,Sapphire House,Roundtree Way,,Norwich,Norfolk,NR7 8SQ,Tel: 01603380339,No ratings yet Rate it yourself - /Services/careproviders/LeaveReview/DefaultView.aspx?id=1-15006866913,0,0,,
Larchwood House,1-1053988796,SCL,133 Yarmouth Road,Thorpe St Andrew,,Norwich,Norfolk,NR7 0RF,Tel: 01603 437358,No ratings yet Rate it yourself - /Services/careproviders/LeaveReview/DefaultView.aspx?id=1-1053988796,0,0,,
Gryphon Place,1-126608087,SCL,36 Wroxham Road,Sprowston,,Norwich,Norfolk,NR7 8TY,Tel: 01603406351,No ratings yet Rate it yourself - /Services/careproviders/LeaveReview/DefaultView.aspx?id=1-126608087,0,0,,
Caremark Norwich,1-2793556667,SCL,147 Yarmouth Road,,,Norwich,Norfolk,NR7 0SA,Tel: 01603433855,No ratings yet Rate it yourself - /Services/careproviders/LeaveReview/DefaultView.aspx?id=1-2793556667,0,0,,
Broadland View Care Home,1-883965855,SCL,147 Yarmouth Road,Thorpe St Andrew,,Norwich,Norfolk,NR7 0SA,Tel: 01603 432050,No ratings yet Rate it yourself - /Services/careproviders/LeaveReview/DefaultView.aspx?id=1-883965855,0,0,,
TAMA75,1-11910767167,SCL,4 Stannard Road,,,Norwich,,NR4 7JD,Tel: 07735033072,No ratings yet Rate it yourself - /Services/careproviders/LeaveReview/DefaultView.aspx?id=1-11910767167,0,0,,
Westminster Homecare Limited (Norwich),1-126215619,SCL,Melbourne House,Arminghall Close,,Norwich,Norfolk,NR3 3UE,Tel: 01603466801,No ratings yet Rate it yourself - /Services/careproviders/LeaveReview/DefaultView.aspx?id=1-126215619,0,0,,
All Day Care Services Ltd,1-11902766170,SCL,7 Briar Court,Guardian Road,,Norwich,,NR5 8PR,,No ratings yet Rate it yourself - /Services/careproviders/LeaveReview/DefaultView.aspx?id=1-11902766170,0,0,,
Bay Tree House,1-9823802251,SCL,423 Unthank Road,,,Norwich,Norfolk,NR4 7QB,Tel: 01603503528,No ratings yet Rate it yourself - /Services/careproviders/LeaveReview/DefaultView.aspx?id=1-9823802251,0,0,,
The Warren,1-125862803,SCL,157a Wroxham Road,Sprowston,,Norwich,Norfolk,NR7 8AF,Tel: 01603426170,No ratings yet Rate it yourself - /Services/careproviders/LeaveReview/DefaultView.aspx?id=1-125862803,0,0,,
Nursing Care Personnel Ltd (Norwich),1-12993313317,SCL,Henderson Business Centre,51 Ivy Road,,Norwich,Norfolk,NR5 8BF,Tel: 07946618367,No ratings yet Rate it yourself - /Services/careproviders/LeaveReview/DefaultView.aspx?id=1-12993313317,0,0,,
Ivy Court,1-2095121638,SCL,Ivy Road,,,Norwich,Norfolk,NR5 8BF,Tel: 08082020478,No ratings yet Rate it yourself - /Services/careproviders/LeaveReview/DefaultView.aspx?id=1-2095121638,0,0,,
Errand Plus and Personal Services,1-11516715595,SCL,Suite 3 Henderson Business Centre,51 Ivy Road,,Norwich,,NR5 8BF,Tel: 01603319998,No ratings yet Rate it yourself - /Services/careproviders/LeaveReview/DefaultView.aspx?id=1-11516715595,0,0,,
Dussindale Park,1-310512463,SCL,26 Mary Chapman Close,Dussindale,,Norwich,Norfolk,NR7 0UD,Tel: 01603701900,No ratings yet Rate it yourself - /Services/careproviders/LeaveReview/DefaultView.aspx?id=1-310512463,0,0,,
Mary Chapman Court,1-310528504,SCL,Mary Chapman Close,Dussindale,,Norwich,Norfolk,NR7 0UD,Tel: 01603701188,No ratings yet Rate it yourself - /Services/careproviders/LeaveReview/DefaultView.aspx?id=1-310528504,0,0,,
Dell Rose Court,1-285221782,SCL,Northfields,,,Norwich,Norfolk,NR4 7EL,Tel: 01603457868,No ratings yet Rate it yourself - /Services/careproviders/LeaveReview/DefaultView.aspx?id=1-285221782,0,0,,
Northfields,1-120634818,SCL,49a Northfields,West Earlham,,Norwich,Norfolk,NR4 7ES,Tel: 01603458865,No ratings yet Rate it yourself - /Services/careproviders/LeaveReview/DefaultView.aspx?id=1-120634818,0,0,,
Zera Healthcare Ltd,1-18968583567,SCL,Kirkham House Suite 227,5 Whiffler Road,,Norwich,,NR3 2AG,Tel: 01603579797,No ratings yet Rate it yourself - /Services/careproviders/LeaveReview/DefaultView.aspx?id=1-18968583567,0,0,,
UNIQUE DOMCARE LIMITED,1-18878541709,SCL,"Suite 204, Kirkham House",5 Whiffler Road,,Norwich,,NR3 2AG,Tel: 07359222121,No ratings yet Rate it yourself - /Services/careproviders/LeaveReview/DefaultView.aspx?id=1-18878541709,0,0,,
Callum House,1-119075456,SCL,234 Wroxham Road,Sprowston,,Norwich,Norfolk,NR7 8BE,,No ratings yet Rate it yourself - /Services/careproviders/LeaveReview/DefaultView.aspx?id=1-119075456,0,0,,
Klair House,1-118977359,SCL,236 Wroxham Road,Sprowston,,Norwich,Norfolk,NR7 8BE,,No ratings yet Rate it yourself - /Services/careproviders/LeaveReview/DefaultView.aspx?id=1-118977359,0,0,,
Church Green Lodge,1-1047798791,SCL,Aslake Close,,,Norwich,Norfolk,NR7 8ET,Tel: 01603411855,No ratings yet Rate it yourself - /Services/careproviders/LeaveReview/DefaultView.aspx?id=1-1047798791,0,0,,
Personal Assistant Services North,1-1047798885,SCL,c/o Sprowston Hub,Aslake Close,,Norwich,Norfolk,NR7 8ET,Tel: 07767384316,No ratings yet Rate it yourself - /Services/careproviders/LeaveReview/DefaultView.aspx?id=1-1047798885,0,0,,
Norwich Supported Living,1-1047798828,SCL,c/o Sprowston Hub,Aslake Close,,Norwich,Norfolk,NR7 8ET,Tel: 07767384316,No ratings yet Rate it yourself - /Services/careproviders/LeaveReview/DefaultView.aspx?id=1-1047798828,0,0,,
Purely Care,1-392556756,SCL,The Old Corner Shop,26 Cromer Road,,Norwich,Norfolk,NR6 6LZ,Tel: 01603407707,No ratings yet Rate it yourself - /Services/careproviders/LeaveReview/DefaultView.aspx?id=1-392556756,0,0,,
Home Instead (Norwich),1-450974018,SCL,Suite 7 Diamond House,Vulcan Road North,,Norwich,Norfolk,NR6 6AQ,Tel: 01603 963317,No ratings yet Rate it yourself - /Services/careproviders/LeaveReview/DefaultView.aspx?id=1-450974018,0,0,,
Clark James HomeCare - Norwich,1-1218812743,SCL,Suite 9 Diamond House,Vulcan Road North,,Norwich,,NR6 6AQ,Tel: 01603300364,No ratings yet Rate it yourself - /Services/careproviders/LeaveReview/DefaultView.aspx?id=1-1218812743,0,0,,
Nurseplus UK - Norwich,1-16403549598,SCL,Diamond House 8GF & 10GF,Vulcan Road North,,Norwich,,NR6 6AQ,Tel: 01603966801,No ratings yet Rate it yourself - /Services/careproviders/LeaveReview/DefaultView.aspx?id=1-16403549598,0,0,,
Your Life (Norwich),1-5745002639,SCL,Daisy Court,Bluebell Road,,Norwich,,NR4 7FL,Tel: 01603456328,No ratings yet Rate it yourself - /Services/careproviders/LeaveReview/DefaultView.aspx?id=1-5745002639,0,0,,
East Anglia Domiciliary Care Branch,1-805803869,SCL,"First Floor, 14 Alston Road",Hellesdon Park Road,,Norwich,Norfolk,NR6 5DS,Tel: 01603568266,No ratings yet Rate it yourself - /Services/careproviders/LeaveReview/DefaultView.aspx?id=1-805803869,0,0,,
NCC First Support - Norwich,1-7485807246,SCL,Reed House,"Peachman Way, Broadland Business Park",,Norwich,,NR7 0WF,Tel: 01603224060,No ratings yet Rate it yourself - /Services/careproviders/LeaveReview/DefaultView.aspx?id=1-7485807246,0,0,,
Hellesdon Bungalows,1-120690178,SCL,27 Sutherland Avenue,Hellesdon,,Norwich,Norfolk,NR6 5LN,Tel: 01603416340,No ratings yet Rate it yourself - /Services/careproviders/LeaveReview/DefaultView.aspx?id=1-120690178,0,0,,
Clarity Homecare Norwich,1-5469111509,SCL,33 Earlham West Centre,,,Norwich,Norfolk,NR5 8AD,Tel: 079 4270 0339,No ratings yet Rate it yourself - /Services/careproviders/LeaveReview/DefaultView.aspx?id=1-5469111509,0,0,,
Cera - Norwich,1-138948870,SCL,108 Hellesdon Park Industrial Estate,Off Drayton Park Road,,Norwich,Norfolk,NR6 5DR,Tel: 01603320360,No ratings yet Rate it yourself - /Services/careproviders/LeaveReview/DefaultView.aspx?id=1-138948870,0,0,,
Homestead House,1-113591055,SCL,281 St Faiths Road,Old Catton,,Norwich,Norfolk,NR6 7BQ,Tel: 01603486098,No ratings yet Rate it yourself - /Services/careproviders/LeaveReview/DefaultView.aspx?id=1-113591055,0,0,,
Redmayne View,1-285506838,SCL,Mountbatten Drive,Sprowston,,Norwich,Norfolk,NR6 7PX,Tel: 01603485374,No ratings yet Rate it yourself - /Services/careproviders/LeaveReview/DefaultView.aspx?id=1-285506838,0,0,,
Hill Grove,1-9823802459,SCL,1 Colney Lane,Cringleford,,Norwich,Norfolk,NR4 7RE,Tel: 01603504337,No ratings yet Rate it yourself - /Services/careproviders/LeaveReview/DefaultView.aspx?id=1-9823802459,0,0,,
Taylor Road,1-120634834,SCL,7a Taylor Road,West Earlham,,Norwich,Norfolk,NR5 8LZ,Tel: 01603259916,No ratings yet Rate it yourself - /Services/careproviders/LeaveReview/DefaultView.aspx?id=1-120634834,0,0,,
Broadlands Lodge Care Home,1-13976816487,SCL,Broadland Gate,Postwick,,Norwich,,NR13 5HB,,No ratings yet Rate it yourself - /Services/careproviders/LeaveReview/DefaultView.aspx?id=1-13976816487,0,0,,
Redlands House,1-4647172688,SCL,134 Reepham Road,,,Norwich,Norfolk,NR6 5PB,Tel: 01603427337,No ratings yet Rate it yourself - /Services/careproviders/LeaveReview/DefaultView.aspx?id=1-4647172688,0,0,,
Cavell Healthcare,1-5323800805,SCL,Atlas House,"Iceni Court, Delft Way",,Norwich,,NR6 6BB,Tel: 01603340044,No ratings yet Rate it yourself - /Services/careproviders/LeaveReview/DefaultView.aspx?id=1-5323800805,0,0,,
Middleton's Lane,1-14886166710,SCL,157 Middletons Lane,,,Norwich,Norfolk,NR6 5SF,Tel: 01603407138,No ratings yet Rate it yourself - /Services/careproviders/LeaveReview/DefaultView.aspx?id=1-14886166710,0,0,,
Compkey Healthcare Ltd,1-1924599784,SCL,"Fourways Community Centre, 116 Stevenson Road",,,Norwich,,NR5 8TN,Tel: 01603762318,No ratings yet Rate it yourself - /Services/careproviders/LeaveReview/DefaultView.aspx?id=1-1924599784,0,0,,
Bee Home Care Limited,1-13813363264,SCL,"Unit Four, Manor Farm Barns","Fox Road, Framingham Pigot",,Norwich,,NR14 7PZ,Tel: 01603331729,No ratings yet Rate it yourself - /Services/careproviders/LeaveReview/DefaultView.aspx?id=1-13813363264,0,0,,
Cascade (Charlton House),1-2237305576,SCL,331A Drayton High Road,,,Norwich,Norfolk,NR6 5AA,Tel: 01603405051,No ratings yet Rate it yourself - /Services/careproviders/LeaveReview/DefaultView.aspx?id=1-2237305576,0,0,,
Cascade (Cohen House),1-4620198719,SCL,55 Norwich Road,,,Norwich,Norfolk,NR5 0EQ,Tel: 01603479740,No ratings yet Rate it yourself - /Services/careproviders/LeaveReview/DefaultView.aspx?id=1-4620198719,0,0,,
Mayflower Court,1-2477944642,SCL,93 The Meadows,Ladysmock Way,,Norwich,Norfolk,NR5 9BF,Tel: 01603594060,No ratings yet Rate it yourself - /Services/careproviders/LeaveReview/DefaultView.aspx?id=1-2477944642,0,0,,
The Meadows Housing with Care Scheme,1-2478004785,SCL,1-92 The Meadows,Ladysmock Way,,Norwich,Norfolk,NR5 9BF,Tel: 01603594060,No ratings yet Rate it yourself - /Services/careproviders/LeaveReview/DefaultView.aspx?id=1-2478004785,0,0,,
Cavell Court,1-2104937207,SCL,140 Dragonfly Lane,Cringleford,,Norwich,Norfolk,NR4 7SW,Tel: 03333211980,No ratings yet Rate it yourself - /Services/careproviders/LeaveReview/DefaultView.aspx?id=1-2104937207,0,0,,
Pulms Limited,1-15628564012,SCL,27 Kingfisher Close,Cringleford,,Norwich,,NR4 7LL,,No ratings yet Rate it yourself - /Services/careproviders/LeaveReview/DefaultView.aspx?id=1-15628564012,0,0,,
Oakwood House Care Home,1-6790760223,SCL,Old Watton Road,Colney,,Norwich,Norfolk,NR4 7TP,Tel: 01603 250 101,No ratings yet Rate it yourself - /Services/careproviders/LeaveReview/DefaultView.aspx?id=1-6790760223,0,0,,
Woodland Care Home,1-310528595,SCL,189 Woodland Road,Hellesdon,,Norwich,Norfolk,NR6 5RQ,Tel: 01603787821,No ratings yet Rate it yourself - /Services/careproviders/LeaveReview/DefaultView.aspx?id=1-310528595,0,0,,
SMAT Healthcare Ltd,1-16380487955,SCL,33a Ashtree Road,,,Norwich,,NR5 0LR,Tel: 07947500350,No ratings yet Rate it yourself - /Services/careproviders/LeaveReview/DefaultView.aspx?id=1-16380487955,0,0,,
The Limes,1-710897801,SCL,16A Drayton Wood Road,Hellesdon,,Norwich,Norfolk,NR6 5BY,Tel: 01603427424,No ratings yet Rate it yourself - /Services/careproviders/LeaveReview/DefaultView.aspx?id=1-710897801,0,0,,