Organisation Name,NACS Code,Organisation Type,Address1,Address2,Address3,Address4,Address5,PostCode,Telephone Number,NHS.UK users rating,Value  (NHS.UK users rating),Banding Classification  (NHS.UK users rating),Car parking (Is there car parking at this organisation?),Disabled access (Disabled access)
The Moorings,1-819124104,SCL,Church Road,Earsham,,Bungay,Norfolk,NR35 2TJ,Tel: 01986 892269,No ratings yet Rate it yourself - /Services/careproviders/LeaveReview/DefaultView.aspx?id=1-819124104,0,0,,
St Mary's House,1-1977304044,SCL,54,Earsham Street,,Bungay,Suffolk,NR35 1AQ,Tel: 01986892444,No ratings yet Rate it yourself - /Services/careproviders/LeaveReview/DefaultView.aspx?id=1-1977304044,0,0,,
Holmwood Residential Home,1-1702992291,SCL,37 Upper Olland Street,,,Bungay,Suffolk,NR35 1BE,Tel: 01986892561,No ratings yet Rate it yourself - /Services/careproviders/LeaveReview/DefaultView.aspx?id=1-1702992291,0,0,,
Chevington Lodge,1-5437233141,SCL,6-8 Flixton Road,,,Bungay,,NR35 1HQ,Tel: 01986892710,No ratings yet Rate it yourself - /Services/careproviders/LeaveReview/DefaultView.aspx?id=1-5437233141,0,0,,
Lynfield,1-122586851,SCL,22 Norwich Road,Ditchingham,,Bungay,Suffolk,NR35 2JL,Tel: 01986897196,No ratings yet Rate it yourself - /Services/careproviders/LeaveReview/DefaultView.aspx?id=1-122586851,0,0,,
All Hallows Neuro Rehabilitation Centre,1-15653070797,SCL,Station Road,Ditchingham,,Bungay,Suffolk,NR35 2QL,Tel: 01986899688,No ratings yet Rate it yourself - /Services/careproviders/LeaveReview/DefaultView.aspx?id=1-15653070797,0,0,,
Bungay House,1-684153636,SCL,8 Yarmouth Road,Broome,,Bungay,Suffolk,NR35 2PE,Tel: 01986895270,No ratings yet Rate it yourself - /Services/careproviders/LeaveReview/DefaultView.aspx?id=1-684153636,0,0,,
Trees Nursing Home,1-13872490574,SCL,12 Candlers Lane,,,Harleston,Norfolk,IP20 9JA,Tel: 01379853919,No ratings yet Rate it yourself - /Services/careproviders/LeaveReview/DefaultView.aspx?id=1-13872490574,0,0,,
Harleston,1-12835381463,SCL,4 Stockyard Close,,,Harleston,,IP20 9FG,,No ratings yet Rate it yourself - /Services/careproviders/LeaveReview/DefaultView.aspx?id=1-12835381463,0,0,,
V&C Family Care Ltd,1-11135246917,SCL,4 Wilderness Close,,,Harleston,,IP20 9DB,Tel: 07857041698,No ratings yet Rate it yourself - /Services/careproviders/LeaveReview/DefaultView.aspx?id=1-11135246917,0,0,,
Saxlingham Hall Nursing Home,1-8526581733,SCL,The Green,Saxlingham Nethergate,,Norwich,Norfolk,NR15 1TH,Tel: 01508499225,1 rating Rate it yourself - /Services/careproviders/LeaveReview/DefaultView.aspx?id=1-8526581733,,,,
Brooke House,1-126987155,SCL,Brooke Gardens,The Street,,Norwich,Norfolk,NR15 1JH,Tel: 01508558359,No ratings yet Rate it yourself - /Services/careproviders/LeaveReview/DefaultView.aspx?id=1-126987155,0,0,,
Dell House,1-6133189042,SCL,5 Nelson Way,,,Beccles,Suffolk,NR34 9PH,Tel: 01502449855,No ratings yet Rate it yourself - /Services/careproviders/LeaveReview/DefaultView.aspx?id=1-6133189042,0,0,,
Kittens Lane,1-220311656,SCL,5 Kittens Lane,Loddon,,Norwich,Norfolk,NR14 6JU,,No ratings yet Rate it yourself - /Services/careproviders/LeaveReview/DefaultView.aspx?id=1-220311656,0,0,,
The Pastures,1-193681025,SCL,1-4 The pastures,Yarmouth Road,,Hales,Norfolk,NR14 6AB,Tel: 01508486045,No ratings yet Rate it yourself - /Services/careproviders/LeaveReview/DefaultView.aspx?id=1-193681025,0,0,,
The White House,1-121919998,SCL,Ashmans Road,,,Beccles,Suffolk,NR34 9NS,Tel: 01502717683,No ratings yet Rate it yourself - /Services/careproviders/LeaveReview/DefaultView.aspx?id=1-121919998,0,0,,
Wainford House Residential Care Home,1-18616314848,SCL,1-3 Saltgate Road,,,Beccles,,NR34 9AN,Tel: 01502714975,No ratings yet Rate it yourself - /Services/careproviders/LeaveReview/DefaultView.aspx?id=1-18616314848,0,0,,
Nightingale Homecare (Beccles),1-7840814436,SCL,47 Smallgate,,,Beccles,Suffolk,NR34 9AE,Tel: 01502449929,No ratings yet Rate it yourself - /Services/careproviders/LeaveReview/DefaultView.aspx?id=1-7840814436,0,0,,
Beccles Care Home,1-14320830700,SCL,St. Georges Road,,,Beccles,,NR34 9YQ,Tel: 01502716700,No ratings yet Rate it yourself - /Services/careproviders/LeaveReview/DefaultView.aspx?id=1-14320830700,0,0,,
Home Support Matters Beccles,1-6258353394,SCL,Hipperson Mews,53a Station Road,,Beccles,Suffolk,NR34 9QH,Tel: 03448008001,1 rating Rate it yourself - /Services/careproviders/LeaveReview/DefaultView.aspx?id=1-6258353394,,,,
Yourlife (Beccles),1-15084193453,SCL,Foundry Place,Gosford Road,,Beccles,,NR34 9SQ,Tel: 07764226874,No ratings yet Rate it yourself - /Services/careproviders/LeaveReview/DefaultView.aspx?id=1-15084193453,0,0,,
Beauchamp House,1-285666071,SCL,Proctor Road,Chedgrave,,Norwich,Norfolk,NR14 6HN,Tel: 01508508960,No ratings yet Rate it yourself - /Services/careproviders/LeaveReview/DefaultView.aspx?id=1-285666071,0,0,,
Woody Point,1-115057506,SCL,Station Road,Brampton,,Beccles,Suffolk,NR34 8EF,Tel: 01502575735,No ratings yet Rate it yourself - /Services/careproviders/LeaveReview/DefaultView.aspx?id=1-115057506,0,0,,
The Hollies and Hollies Lodge,1-722648172,SCL,Brick Kiln Lane,Morningthorpe,,Norwich,Norfolk,NR15 2LH,Tel: 01508530540,No ratings yet Rate it yourself - /Services/careproviders/LeaveReview/DefaultView.aspx?id=1-722648172,0,0,,
Hill House,1-129389509,SCL,Station Road,Pulham St. Mary,,Diss,Norfolk,IP21 4QT,Tel: 01379608209,No ratings yet Rate it yourself - /Services/careproviders/LeaveReview/DefaultView.aspx?id=1-129389509,0,0,,
South Norfolk Carers Limited,1-1061513188,SCL,Amelia House,"Norwich Road, Brooke",,Norwich,Norfolk,NR15 1HJ,Tel: 01508558218,No ratings yet Rate it yourself - /Services/careproviders/LeaveReview/DefaultView.aspx?id=1-1061513188,0,0,,
The Paddocks,1-107263645,SCL,Church Road,Weybread,,Diss,Norfolk,IP21 5TR,Tel: 01379852415,No ratings yet Rate it yourself - /Services/careproviders/LeaveReview/DefaultView.aspx?id=1-107263645,0,0,,
Harker House,1-285876046,SCL,Flowerpot Lane,Long Stratton,,Norwich,Norfolk,NR15 2TS,Tel: 01508530777,No ratings yet Rate it yourself - /Services/careproviders/LeaveReview/DefaultView.aspx?id=1-285876046,0,0,,
Long Stratton Supported Living,1-1047785322,SCL,26 Depwade Court,Long Stratton,,Norwich,Norfolk,NR15 2XY,Tel: 01508530820,No ratings yet Rate it yourself - /Services/careproviders/LeaveReview/DefaultView.aspx?id=1-1047785322,0,0,,
Oaklands,1-5459848120,SCL,Burgate Lane,Alpington,,Norwich,,NR14 7NP,Tel: 07500085111,No ratings yet Rate it yourself - /Services/careproviders/LeaveReview/DefaultView.aspx?id=1-5459848120,0,0,,
The Mayfields Care Home,1-532454507,SCL,Swan Lane,Tharston,,Norwich,Norfolk,NR15 2UY,Tel: 01508 535500,No ratings yet Rate it yourself - /Services/careproviders/LeaveReview/DefaultView.aspx?id=1-532454507,0,0,,
Acorn 2 Oak Care Limited,1-18385733147,SCL,8 John Hill Close,Long Stratton,,Norwich,,NR15 2PT,,No ratings yet Rate it yourself - /Services/careproviders/LeaveReview/DefaultView.aspx?id=1-18385733147,0,0,,
Cresta Lodge,1-111331838,SCL,Bungay Road,Poringland,,Norwich,Norfolk,NR14 7NA,Tel: 01508 492775,No ratings yet Rate it yourself - /Services/careproviders/LeaveReview/DefaultView.aspx?id=1-111331838,0,0,,
Caring Forever Limited,1-2258730097,SCL,Unit 33,"Ellough Industrial Estate, Ellough",,Beccles,Suffolk,NR34 7TD,Tel: 01502712088,No ratings yet Rate it yourself - /Services/careproviders/LeaveReview/DefaultView.aspx?id=1-2258730097,0,0,,
Beech House - Halesworth,1-121065889,SCL,Beech Close,,,Halesworth,Suffolk,IP19 8BY,,No ratings yet Rate it yourself - /Services/careproviders/LeaveReview/DefaultView.aspx?id=1-121065889,0,0,,
Olive House,1-121919865,SCL,Olive Avenue,Newton Flotman,,Norwich,Norfolk,NR15 1PF,Tel: 01508471718,1 rating Rate it yourself - /Services/careproviders/LeaveReview/DefaultView.aspx?id=1-121919865,,,,
Prestige Nursing Halesworth,1-2611697979,SCL,59c Thoroughfare,,,Halesworth,Suffolk,IP19 8AR,Tel: 01986899075,No ratings yet Rate it yourself - /Services/careproviders/LeaveReview/DefaultView.aspx?id=1-2611697979,0,0,,
First Choice Home Care (Halesworth),1-4707843133,SCL,25 Market Place,,,Halesworth,Suffolk,IP19 8AY,Tel: 01986800227,No ratings yet Rate it yourself - /Services/careproviders/LeaveReview/DefaultView.aspx?id=1-4707843133,0,0,,
Claxton House,1-112555052,SCL,Church Lane,Claxton,,Norwich,Norfolk,NR14 7HY,Tel: 01508480312,No ratings yet Rate it yourself - /Services/careproviders/LeaveReview/DefaultView.aspx?id=1-112555052,0,0,,
Highfield House Care Home,1-6151013110,SCL,London Road,,,Halesworth,Suffolk,IP19 8LP,Tel: 01986872125,No ratings yet Rate it yourself - /Services/careproviders/LeaveReview/DefaultView.aspx?id=1-6151013110,0,0,,
Bee Home Care Limited,1-13813363264,SCL,"Unit Four, Manor Farm Barns","Fox Road, Framingham Pigot",,Norwich,,NR14 7PZ,Tel: 01603331729,No ratings yet Rate it yourself - /Services/careproviders/LeaveReview/DefaultView.aspx?id=1-13813363264,0,0,,
Help at Home Care,1-15077486743,SCL,The Elms,North Cove,,Beccles,,NR34 7QG,Tel: 01502452337,No ratings yet Rate it yourself - /Services/careproviders/LeaveReview/DefaultView.aspx?id=1-15077486743,0,0,,
Culrose Residential Home,1-113590281,SCL,Norwich Road,Dickleburgh,,Diss,Norfolk,IP21 4NS,Tel: 01379741369,2 ratings Rate it yourself - /Services/careproviders/LeaveReview/DefaultView.aspx?id=1-113590281,,,,
Red Oaks Care Ltd,1-8195457888,SCL,The Oaks,"The Rosery, Mulbarton",,Norwich,,NR14 8AL,Tel: 07885390116,No ratings yet Rate it yourself - /Services/careproviders/LeaveReview/DefaultView.aspx?id=1-8195457888,0,0,,
High Oaks,1-118301700,SCL,Rectory Road (Hall Green),Gissing,,Diss,Norfolk,IP22 5UU,Tel: 01379 674456,No ratings yet Rate it yourself - /Services/careproviders/LeaveReview/DefaultView.aspx?id=1-118301700,0,0,,
Almond Tree Care Ltd,1-10801894708,SCL,Humbleyard,"The Common, Mulbarton",,Norwich,,NR14 8AE,Tel: 01508578807,No ratings yet Rate it yourself - /Services/careproviders/LeaveReview/DefaultView.aspx?id=1-10801894708,0,0,,
The Depperhaugh,1-301414131,SCL,Chickering Road,Hoxne,,Eye,Suffolk,IP21 5BX,Tel: 01379 888305,No ratings yet Rate it yourself - /Services/careproviders/LeaveReview/DefaultView.aspx?id=1-301414131,0,0,,
Joseph House,1-116359045,SCL,1 Church Road,Reedham,,Norwich,Norfolk,NR13 3TZ,Tel: 01493700580,No ratings yet Rate it yourself - /Services/careproviders/LeaveReview/DefaultView.aspx?id=1-116359045,0,0,,
The Grove - Care Home with Nursing Physical Disabilities,1-120084915,SCL,Scotts Hill,East Carleton,,Norwich,Norfolk,NR14 8HP,Tel: 01508570279,No ratings yet Rate it yourself - /Services/careproviders/LeaveReview/DefaultView.aspx?id=1-120084915,0,0,,
The Home Team,1-10019352865,SCL,"Unit 2, Bixley Manor",,,Norwich,,NR14 8SJ,Tel: 01603926465,1 rating Rate it yourself - /Services/careproviders/LeaveReview/DefaultView.aspx?id=1-10019352865,,,,
Restore Empathy Healthcare Ltd,1-15164335745,SCL,45a,"Norwich Road, Tacolneston",,Norwich,,NR16 1DD,,No ratings yet Rate it yourself - /Services/careproviders/LeaveReview/DefaultView.aspx?id=1-15164335745,0,0,,
Oaklands,1-127002881,SCL,Norwich Road,Scole,,Diss,Norfolk,IP21 4EE,Tel: 01379740646,No ratings yet Rate it yourself - /Services/careproviders/LeaveReview/DefaultView.aspx?id=1-127002881,0,0,,
Carleton House Care Home,1-2406668035,SCL,Rectory Road,East Carleton,,Norwich,Norfolk,NR14 8HT,Tel: 01508570451,No ratings yet Rate it yourself - /Services/careproviders/LeaveReview/DefaultView.aspx?id=1-2406668035,0,0,,
Braydeston Court,1-11890777495,SCL,4 Braydeston Avenue,Brundall,,Norwich,Norfolk,NR13 5JX,Tel: 01603 712029,No ratings yet Rate it yourself - /Services/careproviders/LeaveReview/DefaultView.aspx?id=1-11890777495,0,0,,
Belvoir House,1-5459847620,SCL,2-4 Blofield Road,Brundall,,Norwich,,NR13 5NN,Tel: 01603714703,No ratings yet Rate it yourself - /Services/careproviders/LeaveReview/DefaultView.aspx?id=1-5459847620,0,0,,
Old Hall Farm Barn,1-13412811715,SCL,Old Hall Farm Barn,"Low Road, Scole",,Diss,,IP21 4ES,Tel: 01379741103,No ratings yet Rate it yourself - /Services/careproviders/LeaveReview/DefaultView.aspx?id=1-13412811715,0,0,,
NCC Swift Response,1-2851011277,SCL,County Hall,Martineau Lane,,Norwich,Norfolk,NR1 2SQ,Tel: 03448008020,No ratings yet Rate it yourself - /Services/careproviders/LeaveReview/DefaultView.aspx?id=1-2851011277,0,0,,
Webster Court,1-2091599951,SCL,13-49 Lakenfields,,,Norwich,Norfolk,NR1 2HB,Tel: 01603699100,1 rating Rate it yourself - /Services/careproviders/LeaveReview/DefaultView.aspx?id=1-2091599951,,,,
Springdale,1-285971162,SCL,Cucumber Lane,Brundall,,Norwich,Norfolk,NR13 5QY,Tel: 01603712194,No ratings yet Rate it yourself - /Services/careproviders/LeaveReview/DefaultView.aspx?id=1-285971162,0,0,,
Harriet Court,1-285222208,SCL,off Stratford Drive,Lakenham,,Norwich,Norfolk,NR1 2DG,Tel: 01603766184,No ratings yet Rate it yourself - /Services/careproviders/LeaveReview/DefaultView.aspx?id=1-285222208,0,0,,
Carlton Hall Residential Home and Village,1-10814619493,SCL,Chapel Road,Carlton Colville,,Lowestoft,Suffolk,NR33 8BL,Tel: 01502513208,No ratings yet Rate it yourself - /Services/careproviders/LeaveReview/DefaultView.aspx?id=1-10814619493,0,0,,
Heronlea Residential Home,1-118978395,SCL,Mill Lane,Witton,,Norwich,Norfolk,NR13 5DS,Tel: 01603713314,No ratings yet Rate it yourself - /Services/careproviders/LeaveReview/DefaultView.aspx?id=1-118978395,0,0,,
Broadlands Lodge Care Home,1-13976816487,SCL,Broadland Gate,Postwick,,Norwich,,NR13 5HB,,No ratings yet Rate it yourself - /Services/careproviders/LeaveReview/DefaultView.aspx?id=1-13976816487,0,0,,
Sterling House,1-12737823598,SCL,150-152 Thorpe Road,,,Norwich,,NR1 1GT,Tel: 01603573591,No ratings yet Rate it yourself - /Services/careproviders/LeaveReview/DefaultView.aspx?id=1-12737823598,0,0,,
Larchwood House,1-1053988796,SCL,133 Yarmouth Road,Thorpe St Andrew,,Norwich,Norfolk,NR7 0RF,Tel: 01603 437358,No ratings yet Rate it yourself - /Services/careproviders/LeaveReview/DefaultView.aspx?id=1-1053988796,0,0,,
Laurel Lodge Care Home,1-2781038298,SCL,19 Ipswich Road,,,Norwich,Norfolk,NR2 2LN,Tel: 01603502371,No ratings yet Rate it yourself - /Services/careproviders/LeaveReview/DefaultView.aspx?id=1-2781038298,0,0,,
Caremark Norwich,1-2793556667,SCL,147 Yarmouth Road,,,Norwich,Norfolk,NR7 0SA,Tel: 01603433855,No ratings yet Rate it yourself - /Services/careproviders/LeaveReview/DefaultView.aspx?id=1-2793556667,0,0,,
Broadland View Care Home,1-883965855,SCL,147 Yarmouth Road,Thorpe St Andrew,,Norwich,Norfolk,NR7 0SA,Tel: 01603 432050,No ratings yet Rate it yourself - /Services/careproviders/LeaveReview/DefaultView.aspx?id=1-883965855,0,0,,
Cromwell House,1-117965487,SCL,Cecil Road,,,Norwich,Norfolk,NR1 2QJ,Tel: 01603625961,No ratings yet Rate it yourself - /Services/careproviders/LeaveReview/DefaultView.aspx?id=1-117965487,0,0,,
Corton House,1-108960738,SCL,City Road,,,Norwich,Norfolk,NR1 3AP,,No ratings yet Rate it yourself - /Services/careproviders/LeaveReview/DefaultView.aspx?id=1-108960738,0,0,,
NCC First Support - Norwich,1-7485807246,SCL,Reed House,"Peachman Way, Broadland Business Park",,Norwich,,NR7 0WF,Tel: 01603224060,No ratings yet Rate it yourself - /Services/careproviders/LeaveReview/DefaultView.aspx?id=1-7485807246,0,0,,
First Choice Home Care (Norwich),1-8606627372,SCL,"First Floor, 2 Barton Way",,,Norwich,,NR1 1DL,Tel: 01603980394,No ratings yet Rate it yourself - /Services/careproviders/LeaveReview/DefaultView.aspx?id=1-8606627372,0,0,,
Roster Home Care Ltd - Norwich Office,1-13942632495,SCL,231 Queens Road,,,Norwich,,NR1 3AE,Tel: 01603323653,No ratings yet Rate it yourself - /Services/careproviders/LeaveReview/DefaultView.aspx?id=1-13942632495,0,0,,
North Bay House,1-106199876,SCL,Borrow Road,Oulton Broad,,Lowestoft,Suffolk,NR32 3PW,,No ratings yet Rate it yourself - /Services/careproviders/LeaveReview/DefaultView.aspx?id=1-106199876,0,0,,
Broadlands,1-121569406,SCL,Borrow Road,Oulton Broad,,Lowestoft,Suffolk,NR32 3PW,Tel: 01502512895,No ratings yet Rate it yourself - /Services/careproviders/LeaveReview/DefaultView.aspx?id=1-121569406,0,0,,
Mary Chapman Court,1-310528504,SCL,Mary Chapman Close,Dussindale,,Norwich,Norfolk,NR7 0UD,Tel: 01603701188,1 rating Rate it yourself - /Services/careproviders/LeaveReview/DefaultView.aspx?id=1-310528504,,,,
Dussindale Park,1-310512463,SCL,26 Mary Chapman Close,Dussindale,,Norwich,Norfolk,NR7 0UD,Tel: 01603701900,No ratings yet Rate it yourself - /Services/careproviders/LeaveReview/DefaultView.aspx?id=1-310512463,0,0,,
Harvey Lane,1-132648081,SCL,9 Harvey Lane,,,Norwich,Norfolk,NR7 0BG,Tel: 01603304655,No ratings yet Rate it yourself - /Services/careproviders/LeaveReview/DefaultView.aspx?id=1-132648081,0,0,,
Manor House,1-111342375,SCL,18 Yarmouth Road,Blofield,,Norwich,Norfolk,NR13 4JS,Tel: 01603 713965,No ratings yet Rate it yourself - /Services/careproviders/LeaveReview/DefaultView.aspx?id=1-111342375,0,0,,
Prestige Nursing Norwich,1-126673004,SCL,"Rooms 21 & 23, St Francis House",141-147 Queens Road,,Norwich,Norfolk,NR1 3PN,Tel: 01603666643,1 rating Rate it yourself - /Services/careproviders/LeaveReview/DefaultView.aspx?id=1-126673004,,,,
Hillcrest,1-307297341,SCL,106 Thorpe Road,Thorpe,,Norwich,Norfolk,NR1 1RT,Tel: 01603626073,1 rating Rate it yourself - /Services/careproviders/LeaveReview/DefaultView.aspx?id=1-307297341,,,,
Nouveau Care,1-2446555592,SCL,,125 Ber Street,,Norwich,Norfolk,NR1 3EY,Tel: 01603765875,3 ratings Rate it yourself - /Services/careproviders/LeaveReview/DefaultView.aspx?id=1-2446555592,,,,
PSS Shared Lives Norfolk and Suffolk,1-4513326298,SCL,Unit 14 Diss Business Centre,"Dark Lane, Scole",,Diss,Norfolk,IP21 4HD,Tel: 01379644423,No ratings yet Rate it yourself - /Services/careproviders/LeaveReview/DefaultView.aspx?id=1-4513326298,0,0,,
LUMINOUS DOMICILIARY CARE LTD,1-15153339060,SCL,36 Ber Street,,,Norwich,,NR1 3EW,Tel: 07960879777,No ratings yet Rate it yourself - /Services/careproviders/LeaveReview/DefaultView.aspx?id=1-15153339060,0,0,,
Chiswick House,1-121489513,SCL,3 Christchurch Road,,,Norwich,Norfolk,NR2 2AD,Tel: 01603507111,No ratings yet Rate it yourself - /Services/careproviders/LeaveReview/DefaultView.aspx?id=1-121489513,0,0,,
Your Life (Norwich),1-5745002639,SCL,Daisy Court,Bluebell Road,,Norwich,,NR4 7FL,Tel: 01603456328,No ratings yet Rate it yourself - /Services/careproviders/LeaveReview/DefaultView.aspx?id=1-5745002639,0,0,,
Hill Grove,1-9823802459,SCL,1 Colney Lane,Cringleford,,Norwich,Norfolk,NR4 7RE,Tel: 01603504337,No ratings yet Rate it yourself - /Services/careproviders/LeaveReview/DefaultView.aspx?id=1-9823802459,0,0,,
Ellacombe,1-285856030,SCL,Ella Road,,,Norwich,Norfolk,NR1 4BP,Tel: 01603519730,No ratings yet Rate it yourself - /Services/careproviders/LeaveReview/DefaultView.aspx?id=1-285856030,0,0,,
Trust Care Agency,1-1924575673,SCL,Rouen House,Rouen Road,,Norwich,Norfolk,NR1 1RB,Tel: 01603617770,No ratings yet Rate it yourself - /Services/careproviders/LeaveReview/DefaultView.aspx?id=1-1924575673,0,0,,
Bay Tree House,1-9823802251,SCL,423 Unthank Road,,,Norwich,Norfolk,NR4 7QB,Tel: 01603503528,No ratings yet Rate it yourself - /Services/careproviders/LeaveReview/DefaultView.aspx?id=1-9823802251,0,0,,
The Dell Care Home,1-196612609,SCL,45 Cotmer Road,Oulton Broad,,Lowestoft,Suffolk,NR33 9PL,Tel: 01502446600,No ratings yet Rate it yourself - /Services/careproviders/LeaveReview/DefaultView.aspx?id=1-196612609,0,0,,
Wellbeing Care Support Services,1-439691271,SCL,45 Cotmer Road,,,Lowestoft,Suffolk,NR33 9PL,Tel: 01502446609,No ratings yet Rate it yourself - /Services/careproviders/LeaveReview/DefaultView.aspx?id=1-439691271,0,0,,
Heywoods Grange,1-193876847,SCL,Burston Road,,,Diss,Norfolk,IP22 5SX,Tel: 01379652265,No ratings yet Rate it yourself - /Services/careproviders/LeaveReview/DefaultView.aspx?id=1-193876847,0,0,,
Fisher Healthcare East Anglia - Norwich,1-4598280870,SCL,79A Gordon Avenue,,,Norwich,,NR7 0DR,Tel: 01603612307,5 ratings Rate it yourself - /Services/careproviders/LeaveReview/DefaultView.aspx?id=1-4598280870,,,,
The Hawthorns Care Home,1-310528556,SCL,270 Unthank Road,,,Norwich,Norfolk,NR2 2AJ,Tel: 01603452302,No ratings yet Rate it yourself - /Services/careproviders/LeaveReview/DefaultView.aspx?id=1-310528556,0,0,,
Apple Homecare,1-2458396415,SCL,Progress House,"Plantation Road, Blofield",,Norwich,Norfolk,NR13 4PL,Tel: 01603211080,No ratings yet Rate it yourself - /Services/careproviders/LeaveReview/DefaultView.aspx?id=1-2458396415,0,0,,
Availl (Norwich),1-2747753362,SCL,The Union Building,51-59 Rose Lane,,Norwich,Norfolk,NR1 1BY,Tel: 01603633999,No ratings yet Rate it yourself - /Services/careproviders/LeaveReview/DefaultView.aspx?id=1-2747753362,0,0,,
East Coast Care,1-14437543644,SCL,390 Long Road,Carlton Colville,,Lowestoft,,NR33 8HZ,Tel: 07447658245,No ratings yet Rate it yourself - /Services/careproviders/LeaveReview/DefaultView.aspx?id=1-14437543644,0,0,,
Pulms Limited,1-15628564012,SCL,27 Kingfisher Close,Cringleford,,Norwich,,NR4 7LL,,No ratings yet Rate it yourself - /Services/careproviders/LeaveReview/DefaultView.aspx?id=1-15628564012,0,0,,
Walcot Hall Nursing Home,1-8526581771,SCL,Walcot Hall,Walcot Green,,Diss,Norfolk,IP22 5SR,Tel: 01379641030,No ratings yet Rate it yourself - /Services/careproviders/LeaveReview/DefaultView.aspx?id=1-8526581771,0,0,,
TCOU at Home Ltd,1-13879248557,SCL,20 Spinney Close,,,Norwich,,NR7 0PN,Tel: 07368378612,No ratings yet Rate it yourself - /Services/careproviders/LeaveReview/DefaultView.aspx?id=1-13879248557,0,0,,
Bishop Herbert House,1-285666240,SCL,34 Globe Place,,,Norwich,Norfolk,NR2 2SG,Tel: 01603620710,No ratings yet Rate it yourself - /Services/careproviders/LeaveReview/DefaultView.aspx?id=1-285666240,0,0,,
The Daily Care Agency,1-4045263991,SCL,High Banks,"Athelington Road, Horham",,Eye,Suffolk,IP21 5EH,Tel: 01379388438,No ratings yet Rate it yourself - /Services/careproviders/LeaveReview/DefaultView.aspx?id=1-4045263991,0,0,,
Sunrise Healthcare Ltd,1-2190108554,SCL,"DBH 21, Diss Business Park",Hopper Way,,Diss,,IP22 4GT,Tel: 01379641250,1 rating Rate it yourself - /Services/careproviders/LeaveReview/DefaultView.aspx?id=1-2190108554,,,,
Mercylink Care Norfolk,1-17934283535,SCL,Unit 2b,"Diss Business Park, Hopper Way, Sandy Lane",,Diss,,IP22 4GT,Tel: 07365273990,No ratings yet Rate it yourself - /Services/careproviders/LeaveReview/DefaultView.aspx?id=1-17934283535,0,0,,
Hales Group Limited - Norwich,1-4920880064,SCL,"First Floor, Jacquard House",Queen Street,,Norwich,Norfolk,NR2 4SX,Tel: 01603358639,No ratings yet Rate it yourself - /Services/careproviders/LeaveReview/DefaultView.aspx?id=1-4920880064,0,0,,
The Hamlet Charity,1-11881603489,SCL,Head Office,Johnson Place,,Norwich,,NR2 1SJ,Tel: 01603215193,No ratings yet Rate it yourself - /Services/careproviders/LeaveReview/DefaultView.aspx?id=1-11881603489,0,0,,
Cavell Court,1-2104937207,SCL,140 Dragonfly Lane,Cringleford,,Norwich,Norfolk,NR4 7SW,Tel: 03333211980,No ratings yet Rate it yourself - /Services/careproviders/LeaveReview/DefaultView.aspx?id=1-2104937207,0,0,,
Insignia Healthcare (Norwich),1-2318854734,SCL,10-14 Plumstead Road East,Thorpe St. Andrew,,Norwich,Norfolk,NR7 9NE,Tel: 01603952626,No ratings yet Rate it yourself - /Services/careproviders/LeaveReview/DefaultView.aspx?id=1-2318854734,0,0,,
The Great Hospital Domiciliary Service,1-108725481,SCL,Bishopgate,,,Norwich,Norfolk,NR1 4EL,Tel: 01603622022,No ratings yet Rate it yourself - /Services/careproviders/LeaveReview/DefaultView.aspx?id=1-108725481,0,0,,
Norfolk Affinity Care Services Ltd,1-9660469853,SCL,4-6 Belmore Road,Belmore Business Centre,,Norwich,,NR7 0PT,Tel: 07540778571,No ratings yet Rate it yourself - /Services/careproviders/LeaveReview/DefaultView.aspx?id=1-9660469853,0,0,,
De Lucy House,1-2089484545,SCL,40 Victoria Road,,,Diss,Norfolk,IP22 4HZ,Tel: 01379671333,No ratings yet Rate it yourself - /Services/careproviders/LeaveReview/DefaultView.aspx?id=1-2089484545,0,0,,