Organisation Name,NACS Code,Organisation Type,Address1,Address2,Address3,Address4,Address5,PostCode,Telephone Number,NHS.UK users rating,Value  (NHS.UK users rating),Banding Classification  (NHS.UK users rating),Car parking (Is there car parking at this organisation?),Disabled access (Disabled access)
Dulas Court,1-111205665,SCL,Dulas,Ewyas Harold,,Hereford,Herefordshire,HR2 0HL,Tel: 01981240214,No ratings yet Rate it yourself - /Services/careproviders/LeaveReview/DefaultView.aspx?id=1-111205665,0,0,,
Castleford House Nursing Home,1-143956733,SCL,Castleford Gardens,Tutshill,,Chepstow,Gloucestershire,NP16 7LF,Tel: 01291629929,No ratings yet Rate it yourself - /Services/careproviders/LeaveReview/DefaultView.aspx?id=1-143956733,0,0,,
Castleford Lodge,1-2684652094,SCL,Castleford Hill,Tutshill,,Chepstow,,NP16 7LE,Tel: 01291408151,No ratings yet Rate it yourself - /Services/careproviders/LeaveReview/DefaultView.aspx?id=1-2684652094,0,0,,
The Orchard,1-2899703240,SCL,Ganarew,,,Monmouth,,NP25 3SS,Tel: 01600891450,No ratings yet Rate it yourself - /Services/careproviders/LeaveReview/DefaultView.aspx?id=1-2899703240,0,0,,
Ganarew House Care Home,1-143956718,SCL,Ganarew,,,Monmouth,Herefordshire,NP25 3SS,Tel: 01600890273,No ratings yet Rate it yourself - /Services/careproviders/LeaveReview/DefaultView.aspx?id=1-143956718,0,0,,
The Elms,1-6858422842,SCL,Staunton,,,Coleford,Gloucestershire,GL16 8NX,Tel: 01594832394,No ratings yet Rate it yourself - /Services/careproviders/LeaveReview/DefaultView.aspx?id=1-6858422842,0,0,,
Gloucestershire Domiciliary Care Branch,1-1949337796,SCL,16 Bank Street,,,Coleford,Gloucestershire,GL16 8BA,Tel: 01594540312,No ratings yet Rate it yourself - /Services/careproviders/LeaveReview/DefaultView.aspx?id=1-1949337796,0,0,,
OSJCT The Coombs,1-122144985,SCL,The Gorse,,,Coleford,Gloucestershire,GL16 8QE,Tel: 01594833200,1 rating Rate it yourself - /Services/careproviders/LeaveReview/DefaultView.aspx?id=1-122144985,,,,
Market Place,1-114591935,SCL,29 Market Place,,,Coleford,Gloucestershire,GL16 8AA,Tel: 01594834595,No ratings yet Rate it yourself - /Services/careproviders/LeaveReview/DefaultView.aspx?id=1-114591935,0,0,,
Whitchurch House,1-121851327,SCL,Whitchurch,,,Ross-on-Wye,Herefordshire,HR9 6BZ,Tel: 01600 890656,No ratings yet Rate it yourself - /Services/careproviders/LeaveReview/DefaultView.aspx?id=1-121851327,0,0,,
The Orchard Trust - Sevenoaks,1-119801993,SCL,Lords Hill,,,Coleford,Gloucestershire,GL16 8BG,Tel: 01594861137,No ratings yet Rate it yourself - /Services/careproviders/LeaveReview/DefaultView.aspx?id=1-119801993,0,0,,
Kind Tailored Care Ltd,1-13213158886,SCL,Old Ferry Inn Business Centre,Beachley,,Chepstow,,NP16 7HH,,No ratings yet Rate it yourself - /Services/careproviders/LeaveReview/DefaultView.aspx?id=1-13213158886,0,0,,
HF Trust - Forest of Dean DCA,1-2584137596,SCL,Ormiston,"Edenwall, Coalway",,Coleford,Gloucestershire,GL16 7HN,Tel: 01594834763,No ratings yet Rate it yourself - /Services/careproviders/LeaveReview/DefaultView.aspx?id=1-2584137596,0,0,,
GL1 Support Services,1-4234293193,SCL,Innovation Spaces,Mile End Road,,Coleford,Gloucestershire,GL16 7QD,Tel: 01594368160,No ratings yet Rate it yourself - /Services/careproviders/LeaveReview/DefaultView.aspx?id=1-4234293193,0,0,,
Faith House Residential Home,1-8207066190,SCL,Station Road,Severn Beach,,Bristol,,BS35 4PL,Tel: 01454632611,No ratings yet Rate it yourself - /Services/careproviders/LeaveReview/DefaultView.aspx?id=1-8207066190,0,0,,
Hunters Lodge,1-129478911,SCL,Bryngwym Manor,Wormelow,,Hereford,Herefordshire,HR2 8EQ,,No ratings yet Rate it yourself - /Services/careproviders/LeaveReview/DefaultView.aspx?id=1-129478911,0,0,,
Falcons Rest and Poachers Cottage,1-1475546693,SCL,Falcons Rest,Bryngwyn,,Wormelow,Herefordshire,HR2 8EQ,Tel: 01981542130,No ratings yet Rate it yourself - /Services/careproviders/LeaveReview/DefaultView.aspx?id=1-1475546693,0,0,,
Norewood Lodge Care Home,1-484572768,SCL,72 Nore Road,,,Portishead,Somerset,BS20 8DU,Tel: 01275818660,No ratings yet Rate it yourself - /Services/careproviders/LeaveReview/DefaultView.aspx?id=1-484572768,0,0,,
Charnwood Country Residence,1-121568293,SCL,Much Dewchurch,King's Thorn,,Hereford,Herefordshire,HR2 8DL,Tel: 01981540291,No ratings yet Rate it yourself - /Services/careproviders/LeaveReview/DefaultView.aspx?id=1-121568293,0,0,,
The Orchards,1-119801936,SCL,Stowfield,,,Lower Lydbrook,Gloucestershire,GL17 9PD,Tel: 01594861137,No ratings yet Rate it yourself - /Services/careproviders/LeaveReview/DefaultView.aspx?id=1-119801936,0,0,,
Cambrian Lodge,1-131732275,SCL,4 Battery Road,,,Portishead,Somerset,BS20 7HP,Tel: 01275848844,No ratings yet Rate it yourself - /Services/careproviders/LeaveReview/DefaultView.aspx?id=1-131732275,0,0,,
Birches Grove,1-350333178,SCL,14 Fairmoor Close,Parkend,,Lydney,Gloucestershire,GL15 4HB,Tel: 01594564081,No ratings yet Rate it yourself - /Services/careproviders/LeaveReview/DefaultView.aspx?id=1-350333178,0,0,,
Arise Healthcare Ltd,1-13946345835,SCL,Unit 1 B & C,"Parkend Road, Whitecroft",,Lydney,,GL15 4PA,Tel: 01594564475,No ratings yet Rate it yourself - /Services/careproviders/LeaveReview/DefaultView.aspx?id=1-13946345835,0,0,,
Hazelhurst Nursing Home,1-2724084240,SCL,Bishopswood,,,Ross On Wye,Herefordshire,HR9 5QX,Tel: 01600890600,1 rating Rate it yourself - /Services/careproviders/LeaveReview/DefaultView.aspx?id=1-2724084240,,,,
Adlington House - Portishead,1-1911691910,SCL,"Adlington House, 132A Slade Road",Portishead,,Bristol,Avon,BS20 6BB,Tel: 01275397730,No ratings yet Rate it yourself - /Services/careproviders/LeaveReview/DefaultView.aspx?id=1-1911691910,0,0,,
Harbour Care Centre,1-311343966,SCL,4 Haven View,"Harbour Road, Portishead",,Bristol,,BS20 7QA,Tel: 01275409950,No ratings yet Rate it yourself - /Services/careproviders/LeaveReview/DefaultView.aspx?id=1-311343966,0,0,,
Osborne House,1-1265420415,SCL,16 Bay Road,,,Clevedon,Avon,BS21 7BT,Tel: 01275871020,No ratings yet Rate it yourself - /Services/careproviders/LeaveReview/DefaultView.aspx?id=1-1265420415,0,0,,
Upton Cottage,1-111339761,SCL,18 Bay Road,,,Clevedon,Somerset,BS21 7BT,Tel: 01275878601,No ratings yet Rate it yourself - /Services/careproviders/LeaveReview/DefaultView.aspx?id=1-111339761,0,0,,
Worcester Lodge,1-127451972,SCL,30-32 Castle Road,Walton St. Mary,,Clevedon,Somerset,BS21 7DE,Tel: 01275874031,No ratings yet Rate it yourself - /Services/careproviders/LeaveReview/DefaultView.aspx?id=1-127451972,0,0,,
Gorselands Care Home,1-110201378,SCL,45 The Avenue,,,Clevedon,Somerset,BS21 7DZ,Tel: 01275872315,No ratings yet Rate it yourself - /Services/careproviders/LeaveReview/DefaultView.aspx?id=1-110201378,0,0,,
Weir End House,1-350356368,SCL,Glewstone,,,Ross On Wye,Herefordshire,HR9 6AL,Tel: 01989567711,No ratings yet Rate it yourself - /Services/careproviders/LeaveReview/DefaultView.aspx?id=1-350356368,0,0,,
Woodpecker Lodge,1-350380482,SCL,Weir End House,Weir End,,Ross On Wye,Herefordshire,HR9 6AL,Tel: 01989567711,No ratings yet Rate it yourself - /Services/careproviders/LeaveReview/DefaultView.aspx?id=1-350380482,0,0,,
Stable Cottage,1-133299228,SCL,Upper Moraston,Sellack,,Ross On Wye,Herefordshire,HR9 6RE,Tel: 01989730491,No ratings yet Rate it yourself - /Services/careproviders/LeaveReview/DefaultView.aspx?id=1-133299228,0,0,,
Tithe Barn,1-133299258,SCL,Upper Moraston,Sellack,,Ross On Wye,Herefordshire,HR9 6RE,Tel: 01989730491,1 rating Rate it yourself - /Services/careproviders/LeaveReview/DefaultView.aspx?id=1-133299258,,,,
Helping Hands Portishead,1-10970459641,SCL,61 Hill Road,,,Clevedon,,BS21 7PD,Tel: 07814167317,No ratings yet Rate it yourself - /Services/careproviders/LeaveReview/DefaultView.aspx?id=1-10970459641,0,0,,
Clevedon Court Nursing Home,1-11673402374,SCL,32 Dial Hill Road,,,Clevedon,Somerset,BS21 7HN,Tel: 01275872694,No ratings yet Rate it yourself - /Services/careproviders/LeaveReview/DefaultView.aspx?id=1-11673402374,0,0,,
Footsteps Medical Care Limited,1-117511444,SCL,"The Byre, Allastone Court Farm",Court Road,,Lydney,Gloucestershire,GL15 5SR,Tel: 01594844244,No ratings yet Rate it yourself - /Services/careproviders/LeaveReview/DefaultView.aspx?id=1-117511444,0,0,,
"Channel Court, Sugar Lookout",1-17594351573,SCL,Channel Court,8 Hill Road,,Clevedon,,BS21 7NE,Tel: 07954430246,No ratings yet Rate it yourself - /Services/careproviders/LeaveReview/DefaultView.aspx?id=1-17594351573,0,0,,
Winash Rest Home,1-107144677,SCL,9 Albert Road,,,Clevedon,Somerset,BS21 7RP,,No ratings yet Rate it yourself - /Services/careproviders/LeaveReview/DefaultView.aspx?id=1-107144677,0,0,,
Alvony House Residential Care Home,1-15157054056,SCL,25 Linden Road,,,Clevedon,Somerset,BS21 7SR,Tel: 01275875573,No ratings yet Rate it yourself - /Services/careproviders/LeaveReview/DefaultView.aspx?id=1-15157054056,0,0,,
Mount Elton Nursing Home,1-127973777,SCL,25 Highdale Road,,,Clevedon,Somerset,BS21 7LW,Tel: 01275871123,1 rating Rate it yourself - /Services/careproviders/LeaveReview/DefaultView.aspx?id=1-127973777,,,,
Seren Healthcare Solutions Limited,1-9786736481,SCL,Richmond House,Avonmouth Way,,Bristol,,BS11 8DE,Tel: 07950457114,2 ratings Rate it yourself - /Services/careproviders/LeaveReview/DefaultView.aspx?id=1-9786736481,,,,
St Brigas Residential Home For Adults with Learning Disabilities,1-133261903,SCL,St Brigas,2-3 Jesmond Road,,Clevedon,Somerset,BS21 7SA,Tel: 01275870653,No ratings yet Rate it yourself - /Services/careproviders/LeaveReview/DefaultView.aspx?id=1-133261903,0,0,,
Oaktree Lodge Residential Home,1-112064004,SCL,12-13 Jesmond Road,,,Clevedon,Somerset,BS21 7RZ,Tel: 01275873171,No ratings yet Rate it yourself - /Services/careproviders/LeaveReview/DefaultView.aspx?id=1-112064004,0,0,,
OSJCT Rodley House,1-122144942,SCL,Harrison Way,,,Lydney,Gloucestershire,GL15 5BB,Tel: 01594842778,No ratings yet Rate it yourself - /Services/careproviders/LeaveReview/DefaultView.aspx?id=1-122144942,0,0,,
7 Pizey Avenue,1-4437212597,SCL,7 Pizey Avenue,,,Clevedon,Avon,BS21 7TS,Tel: 01275879978,No ratings yet Rate it yourself - /Services/careproviders/LeaveReview/DefaultView.aspx?id=1-4437212597,0,0,,
Nodens Manor Care Home,1-15014252533,SCL,Naas Lane,,,Lydney,,GL15 5AU,,No ratings yet Rate it yourself - /Services/careproviders/LeaveReview/DefaultView.aspx?id=1-15014252533,0,0,,
North Somerset Connecting Lives Scheme,1-1732654363,SCL,"Castlewood, Floor 2,  Zone A",Tickenham Road,,Clevedon,,BS21 6FW,Tel: 01275888368,No ratings yet Rate it yourself - /Services/careproviders/LeaveReview/DefaultView.aspx?id=1-1732654363,0,0,,
Poets Mews Care Home,1-7438178408,SCL,2 Cherry Avenue,,,Clevedon,,BS21 6DY,Tel: 01275404840,No ratings yet Rate it yourself - /Services/careproviders/LeaveReview/DefaultView.aspx?id=1-7438178408,0,0,,
Elm View Care Home,1-484410765,SCL,Moor Lane,,,Clevedon,Somerset,BS21 6EU,Tel: 01275872088,No ratings yet Rate it yourself - /Services/careproviders/LeaveReview/DefaultView.aspx?id=1-484410765,0,0,,
Nobilis Care North Somerset,1-13486837209,SCL,Unit 1,"5C Business Centre, Concorde Drive",,Clevedon,,BS21 6UH,Tel: 01275595998,No ratings yet Rate it yourself - /Services/careproviders/LeaveReview/DefaultView.aspx?id=1-13486837209,0,0,,
Granville Lodge,1-2526495831,SCL,West Town Road,Shirehampton,,Bristol,,BS11 9NJ,Tel: 01179823299,2 ratings Rate it yourself - /Services/careproviders/LeaveReview/DefaultView.aspx?id=1-2526495831,,,,
Yourlife (Clevedon),1-16564991468,SCL,The Pottery,169 Kenn Road,,Clevedon,,BS21 6GA,Tel: 07764226874,No ratings yet Rate it yourself - /Services/careproviders/LeaveReview/DefaultView.aspx?id=1-16564991468,0,0,,
Rosedale Retirement Home,1-405532018,SCL,Ashfield Crescent,,,Ross On Wye,Herefordshire,HR9 5PH,Tel: 01989218082,No ratings yet Rate it yourself - /Services/careproviders/LeaveReview/DefaultView.aspx?id=1-405532018,0,0,,
West Bank Residential Home,1-486739010,SCL,Walford Road,,,Ross-on-Wye,Herefordshire,HR9 5PQ,Tel: 01989562741,1 rating Rate it yourself - /Services/careproviders/LeaveReview/DefaultView.aspx?id=1-486739010,,,,
Chepstow House,1-111393260,SCL,Old Maids Walk,,,Ross On Wye,Herefordshire,HR9 5HB,Tel: 01989566027,No ratings yet Rate it yourself - /Services/careproviders/LeaveReview/DefaultView.aspx?id=1-111393260,0,0,,
Whitehall Place,1-17412422384,SCL,Whitehall Place,Madley,,Hereford,,HR2 9LS,Tel: 07792116492,No ratings yet Rate it yourself - /Services/careproviders/LeaveReview/DefaultView.aspx?id=1-17412422384,0,0,,
ARCH Care Services Ltd,1-593779736,SCL,3 Avalon House,Stileway Business Park,,Clevedon,Somerset,BS21 6UU,Tel: 01275 342266,No ratings yet Rate it yourself - /Services/careproviders/LeaveReview/DefaultView.aspx?id=1-593779736,0,0,,
Ann Coleman Centre,1-121511041,SCL,Ridingleaze,Lawrence Weston,,Bristol,,BS11 0QE,,No ratings yet Rate it yourself - /Services/careproviders/LeaveReview/DefaultView.aspx?id=1-121511041,0,0,,
Aspire Living - 1-2 Markyes Close,1-121620583,SCL,1-2 Markyes Close,,,Ross on Wye,Herefordshire,HR9 7BZ,Tel: 01989769035,No ratings yet Rate it yourself - /Services/careproviders/LeaveReview/DefaultView.aspx?id=1-121620583,0,0,,
Bristol ECHS,1-8026511142,SCL,Blaise Weston Court,Broadlands Drive,,Bristol,Avon,BS11 0AF,Tel: 08706071400,No ratings yet Rate it yourself - /Services/careproviders/LeaveReview/DefaultView.aspx?id=1-8026511142,0,0,,
Red House,1-133299168,SCL,65 Ruspidge Road,,,Cinderford,Gloucestershire,GL14 3AW,Tel: 01594822100,No ratings yet Rate it yourself - /Services/careproviders/LeaveReview/DefaultView.aspx?id=1-133299168,0,0,,
Here4Care LTD Office,1-6344728831,SCL,Unit 4 Knockerhill Farm,Callow,,Hereford,,HR2 8BP,Tel: 07807338540,No ratings yet Rate it yourself - /Services/careproviders/LeaveReview/DefaultView.aspx?id=1-6344728831,0,0,,
Hobbits Holt,1-133288016,SCL,156 Ruspidge Road,Cinderford,,Gloucester,Gloucestershire,GL14 3AP,Tel: 01594823554,1 rating Rate it yourself - /Services/careproviders/LeaveReview/DefaultView.aspx?id=1-133288016,,,,
Windmill House,1-108969662,SCL,Alveston Road,Old Down,,Tockington,Gloucestershire,BS32 4PH,,No ratings yet Rate it yourself - /Services/careproviders/LeaveReview/DefaultView.aspx?id=1-108969662,0,0,,
Penhill Residential Home,1-343454282,SCL,81 Station Road,Shirehampton,,Bristol,,BS11 9TY,Tel: 01179822685,No ratings yet Rate it yourself - /Services/careproviders/LeaveReview/DefaultView.aspx?id=1-343454282,0,0,,
Synergy Complex Care Ltd,1-9287036802,SCL,The Old Brewery,"Lodway, Pill",,Bristol,,BS20 0DH,Tel: 01174037878,No ratings yet Rate it yourself - /Services/careproviders/LeaveReview/DefaultView.aspx?id=1-9287036802,0,0,,
Network Healthcare Professionals Limited - North Somerset,1-11295513125,SCL,3 St. Davids Court,"Windmill Road, Kenn",,Clevedon,,BS21 6UP,,No ratings yet Rate it yourself - /Services/careproviders/LeaveReview/DefaultView.aspx?id=1-11295513125,0,0,,
The Orchard Trust Domiciliary Care Agency,1-119802010,SCL,Hilltop,Ridge Walk,,Ruardean,Gloucestershire,GL17 9AY,Tel: 01594861137,No ratings yet Rate it yourself - /Services/careproviders/LeaveReview/DefaultView.aspx?id=1-119802010,0,0,,
Hilltop,1-119801976,SCL,Ridge Walk,,,Ruardean Hill,Gloucestershire,GL17 9AY,Tel: 01594861137,No ratings yet Rate it yourself - /Services/careproviders/LeaveReview/DefaultView.aspx?id=1-119801976,0,0,,
Ashfield Care Ltd,1-582310149,SCL,Ashfield Care,Chase Industrial Estate,,Ross-on-Wye,Herefordshire,HR9 5WA,Tel: 01989565309,No ratings yet Rate it yourself - /Services/careproviders/LeaveReview/DefaultView.aspx?id=1-582310149,0,0,,
The Hatch Camphill Community,1-239198069,SCL,Chestnut,"23 Castle Street, Thornbury",,Bristol,,BS35 1HQ,Tel: 01454413010,No ratings yet Rate it yourself - /Services/careproviders/LeaveReview/DefaultView.aspx?id=1-239198069,0,0,,
Total Living Care,1-1520389628,SCL,"Haigh Main Building, Haigh Engineering Co Ltd","Alton Road, Ross-on-wye",,Ross-on-wye,,HR9 5NG,Tel: 01989562000,1 rating Rate it yourself - /Services/careproviders/LeaveReview/DefaultView.aspx?id=1-1520389628,,,,
Alina Homecare - North Bristol,1-8861389441,SCL,"Clifton Rugby Football Club, Station Road",Cribbs Causeway,,Bristol,,BS10 7TT,Tel: 01172035222,No ratings yet Rate it yourself - /Services/careproviders/LeaveReview/DefaultView.aspx?id=1-8861389441,0,0,,
Badminton Place,1-9752855116,SCL,Catbrain Lane,,,Bristol,,BS10 7TQ,Tel: 01174502100,1 rating Rate it yourself - /Services/careproviders/LeaveReview/DefaultView.aspx?id=1-9752855116,,,,
Mr and Mrs T A Mills - 119 Victoria Street,1-114691363,SCL,119 Victoria Street,,,Cinderford,Gloucestershire,GL14 2HU,Tel: 01594827043,No ratings yet Rate it yourself - /Services/careproviders/LeaveReview/DefaultView.aspx?id=1-114691363,0,0,,
Hands Care Agency,1-865520121,SCL,Unit D Platform 88,Ashburton Industrial Estate,,Ross On Wye,Herefordshire,HR9 7BW,Tel: 01989566186,No ratings yet Rate it yourself - /Services/careproviders/LeaveReview/DefaultView.aspx?id=1-865520121,0,0,,
SeeAbility South Gloucestershire Support Service,1-201543969,SCL,Bradbury Court,"115-117 Station Road, Henbury",,Bristol,Avon,BS10 7QH,Tel: 01179506901,No ratings yet Rate it yourself - /Services/careproviders/LeaveReview/DefaultView.aspx?id=1-201543969,0,0,,
Woodwell House,1-121511056,SCL,227-229 Nibley Road,Shirehampton,,Bristol,,BS11 9EQ,Tel: 01179381942,No ratings yet Rate it yourself - /Services/careproviders/LeaveReview/DefaultView.aspx?id=1-121511056,0,0,,
Alexandra Way Residential Care Home,1-141286773,SCL,3 Alexandra Way,,,Thornbury,Gloucestershire,BS35 1LA,Tel: 01454866172,No ratings yet Rate it yourself - /Services/careproviders/LeaveReview/DefaultView.aspx?id=1-141286773,0,0,,
Brook Farm,1-4200475951,SCL,Tramway Road,Soudley,,Cinderford,,GL14 2UG,Tel: 01594823941,No ratings yet Rate it yourself - /Services/careproviders/LeaveReview/DefaultView.aspx?id=1-4200475951,0,0,,
Glebe House Care Home,1-15944142432,SCL,5 Sundays Hill,Almondsbury,,Bristol,,BS32 4DS,Tel: 07968446880,No ratings yet Rate it yourself - /Services/careproviders/LeaveReview/DefaultView.aspx?id=1-15944142432,0,0,,
Evergreen House Care Home,1-128712304,SCL,290 Passage Road,Brentry,,Bristol,Avon,BS10 7HZ,Tel: 0117 959 3427,No ratings yet Rate it yourself - /Services/careproviders/LeaveReview/DefaultView.aspx?id=1-128712304,0,0,,
Prospect House,1-116682729,SCL,Prospect Road,,,Cinderford,Gloucestershire,GL14 2DY,Tel: 01594826246,No ratings yet Rate it yourself - /Services/careproviders/LeaveReview/DefaultView.aspx?id=1-116682729,0,0,,
Brandon Trust - 261 Passage Road Care Home,1-131451189,SCL,261 Passage Road,Henbury,,Bristol,,BS10 7JA,Tel: 01179593223,No ratings yet Rate it yourself - /Services/careproviders/LeaveReview/DefaultView.aspx?id=1-131451189,0,0,,
Ross Court Care Home,1-1040494951,SCL,Overross Close,,,Ross On Wye,Herefordshire,HR9 7BQ,Tel: 01989764349,No ratings yet Rate it yourself - /Services/careproviders/LeaveReview/DefaultView.aspx?id=1-1040494951,0,0,,
Milestones,1-126746432,SCL,9 Commercial Street,,,Cinderford,Gloucestershire,GL14 2RP,Tel: 01594825777,No ratings yet Rate it yourself - /Services/careproviders/LeaveReview/DefaultView.aspx?id=1-126746432,0,0,,
Euroclydon Nursing Home,1-113890815,SCL,Hawthorns,,,Drybrook,Gloucestershire,GL17 9BW,Tel: 01594543982,No ratings yet Rate it yourself - /Services/careproviders/LeaveReview/DefaultView.aspx?id=1-113890815,0,0,,
Hillview Care Services Limited,1-6367705664,SCL,Unit 14,The Cross,,Drybrook,Gloucestershire,GL17 9ED,Tel: 07446238723,No ratings yet Rate it yourself - /Services/careproviders/LeaveReview/DefaultView.aspx?id=1-6367705664,0,0,,
TNC Healthcare Limited,1-11829114279,SCL,8B Market Street,,,Cinderford,,GL14 2RX,Tel: 01594829311,No ratings yet Rate it yourself - /Services/careproviders/LeaveReview/DefaultView.aspx?id=1-11829114279,0,0,,
Descare Ltd,1-12155913452,SCL,"Coniston Community Centre, The Parade, Coniston Road",Patchway,,Bristol,,BS34 5LP,Tel: 01174281701,1 rating Rate it yourself - /Services/careproviders/LeaveReview/DefaultView.aspx?id=1-12155913452,,,,
Beech House - Bristol,1-114072878,SCL,Beech House,11 Prowse Close,,Thornbury,Gloucestershire,BS35 1EG,Tel: 01454412266,No ratings yet Rate it yourself - /Services/careproviders/LeaveReview/DefaultView.aspx?id=1-114072878,0,0,,
Springbank,1-128359121,SCL,1 Charlton Lane,Brentry,,Bristol,,BS10 6SG,Tel: 01179505220,No ratings yet Rate it yourself - /Services/careproviders/LeaveReview/DefaultView.aspx?id=1-128359121,0,0,,
Swift Care Services Ltd,1-18393400708,SCL,70 Arlingham Way,Patchway,,Bristol,,BS34 5NF,,No ratings yet Rate it yourself - /Services/careproviders/LeaveReview/DefaultView.aspx?id=1-18393400708,0,0,,
Bramble Home Care LTD - Cinderford,1-12857433035,SCL,6,High Street,,Cinderford,,GL14 2SH,Tel: 01684217040,No ratings yet Rate it yourself - /Services/careproviders/LeaveReview/DefaultView.aspx?id=1-12857433035,0,0,,
Caremark (Herefordshire and Forest of Dean),1-9074704180,SCL,Briarwood Chambers,15 High Street,,Cinderford,,GL14 2SE,Tel: 01432367672,No ratings yet Rate it yourself - /Services/careproviders/LeaveReview/DefaultView.aspx?id=1-9074704180,0,0,,
Bristol North Rehabilitation Care Services,1-134353743,SCL,20 Ellsworth Road,Henbury,,Bristol,,BS10 7EH,Tel: 01173773354,No ratings yet Rate it yourself - /Services/careproviders/LeaveReview/DefaultView.aspx?id=1-134353743,0,0,,
Crossroads Care - Forest of Dean and Herefordshire,1-686752377,SCL,St Annals House,"The Belle Vue Centre, Belle Vue Road",,Cinderford,Gloucestershire,GL14 2AB,Tel: 01594823414,1 rating Rate it yourself - /Services/careproviders/LeaveReview/DefaultView.aspx?id=1-686752377,,,,
58 Crantock Drive,1-118415243,SCL,Almondsbury,,,Bristol,,BS32 4HG,Tel: 01454614941,No ratings yet Rate it yourself - /Services/careproviders/LeaveReview/DefaultView.aspx?id=1-118415243,0,0,,
Sydenham House,1-5183556577,SCL,High Street,,,Blakeney,Gloucestershire,GL15 4EB,Tel: 01594517015,No ratings yet Rate it yourself - /Services/careproviders/LeaveReview/DefaultView.aspx?id=1-5183556577,0,0,,
Argentum Lodge,1-5737046689,SCL,81 Silver Street,Nailsea,,Bristol,Avon,BS48 2DS,Tel: 01275850430,No ratings yet Rate it yourself - /Services/careproviders/LeaveReview/DefaultView.aspx?id=1-5737046689,0,0,,
Clover Health and Homecare HQ,1-17586377135,SCL,"Regus Brunel Office, 2430/2440 The Quadrant","Aztec West, Almondsbury",,Bristol,,BS32 4AQ,Tel: 07496372965,No ratings yet Rate it yourself - /Services/careproviders/LeaveReview/DefaultView.aspx?id=1-17586377135,0,0,,
Sylviancare South Gloucester,1-14573534497,SCL,2430-2440 The Quadrant,"Aztec West, Almondsbury",,Bristol,Avon,BS32 4AQ,,No ratings yet Rate it yourself - /Services/careproviders/LeaveReview/DefaultView.aspx?id=1-14573534497,0,0,,
Afon Healthcare Ltd,1-15976401764,SCL,2430 The Quadrant,"Aztec West, Almondsbury",,Bristol,,BS32 4AQ,Tel: 07412211165,No ratings yet Rate it yourself - /Services/careproviders/LeaveReview/DefaultView.aspx?id=1-15976401764,0,0,,
Unique Community Services,1-15944726932,SCL,2510 Aztec West,Bradley Stoke,,Bristol,,BS32 4AQ,Tel: 01174509378,No ratings yet Rate it yourself - /Services/careproviders/LeaveReview/DefaultView.aspx?id=1-15944726932,0,0,,
Nurseline Community Services Ltd,1-7486181315,SCL,2510 The Quadrant,"Aztec West, Almondsbury",,Bristol,,BS32 4AQ,Tel: 01174030943,2 ratings Rate it yourself - /Services/careproviders/LeaveReview/DefaultView.aspx?id=1-7486181315,,,,
The Village Care Group Limited,1-14272388061,SCL,41,"Oakleaze Road, Thornbury",,Bristol,,BS35 2LW,Tel: 03333355722,No ratings yet Rate it yourself - /Services/careproviders/LeaveReview/DefaultView.aspx?id=1-14272388061,0,0,,
Macrita Healthcare - Main Office,1-11475350171,SCL,Aztec Centre,"Aztec West, Almondsbury",,Bristol,,BS32 4TD,Tel: 01173361135,No ratings yet Rate it yourself - /Services/careproviders/LeaveReview/DefaultView.aspx?id=1-11475350171,0,0,,