Organisation Name,NACS Code,Organisation Type,Address1,Address2,Address3,Address4,Address5,PostCode,Telephone Number,NHS.UK users rating,Value  (NHS.UK users rating),Banding Classification  (NHS.UK users rating),Car parking (Is there car parking at this organisation?),Disabled access (Disabled access)
Whitchurch House,1-121851327,SCL,Whitchurch,,,Ross-on-Wye,Herefordshire,HR9 6BZ,Tel: 01600 890656,No ratings yet Rate it yourself - /Services/careproviders/LeaveReview/DefaultView.aspx?id=1-121851327,0,0,,
The Orchard,1-2899703240,SCL,Ganarew,,,Monmouth,,NP25 3SS,Tel: 01600891450,No ratings yet Rate it yourself - /Services/careproviders/LeaveReview/DefaultView.aspx?id=1-2899703240,0,0,,
Ganarew House Care Home,1-143956718,SCL,Ganarew,,,Monmouth,Herefordshire,NP25 3SS,Tel: 01600890273,No ratings yet Rate it yourself - /Services/careproviders/LeaveReview/DefaultView.aspx?id=1-143956718,0,0,,
Hazelhurst Nursing Home,1-2724084240,SCL,Bishopswood,,,Ross On Wye,Herefordshire,HR9 5QX,Tel: 01600890600,1 rating Rate it yourself - /Services/careproviders/LeaveReview/DefaultView.aspx?id=1-2724084240,,,,
The Orchards,1-119801936,SCL,Stowfield,,,Lower Lydbrook,Gloucestershire,GL17 9PD,Tel: 01594861137,No ratings yet Rate it yourself - /Services/careproviders/LeaveReview/DefaultView.aspx?id=1-119801936,0,0,,
Weir End House,1-350356368,SCL,Glewstone,,,Ross On Wye,Herefordshire,HR9 6AL,Tel: 01989567711,No ratings yet Rate it yourself - /Services/careproviders/LeaveReview/DefaultView.aspx?id=1-350356368,0,0,,
Woodpecker Lodge,1-350380482,SCL,Weir End House,Weir End,,Ross On Wye,Herefordshire,HR9 6AL,Tel: 01989567711,No ratings yet Rate it yourself - /Services/careproviders/LeaveReview/DefaultView.aspx?id=1-350380482,0,0,,
West Bank Residential Home,1-486739010,SCL,Walford Road,,,Ross-on-Wye,Herefordshire,HR9 5PQ,Tel: 01989562741,1 rating Rate it yourself - /Services/careproviders/LeaveReview/DefaultView.aspx?id=1-486739010,,,,
Rosedale Retirement Home,1-405532018,SCL,Ashfield Crescent,,,Ross On Wye,Herefordshire,HR9 5PH,Tel: 01989218082,No ratings yet Rate it yourself - /Services/careproviders/LeaveReview/DefaultView.aspx?id=1-405532018,0,0,,
The Elms,1-6858422842,SCL,Staunton,,,Coleford,Gloucestershire,GL16 8NX,Tel: 01594832394,No ratings yet Rate it yourself - /Services/careproviders/LeaveReview/DefaultView.aspx?id=1-6858422842,0,0,,
Chepstow House,1-111393260,SCL,Old Maids Walk,,,Ross On Wye,Herefordshire,HR9 5HB,Tel: 01989566027,No ratings yet Rate it yourself - /Services/careproviders/LeaveReview/DefaultView.aspx?id=1-111393260,0,0,,
Aspire Living - 1-2 Markyes Close,1-121620583,SCL,1-2 Markyes Close,,,Ross on Wye,Herefordshire,HR9 7BZ,Tel: 01989769035,No ratings yet Rate it yourself - /Services/careproviders/LeaveReview/DefaultView.aspx?id=1-121620583,0,0,,
Stable Cottage,1-133299228,SCL,Upper Moraston,Sellack,,Ross On Wye,Herefordshire,HR9 6RE,Tel: 01989730491,No ratings yet Rate it yourself - /Services/careproviders/LeaveReview/DefaultView.aspx?id=1-133299228,0,0,,
Tithe Barn,1-133299258,SCL,Upper Moraston,Sellack,,Ross On Wye,Herefordshire,HR9 6RE,Tel: 01989730491,1 rating Rate it yourself - /Services/careproviders/LeaveReview/DefaultView.aspx?id=1-133299258,,,,
Ashfield Care Ltd,1-582310149,SCL,Ashfield Care,Chase Industrial Estate,,Ross-on-Wye,Herefordshire,HR9 5WA,Tel: 01989565309,No ratings yet Rate it yourself - /Services/careproviders/LeaveReview/DefaultView.aspx?id=1-582310149,0,0,,
Total Living Care,1-1520389628,SCL,"Haigh Main Building, Haigh Engineering Co Ltd","Alton Road, Ross-on-wye",,Ross-on-wye,,HR9 5NG,Tel: 01989562000,1 rating Rate it yourself - /Services/careproviders/LeaveReview/DefaultView.aspx?id=1-1520389628,,,,
Hands Care Agency,1-865520121,SCL,Unit D Platform 88,Ashburton Industrial Estate,,Ross On Wye,Herefordshire,HR9 7BW,Tel: 01989566186,No ratings yet Rate it yourself - /Services/careproviders/LeaveReview/DefaultView.aspx?id=1-865520121,0,0,,
OSJCT The Coombs,1-122144985,SCL,The Gorse,,,Coleford,Gloucestershire,GL16 8QE,Tel: 01594833200,1 rating Rate it yourself - /Services/careproviders/LeaveReview/DefaultView.aspx?id=1-122144985,,,,
GL1 Support Services,1-4234293193,SCL,Innovation Spaces,Mile End Road,,Coleford,Gloucestershire,GL16 7QD,Tel: 01594368160,No ratings yet Rate it yourself - /Services/careproviders/LeaveReview/DefaultView.aspx?id=1-4234293193,0,0,,
Ross Court Care Home,1-1040494951,SCL,Overross Close,,,Ross On Wye,Herefordshire,HR9 7BQ,Tel: 01989764349,No ratings yet Rate it yourself - /Services/careproviders/LeaveReview/DefaultView.aspx?id=1-1040494951,0,0,,
Gloucestershire Domiciliary Care Branch,1-1949337796,SCL,16 Bank Street,,,Coleford,Gloucestershire,GL16 8BA,Tel: 01594540312,No ratings yet Rate it yourself - /Services/careproviders/LeaveReview/DefaultView.aspx?id=1-1949337796,0,0,,
Market Place,1-114591935,SCL,29 Market Place,,,Coleford,Gloucestershire,GL16 8AA,Tel: 01594834595,No ratings yet Rate it yourself - /Services/careproviders/LeaveReview/DefaultView.aspx?id=1-114591935,0,0,,
The Orchard Trust - Sevenoaks,1-119801993,SCL,Lords Hill,,,Coleford,Gloucestershire,GL16 8BG,Tel: 01594861137,No ratings yet Rate it yourself - /Services/careproviders/LeaveReview/DefaultView.aspx?id=1-119801993,0,0,,
Hilltop,1-119801976,SCL,Ridge Walk,,,Ruardean Hill,Gloucestershire,GL17 9AY,Tel: 01594861137,No ratings yet Rate it yourself - /Services/careproviders/LeaveReview/DefaultView.aspx?id=1-119801976,0,0,,
The Orchard Trust Domiciliary Care Agency,1-119802010,SCL,Hilltop,Ridge Walk,,Ruardean,Gloucestershire,GL17 9AY,Tel: 01594861137,No ratings yet Rate it yourself - /Services/careproviders/LeaveReview/DefaultView.aspx?id=1-119802010,0,0,,
Euroclydon Nursing Home,1-113890815,SCL,Hawthorns,,,Drybrook,Gloucestershire,GL17 9BW,Tel: 01594543982,No ratings yet Rate it yourself - /Services/careproviders/LeaveReview/DefaultView.aspx?id=1-113890815,0,0,,
Hillview Care Services Limited,1-6367705664,SCL,Unit 14,The Cross,,Drybrook,Gloucestershire,GL17 9ED,Tel: 07446238723,No ratings yet Rate it yourself - /Services/careproviders/LeaveReview/DefaultView.aspx?id=1-6367705664,0,0,,
HF Trust - Forest of Dean DCA,1-2584137596,SCL,Ormiston,"Edenwall, Coalway",,Coleford,Gloucestershire,GL16 7HN,Tel: 01594834763,No ratings yet Rate it yourself - /Services/careproviders/LeaveReview/DefaultView.aspx?id=1-2584137596,0,0,,
BBcare10 LTD,1-15268486355,SCL,Office 45,Vantage Point Business Village,,Mitcheldean,,GL17 0DD,Tel: 01594806110,No ratings yet Rate it yourself - /Services/careproviders/LeaveReview/DefaultView.aspx?id=1-15268486355,0,0,,
Mr and Mrs T A Mills - 119 Victoria Street,1-114691363,SCL,119 Victoria Street,,,Cinderford,Gloucestershire,GL14 2HU,Tel: 01594827043,No ratings yet Rate it yourself - /Services/careproviders/LeaveReview/DefaultView.aspx?id=1-114691363,0,0,,
Caremark (Herefordshire and Forest of Dean),1-9074704180,SCL,Briarwood Chambers,15 High Street,,Cinderford,,GL14 2SE,Tel: 01432367672,No ratings yet Rate it yourself - /Services/careproviders/LeaveReview/DefaultView.aspx?id=1-9074704180,0,0,,
TNC Healthcare Limited,1-11829114279,SCL,8B Market Street,,,Cinderford,,GL14 2RX,Tel: 01594829311,No ratings yet Rate it yourself - /Services/careproviders/LeaveReview/DefaultView.aspx?id=1-11829114279,0,0,,
Bramble Home Care LTD - Cinderford,1-12857433035,SCL,6,High Street,,Cinderford,,GL14 2SH,Tel: 01684217040,No ratings yet Rate it yourself - /Services/careproviders/LeaveReview/DefaultView.aspx?id=1-12857433035,0,0,,
Milestones,1-126746432,SCL,9 Commercial Street,,,Cinderford,Gloucestershire,GL14 2RP,Tel: 01594825777,No ratings yet Rate it yourself - /Services/careproviders/LeaveReview/DefaultView.aspx?id=1-126746432,0,0,,
Prospect House,1-116682729,SCL,Prospect Road,,,Cinderford,Gloucestershire,GL14 2DY,Tel: 01594826246,No ratings yet Rate it yourself - /Services/careproviders/LeaveReview/DefaultView.aspx?id=1-116682729,0,0,,
Forest Court Care Home,1-6534200936,SCL,Bradley Court Road,,,Mitcheldean,Gloucestershire,GL17 0DR,Tel: 01989750775,No ratings yet Rate it yourself - /Services/careproviders/LeaveReview/DefaultView.aspx?id=1-6534200936,0,0,,
BBcare10,1-10410348422,SCL,Bradley Court Road,,,Mitcheldean,,GL17 0DR,Tel: 07932105542,No ratings yet Rate it yourself - /Services/careproviders/LeaveReview/DefaultView.aspx?id=1-10410348422,0,0,,
Crossroads Care - Forest of Dean and Herefordshire,1-686752377,SCL,St Annals House,"The Belle Vue Centre, Belle Vue Road",,Cinderford,Gloucestershire,GL14 2AB,Tel: 01594823414,1 rating Rate it yourself - /Services/careproviders/LeaveReview/DefaultView.aspx?id=1-686752377,,,,
Red House,1-133299168,SCL,65 Ruspidge Road,,,Cinderford,Gloucestershire,GL14 3AW,Tel: 01594822100,No ratings yet Rate it yourself - /Services/careproviders/LeaveReview/DefaultView.aspx?id=1-133299168,0,0,,
Hobbits Holt,1-133288016,SCL,156 Ruspidge Road,Cinderford,,Gloucester,Gloucestershire,GL14 3AP,Tel: 01594823554,1 rating Rate it yourself - /Services/careproviders/LeaveReview/DefaultView.aspx?id=1-133288016,,,,
Hunters Lodge,1-129478911,SCL,Bryngwym Manor,Wormelow,,Hereford,Herefordshire,HR2 8EQ,,No ratings yet Rate it yourself - /Services/careproviders/LeaveReview/DefaultView.aspx?id=1-129478911,0,0,,
Falcons Rest and Poachers Cottage,1-1475546693,SCL,Falcons Rest,Bryngwyn,,Wormelow,Herefordshire,HR2 8EQ,Tel: 01981542130,No ratings yet Rate it yourself - /Services/careproviders/LeaveReview/DefaultView.aspx?id=1-1475546693,0,0,,
Birches Grove,1-350333178,SCL,14 Fairmoor Close,Parkend,,Lydney,Gloucestershire,GL15 4HB,Tel: 01594564081,No ratings yet Rate it yourself - /Services/careproviders/LeaveReview/DefaultView.aspx?id=1-350333178,0,0,,
The Old Rectory,1-118868146,SCL,School Lane,Church Road,,Longhope,Gloucestershire,GL17 0LJ,Tel: 01452831135,1 rating Rate it yourself - /Services/careproviders/LeaveReview/DefaultView.aspx?id=1-118868146,,,,
Longhope Manor,1-113063398,SCL,Church Road,,,Longhope,Gloucestershire,GL17 0LL,Tel: 01452830291,1 rating Rate it yourself - /Services/careproviders/LeaveReview/DefaultView.aspx?id=1-113063398,,,,
Brook Lodge,1-1440848763,SCL,Latchen,,,Longhope,,GL17 0QA,Tel: 01452830614,No ratings yet Rate it yourself - /Services/careproviders/LeaveReview/DefaultView.aspx?id=1-1440848763,0,0,,
Brockhampton Court Nursing Home Ltd,1-15756457316,SCL,Brockhampton Court Care Home,Brockhampton,,Hereford,,HR1 4TQ,Tel: 01989740239,No ratings yet Rate it yourself - /Services/careproviders/LeaveReview/DefaultView.aspx?id=1-15756457316,0,0,,
Brook Farm,1-4200475951,SCL,Tramway Road,Soudley,,Cinderford,,GL14 2UG,Tel: 01594823941,No ratings yet Rate it yourself - /Services/careproviders/LeaveReview/DefaultView.aspx?id=1-4200475951,0,0,,
Charnwood Country Residence,1-121568293,SCL,Much Dewchurch,King's Thorn,,Hereford,Herefordshire,HR2 8DL,Tel: 01981540291,No ratings yet Rate it yourself - /Services/careproviders/LeaveReview/DefaultView.aspx?id=1-121568293,0,0,,
Arise Healthcare Ltd,1-13946345835,SCL,Unit 1 B & C,"Parkend Road, Whitecroft",,Lydney,,GL15 4PA,Tel: 01594564475,No ratings yet Rate it yourself - /Services/careproviders/LeaveReview/DefaultView.aspx?id=1-13946345835,0,0,,
Gloucester Communities,1-361555356,SCL,Grange Village,Littledean Road,,Newnham,,GL14 1HJ,Tel: 01594516551,No ratings yet Rate it yourself - /Services/careproviders/LeaveReview/DefaultView.aspx?id=1-361555356,0,0,,
Walsingham Support - Pound Farm,1-5919607536,SCL,Pound Farm,Gorsley,,Ross-on-wye,,HR9 7SL,Tel: 01989720546,No ratings yet Rate it yourself - /Services/careproviders/LeaveReview/DefaultView.aspx?id=1-5919607536,0,0,,
Apple Orchard,1-114691347,SCL,The Green,Dean Road,,Newnham,Gloucestershire,GL14 1AQ,Tel: 01594516582,No ratings yet Rate it yourself - /Services/careproviders/LeaveReview/DefaultView.aspx?id=1-114691347,0,0,,
Riverside House,1-126746456,SCL,Riverside House,"Quay Lane, Broadoak",,Newnham On Severn,Gloucestershire,GL14 1JE,,No ratings yet Rate it yourself - /Services/careproviders/LeaveReview/DefaultView.aspx?id=1-126746456,0,0,,
Stepping Stones,1-126746256,SCL,Riverside Lane,Broadoak,,Newnham,Gloucestershire,GL14 1JF,,1 rating Rate it yourself - /Services/careproviders/LeaveReview/DefaultView.aspx?id=1-126746256,,,,
Dean Grange,1-126746444,SCL,Dean Grange,Elton Corner,,Broadoak,Gloucestershire,GL14 1JG,,No ratings yet Rate it yourself - /Services/careproviders/LeaveReview/DefaultView.aspx?id=1-126746444,0,0,,
Sydenham House,1-5183556577,SCL,High Street,,,Blakeney,Gloucestershire,GL15 4EB,Tel: 01594517015,No ratings yet Rate it yourself - /Services/careproviders/LeaveReview/DefaultView.aspx?id=1-5183556577,0,0,,
The Old Vicarage [Blakeney],1-126746468,SCL,The Old Vicarage,Church Square,,Blakeney,Gloucestershire,GL15 4DS,Tel: 01594517098,No ratings yet Rate it yourself - /Services/careproviders/LeaveReview/DefaultView.aspx?id=1-126746468,0,0,,
Yew Tree House,1-134382088,SCL,Church Square,,,Blakeney,Gloucestershire,GL15 4DX,Tel: 01594517023,No ratings yet Rate it yourself - /Services/careproviders/LeaveReview/DefaultView.aspx?id=1-134382088,0,0,,
Footsteps Medical Care Limited,1-117511444,SCL,"The Byre, Allastone Court Farm",Court Road,,Lydney,Gloucestershire,GL15 5SR,Tel: 01594844244,No ratings yet Rate it yourself - /Services/careproviders/LeaveReview/DefaultView.aspx?id=1-117511444,0,0,,
Coppice House,1-2846051322,SCL,Main Road,Huntley,,Gloucester,Gloucestershire,GL19 3DZ,Tel: 01452831896,No ratings yet Rate it yourself - /Services/careproviders/LeaveReview/DefaultView.aspx?id=1-2846051322,0,0,,
Here4Care LTD Office,1-6344728831,SCL,Unit 4 Knockerhill Farm,Callow,,Hereford,,HR2 8BP,Tel: 07807338540,No ratings yet Rate it yourself - /Services/careproviders/LeaveReview/DefaultView.aspx?id=1-6344728831,0,0,,
The Laurels,1-2488910175,SCL,Main Road,Huntley,,Gloucester,Gloucestershire,GL19 3EA,Tel: 01452901243,No ratings yet Rate it yourself - /Services/careproviders/LeaveReview/DefaultView.aspx?id=1-2488910175,0,0,,
Highfields Residential/Dementia Care Home,1-13940784670,SCL,Culver Street,,,Newent,,GL18 1JA,Tel: 07977776457,No ratings yet Rate it yourself - /Services/careproviders/LeaveReview/DefaultView.aspx?id=1-13940784670,0,0,,
Nodens Manor Care Home,1-15014252533,SCL,Naas Lane,,,Lydney,,GL15 5AU,,No ratings yet Rate it yourself - /Services/careproviders/LeaveReview/DefaultView.aspx?id=1-15014252533,0,0,,
Easy Living Solutions,1-2711584339,SCL,10 Broad Street,,,Newent,Gloucestershire,GL18 1AH,Tel: 01531820556,No ratings yet Rate it yourself - /Services/careproviders/LeaveReview/DefaultView.aspx?id=1-2711584339,0,0,,
OSJCT Rodley House,1-122144942,SCL,Harrison Way,,,Lydney,Gloucestershire,GL15 5BB,Tel: 01594842778,No ratings yet Rate it yourself - /Services/careproviders/LeaveReview/DefaultView.aspx?id=1-122144942,0,0,,
Sunnyside House,1-2847247762,SCL,"Main Road, Birdwood",,,Gloucester,Gloucestershire,GL19 3EH,Tel: 01452750152,No ratings yet Rate it yourself - /Services/careproviders/LeaveReview/DefaultView.aspx?id=1-2847247762,0,0,,
Kemble Developments Limited,1-14859231925,SCL,Sigeric Business Park,Holme Lacy Road,,Hereford,Herefordshire,HR2 6BQ,Tel: 01432352443,No ratings yet Rate it yourself - /Services/careproviders/LeaveReview/DefaultView.aspx?id=1-14859231925,0,0,,
Alina Homecare - Hereford,1-12213682821,SCL,"Suite 4, Stirling House","Centenary Park, Skylon Central",,Hereford,,HR2 6FJ,Tel: 01432513722,No ratings yet Rate it yourself - /Services/careproviders/LeaveReview/DefaultView.aspx?id=1-12213682821,0,0,,
Home Instead Senior Care,1-8297590541,SCL,11 Rural Enterprise Centre,"Vincent Carey Road, Rotherwas Industrial Estate",,Hereford,,HR2 6FE,Tel: 01432804000,No ratings yet Rate it yourself - /Services/careproviders/LeaveReview/DefaultView.aspx?id=1-8297590541,0,0,,
Chaxhill Hall,1-143327369,SCL,Chaxhill,,,Nr Westbury on Severn,Gloucestershire,GL14 1QW,Tel: 01452760717,No ratings yet Rate it yourself - /Services/careproviders/LeaveReview/DefaultView.aspx?id=1-143327369,0,0,,
Charles Court Care Home,1-126476591,SCL,The Ploughman,,,Hereford,Herefordshire,HR2 6GG,Tel: 01432374330,No ratings yet Rate it yourself - /Services/careproviders/LeaveReview/DefaultView.aspx?id=1-126476591,0,0,,
Quality Care @ Home,1-1846171018,SCL,"Suite 4B, Thorn Office Centre",Thorn Business Park,,Hereford,,HR2 6JT,Tel: 01432639736,No ratings yet Rate it yourself - /Services/careproviders/LeaveReview/DefaultView.aspx?id=1-1846171018,0,0,,
Gatwick House,1-124274265,SCL,Upper Rodley Road,Bollow,,Westbury On Severn,Gloucestershire,GL14 1QU,Tel: 01452760164,No ratings yet Rate it yourself - /Services/careproviders/LeaveReview/DefaultView.aspx?id=1-124274265,0,0,,
Hill Ash House Care Centre,1-6538674073,SCL,Ledbury Road,,,Dymock,,GL18 2DB,Tel: 01531892980,No ratings yet Rate it yourself - /Services/careproviders/LeaveReview/DefaultView.aspx?id=1-6538674073,0,0,,
Field Farm House Residential Home,1-119287799,SCL,Hampton Bishop,,,Hereford,Herefordshire,HR1 4JP,,1 rating Rate it yourself - /Services/careproviders/LeaveReview/DefaultView.aspx?id=1-119287799,,,,
Hillside Care Centre,1-13266974097,SCL,9 Pentwyn Avenue,,,Hereford,,HR2 7LB,Tel: 01432261627,No ratings yet Rate it yourself - /Services/careproviders/LeaveReview/DefaultView.aspx?id=1-13266974097,0,0,,
H.M. Care Agency,1-2209588099,SCL,172 Ross Road,,,Hereford,Herefordshire,HR2 7PH,Tel: 01432360518,No ratings yet Rate it yourself - /Services/careproviders/LeaveReview/DefaultView.aspx?id=1-2209588099,0,0,,
Sophie House,1-473349271,SCL,Holywell Gutter Lane,,,Hampton Bishop,Herefordshire,HR1 4JN,Tel: 01432378149,No ratings yet Rate it yourself - /Services/careproviders/LeaveReview/DefaultView.aspx?id=1-473349271,0,0,,
Gwen Walford House,1-2259504714,SCL,48-50 Hampton Park Road,,,Hereford,Herefordshire,HR1 1TH,Tel: 01432272418,1 rating Rate it yourself - /Services/careproviders/LeaveReview/DefaultView.aspx?id=1-2259504714,,,,
Hampton Grange Nursing Home,1-2289805209,SCL,48-50 Hampton Park Road,,,Hereford,Herefordshire,HR1 1TH,Tel: 01432272418,No ratings yet Rate it yourself - /Services/careproviders/LeaveReview/DefaultView.aspx?id=1-2289805209,0,0,,
Aston House,1-10048660596,SCL,45 Hampton Park Road,,,Hereford,Herefordshire,HR1 1TJ,Tel: 01432267996,No ratings yet Rate it yourself - /Services/careproviders/LeaveReview/DefaultView.aspx?id=1-10048660596,0,0,,
Martha House,1-113958355,SCL,"Martha House, Hampton Green",Old Eign Hill,,Hereford,Herefordshire,HR1 1UB,Tel: 01432279314,No ratings yet Rate it yourself - /Services/careproviders/LeaveReview/DefaultView.aspx?id=1-113958355,0,0,,
The Trio House,1-152560698,SCL,15 Abbotsmead Road,Belmont,,Hereford,Herefordshire,HR2 7SH,Tel: 01432342416,No ratings yet Rate it yourself - /Services/careproviders/LeaveReview/DefaultView.aspx?id=1-152560698,0,0,,
Brockington House Care Community,1-7237908552,SCL,Hafod Road,,,Hereford,,HR1 1SQ,Tel: 01432623301,No ratings yet Rate it yourself - /Services/careproviders/LeaveReview/DefaultView.aspx?id=1-7237908552,0,0,,
National Star at Ledbury Road,1-7740554773,SCL,1,Ledbury Road,,Hereford,,HR1 2SX,Tel: 01432802925,No ratings yet Rate it yourself - /Services/careproviders/LeaveReview/DefaultView.aspx?id=1-7740554773,0,0,,
Eastbank,1-116698252,SCL,26 Ledbury Road,,,Hereford,Herefordshire,HR1 2SY,Tel: 01432266177,No ratings yet Rate it yourself - /Services/careproviders/LeaveReview/DefaultView.aspx?id=1-116698252,0,0,,
Noble Manor,1-11896216140,SCL,Ledbury Court,Ledbury Road,,Hereford,Herefordshire,HR1 2SZ,,No ratings yet Rate it yourself - /Services/careproviders/LeaveReview/DefaultView.aspx?id=1-11896216140,0,0,,
New Hope Care Hereford,1-13727045202,SCL,3 Jubilee Building,Faraday Road,,Hereford,,HR4 9BB,Tel: 01432350057,No ratings yet Rate it yourself - /Services/careproviders/LeaveReview/DefaultView.aspx?id=1-13727045202,0,0,,
Home First,1-13258077198,SCL,Town Hall,10 St. Owen Street,,Hereford,,HR1 2PJ,Tel: 01432216766,No ratings yet Rate it yourself - /Services/careproviders/LeaveReview/DefaultView.aspx?id=1-13258077198,0,0,,
Candela Healthcare Ltd,1-12566526711,SCL,"No. 5A, Former Magistrates Court",Gaol Street,,Hereford,,HR1 2HU,,No ratings yet Rate it yourself - /Services/careproviders/LeaveReview/DefaultView.aspx?id=1-12566526711,0,0,,
Oaklands Nursing Home,1-137884892,SCL,43 Bodenham Road,,,Hereford,Herefordshire,HR1 2TP,Tel: 01432272775,2 ratings Rate it yourself - /Services/careproviders/LeaveReview/DefaultView.aspx?id=1-137884892,,,,
Joghide Home Care (Worcestershire),1-9043434272,SCL,"Suite 2, Third Floor, Kemble House",36-39 Broad Street,,Hereford,,HR4 9AR,Tel: 07726402204,No ratings yet Rate it yourself - /Services/careproviders/LeaveReview/DefaultView.aspx?id=1-9043434272,0,0,,
Katherine Harriet,1-3007109115,SCL,9 Broad Street,,,Hereford,,HR4 9AP,Tel: 01432483083,No ratings yet Rate it yourself - /Services/careproviders/LeaveReview/DefaultView.aspx?id=1-3007109115,0,0,,
One Team Domiciliary,1-11064506667,SCL,Unit 5,26-28 Aubrey Street,,Hereford,,HR4 0BU,Tel: 07730432302,No ratings yet Rate it yourself - /Services/careproviders/LeaveReview/DefaultView.aspx?id=1-11064506667,0,0,,
Broomy Hill Nursing Home,1-121455542,SCL,43 Breinton Road,,,Hereford,Herefordshire,HR4 0JY,Tel: 01432274474,No ratings yet Rate it yourself - /Services/careproviders/LeaveReview/DefaultView.aspx?id=1-121455542,0,0,,
Lyndale,1-117283322,SCL,24 Southbank Close,,,Hereford,Herefordshire,HR1 2TQ,Tel: 01432378118,No ratings yet Rate it yourself - /Services/careproviders/LeaveReview/DefaultView.aspx?id=1-117283322,0,0,,
Southbank,1-12369615149,SCL,4 Southbank Close,,,Hereford,Herefordshire,HR1 2TQ,Tel: 01432261766,No ratings yet Rate it yourself - /Services/careproviders/LeaveReview/DefaultView.aspx?id=1-12369615149,0,0,,
Livability Wall Street,1-119325067,SCL,14 Wall Street,,,Hereford,Herefordshire,HR4 9HP,Tel: 01432342683,No ratings yet Rate it yourself - /Services/careproviders/LeaveReview/DefaultView.aspx?id=1-119325067,0,0,,
Aspire Support,1-2206520209,SCL,Aspire Community Hub,Canal Road,,Hereford,Herefordshire,HR1 2EA,Tel: 01432266881,No ratings yet Rate it yourself - /Services/careproviders/LeaveReview/DefaultView.aspx?id=1-2206520209,0,0,,
Radis Community Care (Hereford Supported Living),1-6253913911,SCL,Henffordd Gardens,Penhaligon Way,,Hereford,,HR4 9YJ,Tel: 07562437921,No ratings yet Rate it yourself - /Services/careproviders/LeaveReview/DefaultView.aspx?id=1-6253913911,0,0,,
Herefordshire Shared Lives,1-5985974050,SCL,County Offices,Plough Lane,,Hereford,Herefordshire,HR4 0LE,,1 rating Rate it yourself - /Services/careproviders/LeaveReview/DefaultView.aspx?id=1-5985974050,,,,
Elgar Care Ltd,1-3081986036,SCL,178 Widemarsh Street,,,Hereford,,HR4 9HN,Tel: 01432507560,No ratings yet Rate it yourself - /Services/careproviders/LeaveReview/DefaultView.aspx?id=1-3081986036,0,0,,
Lammas Lodge,1-350355992,SCL,Lugwardine,,,Hereford,Herefordshire,HR1 4DS,Tel: 01432853185,No ratings yet Rate it yourself - /Services/careproviders/LeaveReview/DefaultView.aspx?id=1-350355992,0,0,,
First Key Hereford,1-4695602718,SCL,13 Holmer Street,,,Hereford,Herefordshire,HR4 0HS,Tel: 01432342402,No ratings yet Rate it yourself - /Services/careproviders/LeaveReview/DefaultView.aspx?id=1-4695602718,0,0,,
Dulas Court,1-111205665,SCL,Dulas,Ewyas Harold,,Hereford,Herefordshire,HR2 0HL,Tel: 01981240214,No ratings yet Rate it yourself - /Services/careproviders/LeaveReview/DefaultView.aspx?id=1-111205665,0,0,,
Altogether Care,1-2172230912,SCL,Nestcliffe House,"Fields Yard, Plough Lane",,Hereford,Herefordshire,HR4 0EL,Tel: 01432344844,No ratings yet Rate it yourself - /Services/careproviders/LeaveReview/DefaultView.aspx?id=1-2172230912,0,0,,
Blackwells,1-120393554,SCL,210 Whitecross Road,,,Hereford,Herefordshire,HR4 0DJ,Tel: 01432350853,No ratings yet Rate it yourself - /Services/careproviders/LeaveReview/DefaultView.aspx?id=1-120393554,0,0,,