Organisation Name,NACS Code,Organisation Type,Address1,Address2,Address3,Address4,Address5,PostCode,Telephone Number,NHS.UK users rating,Value  (NHS.UK users rating),Banding Classification  (NHS.UK users rating),Car parking (Is there car parking at this organisation?),Disabled access (Disabled access)
Heanor Park Care Home,1-7899174085,SCL,Ilkeston Road,,,Heanor,,DE75 7DT,Tel: 01159346090,No ratings yet Rate it yourself - /Services/careproviders/LeaveReview/DefaultView.aspx?id=1-7899174085,0,0,,
Derbyshire Regional Office (Eden Supported Living Limited),1-6064200278,SCL,Bluebell Court,Bluebell Way,,Heanor,,DE75 7RF,Tel: 01636555140,No ratings yet Rate it yourself - /Services/careproviders/LeaveReview/DefaultView.aspx?id=1-6064200278,0,0,,
Gentle Hands Home Care,1-2731608549,SCL,Kable House,"Amber Drive, Langley Mill",,Nottingham,Nottinghamshire,NG16 4BE,Tel: 01773713935,No ratings yet Rate it yourself - /Services/careproviders/LeaveReview/DefaultView.aspx?id=1-2731608549,0,0,,
Ashfields Care Home,1-1673105354,SCL,34 Mansfield Road,,,Heanor,Derbyshire,DE75 7AQ,Tel: 01773 712664,No ratings yet Rate it yourself - /Services/careproviders/LeaveReview/DefaultView.aspx?id=1-1673105354,0,0,,
Florence Shipley Residential and Community Care Centre,1-2492798155,SCL,Market Place,,,Heanor,Derbyshire,DE75 7AA,Tel: 01629531367,2 ratings Rate it yourself - /Services/careproviders/LeaveReview/DefaultView.aspx?id=1-2492798155,,,,
Langley Homes,1-8583130735,SCL,Peel Street Villas 37a - 39,"Station Road, Langley Mill",,Nottingham,,NG16 4DQ,Tel: 01332470256,No ratings yet Rate it yourself - /Services/careproviders/LeaveReview/DefaultView.aspx?id=1-8583130735,0,0,,
Shipley Lodge,1-130502736,SCL,94 Derby Road,,,Heanor,Derbyshire,DE75 7QJ,Tel: 01773535212,No ratings yet Rate it yourself - /Services/careproviders/LeaveReview/DefaultView.aspx?id=1-130502736,0,0,,
Shirecare,1-17713452805,SCL,"Bradgate House, Derby Road",,,Heanor,,DE75 7QL,Tel: 01629583304,No ratings yet Rate it yourself - /Services/careproviders/LeaveReview/DefaultView.aspx?id=1-17713452805,0,0,,
Lawrence Mews,1-124361099,SCL,132 Church Street,Eastwood,,Nottingham,Nottinghamshire,NG16 3HT,Tel: 01773760849,No ratings yet Rate it yourself - /Services/careproviders/LeaveReview/DefaultView.aspx?id=1-124361099,0,0,,
The Rookery Care Home,1-1739390292,SCL,130 Church Street,Eastwood,,Nottingham,Nottinghamshire,NG16 3HT,Tel: 01773 713176,No ratings yet Rate it yourself - /Services/careproviders/LeaveReview/DefaultView.aspx?id=1-1739390292,0,0,,
Eastwood House,1-123986699,SCL,24 Church Street,Eastwood,,Nottingham,Nottinghamshire,NG16 3HS,Tel: 01773712003,No ratings yet Rate it yourself - /Services/careproviders/LeaveReview/DefaultView.aspx?id=1-123986699,0,0,,
Church Street Care Home,1-215791098,SCL,84 Church Street,,,Eastwood,Nottinghamshire,NG16 3HS,Tel: 01773765494,No ratings yet Rate it yourself - /Services/careproviders/LeaveReview/DefaultView.aspx?id=1-215791098,0,0,,
Coppice and Oakside,1-12236476025,SCL,Shipley Common lane,,,Ilkeston,Derbyshire,DE7 8TQ,Tel: 01159443690,No ratings yet Rate it yourself - /Services/careproviders/LeaveReview/DefaultView.aspx?id=1-12236476025,0,0,,
Diamond Care Solutions Ltd,1-9079215306,SCL,8 Mansfield Road,Eastwood,,Nottingham,,NG16 3AQ,,No ratings yet Rate it yourself - /Services/careproviders/LeaveReview/DefaultView.aspx?id=1-9079215306,0,0,,
Derbyshire Community Care Limited,1-18125212322,SCL,"Denby House, Denby House Business Centre","Taylor Lane, Loscoe",,Heanor,,DE75 7AB,Tel: 07756395966,No ratings yet Rate it yourself - /Services/careproviders/LeaveReview/DefaultView.aspx?id=1-18125212322,0,0,,
Rutland Manor Nursing Home,1-132710146,SCL,99-109 Heanor Road,,,Ilkeston,Derbyshire,DE7 8TA,Tel: 01159440322,No ratings yet Rate it yourself - /Services/careproviders/LeaveReview/DefaultView.aspx?id=1-132710146,0,0,,
DCC Erewash Home Care,1-10391983393,SCL,Bennerley Fields Centre,22 Bennerley Fields,,Ilkeston,,DE7 8PF,Tel: 01629531944,No ratings yet Rate it yourself - /Services/careproviders/LeaveReview/DefaultView.aspx?id=1-10391983393,0,0,,
Bennerley Fields Centre,1-13897910445,SCL,22 Bennerley Avenue,,,Ilkeston,,DE7 8PF,Tel: 01629539590,No ratings yet Rate it yourself - /Services/careproviders/LeaveReview/DefaultView.aspx?id=1-13897910445,0,0,,
Ashton Court Residential Home,1-141491563,SCL,56 Three Tuns Road,Eastwood,,Nottingham,Nottinghamshire,NG16 3EJ,Tel: 01773712017,No ratings yet Rate it yourself - /Services/careproviders/LeaveReview/DefaultView.aspx?id=1-141491563,0,0,,
Edward House,1-243554515,SCL,175 Nottingham Road,,,Eastwood,Nottinghamshire,NG16 3GS,Tel: 01773531591,No ratings yet Rate it yourself - /Services/careproviders/LeaveReview/DefaultView.aspx?id=1-243554515,0,0,,
Alexandra House,1-17882516459,SCL,Nottingham Road,"Wroughton Court, Eastwood",,Nottingham,,NG16 3GP,Tel: 01773530749,No ratings yet Rate it yourself - /Services/careproviders/LeaveReview/DefaultView.aspx?id=1-17882516459,0,0,,
Enable Support Limited,1-8501996163,SCL,175 Newthorpe Common,Newthorpe,,Nottingham,Nottinghamshire,NG16 2AW,Tel: 07764486075,1 rating Rate it yourself - /Services/careproviders/LeaveReview/DefaultView.aspx?id=1-8501996163,,,,
Peak Home Assist,1-9849576341,SCL,Wentworth House,"Manners Avenue, Manners Industrial Estate",,Ilkeston,,DE7 8EF,Tel: 01773306110,No ratings yet Rate it yourself - /Services/careproviders/LeaveReview/DefaultView.aspx?id=1-9849576341,0,0,,
Canal Vue,1-18388754032,SCL,107 Awsworth Road,,,Ilkeston,Derbyshire,DE7 8JF,Tel: 01159326390,No ratings yet Rate it yourself - /Services/careproviders/LeaveReview/DefaultView.aspx?id=1-18388754032,0,0,,
GHC Nursing Home,1-10809146644,SCL,472 Nottingham Road,Giltbrook,,Nottingham,Nottinghamshire,NG16 2GE,Tel: 01159383535,1 rating Rate it yourself - /Services/careproviders/LeaveReview/DefaultView.aspx?id=1-10809146644,,,,
Amber Valley Total Care,1-3148378144,SCL,18 Main Road,Smalley,,Ilkeston,Derbyshire,DE7 6EE,Tel: 01332881255,No ratings yet Rate it yourself - /Services/careproviders/LeaveReview/DefaultView.aspx?id=1-3148378144,0,0,,
Victoria Park Care Home (Ilkeston),1-320756284,SCL,Manners Road,,,Ilkeston,Derbyshire,DE7 5HB,Tel: 01159440774,No ratings yet Rate it yourself - /Services/careproviders/LeaveReview/DefaultView.aspx?id=1-320756284,0,0,,
Moorlands Care Home,1-462856201,SCL,104 Church Lane,Brinsley,,Nottingham,Nottinghamshire,NG16 5AB,Tel: 01773781381,No ratings yet Rate it yourself - /Services/careproviders/LeaveReview/DefaultView.aspx?id=1-462856201,0,0,,
Haddon House Care Home,1-128584534,SCL,38 Lord Haddon Road,,,Ilkeston,Derbyshire,DE7 8AW,Tel: 01159441641,No ratings yet Rate it yourself - /Services/careproviders/LeaveReview/DefaultView.aspx?id=1-128584534,0,0,,
Fullwood House,1-1690710989,SCL,67 Lord Haddon Road,,,Ilkeston,Derbyshire,DE7 8AU,Tel: 01159323469,No ratings yet Rate it yourself - /Services/careproviders/LeaveReview/DefaultView.aspx?id=1-1690710989,0,0,,
Premier Community,1-5963870132,SCL,148 Bath Street,,,Ilkeston,,DE7 8FF,Tel: 01623810100,No ratings yet Rate it yourself - /Services/careproviders/LeaveReview/DefaultView.aspx?id=1-5963870132,0,0,,
Smalley Hall Care Home,1-3150306332,SCL,Main Road,Smalley,,Ilkeston,Derbyshire,DE7 6DS,Tel: 08456022059,No ratings yet Rate it yourself - /Services/careproviders/LeaveReview/DefaultView.aspx?id=1-3150306332,0,0,,
Victoria Court,1-126242349,SCL,Nesfield Road,,,Ilkeston,Derbyshire,DE7 8AY,Tel: 01159322303,No ratings yet Rate it yourself - /Services/careproviders/LeaveReview/DefaultView.aspx?id=1-126242349,0,0,,
Bramble Lodge,1-7209683149,SCL,82 High Lane West,West Hallam,,Ilkeston,Derbyshire,DE7 6HQ,Tel: 01159444545,1 rating Rate it yourself - /Services/careproviders/LeaveReview/DefaultView.aspx?id=1-7209683149,,,,
Elfcareuk Ltd,1-5837249837,SCL,26a Belper Road,West Hallam,,Ilkeston,,DE7 6GY,Tel: 01159986076,No ratings yet Rate it yourself - /Services/careproviders/LeaveReview/DefaultView.aspx?id=1-5837249837,0,0,,
West Hallam Care Home,1-3150346963,SCL,8 Newdigate Street,West Hallam,,Ilkeston,Derbyshire,DE7 6GZ,Tel: 01159440329,No ratings yet Rate it yourself - /Services/careproviders/LeaveReview/DefaultView.aspx?id=1-3150346963,0,0,,
The Red House,1-1472074648,SCL,49 Wharncliffe Road,Ilkeston,,Derby,Derbyshire,DE7 5GF,Tel: 01159447869,No ratings yet Rate it yourself - /Services/careproviders/LeaveReview/DefaultView.aspx?id=1-1472074648,0,0,,
Home Instead Ilkeston and Hucknall,1-18576519495,SCL,The Old Police Station,Wharncliffe Road,,Ilkeston,,DE7 5GF,Tel: 01156719970,No ratings yet Rate it yourself - /Services/careproviders/LeaveReview/DefaultView.aspx?id=1-18576519495,0,0,,
Sterling Supported Living Limited,1-17593429531,SCL,The Old Police Station,Wharncliffe Road,,Ilkeston,,DE7 5GF,Tel: 07947373786,No ratings yet Rate it yourself - /Services/careproviders/LeaveReview/DefaultView.aspx?id=1-17593429531,0,0,,
Spring Bank,1-5742877526,SCL,52 Cordy Lane,Brinsley,,Nottingham,Nottinghamshire,NG16 5BY,Tel: 01773765766,No ratings yet Rate it yourself - /Services/careproviders/LeaveReview/DefaultView.aspx?id=1-5742877526,0,0,,
Yarningdale,1-414350871,SCL,Holywell Avenue,Codnor,,Ripley,Derbyshire,DE5 9SG,Tel: 01773 740960,No ratings yet Rate it yourself - /Services/careproviders/LeaveReview/DefaultView.aspx?id=1-414350871,0,0,,
The Cedars and Larches Care Home,1-17949200212,SCL,16 Queens Drive,,,Ilkeston,Derbyshire,DE7 5GR,Tel: 01159308758,No ratings yet Rate it yourself - /Services/careproviders/LeaveReview/DefaultView.aspx?id=1-17949200212,0,0,,
Harmony Care & Support Ltd,1-361298347,SCL,16 South Street,,,Ilkeston,,DE7 5QE,Tel: 01159725292,1 rating Rate it yourself - /Services/careproviders/LeaveReview/DefaultView.aspx?id=1-361298347,,,,
243 Church Street,1-4323596034,SCL,Our House Waingroves Limited,"243 Church Street, Waingroves",,Ripley,Derbyshire,DE5 9TF,Tel: 01773438227,No ratings yet Rate it yourself - /Services/careproviders/LeaveReview/DefaultView.aspx?id=1-4323596034,0,0,,
Firstcall 247 Limited,1-12776305587,SCL,Toll Bar House Business Centre,1 Derby Road,,Ilkeston,,DE7 5FH,,No ratings yet Rate it yourself - /Services/careproviders/LeaveReview/DefaultView.aspx?id=1-12776305587,0,0,,
Codnor Park Care Home,1-3150216425,SCL,88 Glass House Hill,Codnor,,Ripley,Derbyshire,DE5 9QT,Tel: 08456022059,No ratings yet Rate it yourself - /Services/careproviders/LeaveReview/DefaultView.aspx?id=1-3150216425,0,0,,
100 Glasshouse Hill,1-129459563,SCL,100 Glass House Hill,Codnor,,Ripley,Derbyshire,DE5 9QT,,No ratings yet Rate it yourself - /Services/careproviders/LeaveReview/DefaultView.aspx?id=1-129459563,0,0,,
The Firs Care Home with Nursing,1-3150329618,SCL,90 Glass House Hill,Codnor,,Ripley,Derbyshire,DE5 9QT,Tel: 08456022059,No ratings yet Rate it yourself - /Services/careproviders/LeaveReview/DefaultView.aspx?id=1-3150329618,0,0,,
Oliver House,1-8921677520,SCL,33 Oliver Road,,,Ilkeston,Derbyshire,DE7 4JY,Tel: 01159440484,No ratings yet Rate it yourself - /Services/careproviders/LeaveReview/DefaultView.aspx?id=1-8921677520,0,0,,
Churchview and Larklands,1-12236475958,SCL,St. Johns Road,,,Ilkeston,,DE7 5PA,Tel: 01159323209,No ratings yet Rate it yourself - /Services/careproviders/LeaveReview/DefaultView.aspx?id=1-12236475958,0,0,,
Ladywood,1-320350941,SCL,Eaton Avenue,,,Ilkeston,Derbyshire,DE7 4HL,Tel: 01159440577,1 rating Rate it yourself - /Services/careproviders/LeaveReview/DefaultView.aspx?id=1-320350941,,,,
Berrybrook House,1-4838435730,SCL,230 Derby Road,Denby,,Ripley,,DE5 8NN,Tel: 01332881682,No ratings yet Rate it yourself - /Services/careproviders/LeaveReview/DefaultView.aspx?id=1-4838435730,0,0,,
Avanti Homecare Limited,1-6146756844,SCL,Unit 10,Kensington Street,,Ilkeston,,DE7 5NY,Tel: 01158571001,No ratings yet Rate it yourself - /Services/careproviders/LeaveReview/DefaultView.aspx?id=1-6146756844,0,0,,
Hillside,1-12236475864,SCL,31 Albany Street,,,Ilkeston,Derbyshire,DE7 5AD,Tel: 01159300171,No ratings yet Rate it yourself - /Services/careproviders/LeaveReview/DefaultView.aspx?id=1-12236475864,0,0,,
Independent Care Link Ltd,1-12853537496,SCL,233 Nottingham Road,,,Ilkeston,,DE7 5AT,,No ratings yet Rate it yourself - /Services/careproviders/LeaveReview/DefaultView.aspx?id=1-12853537496,0,0,,
Kilburn Care Centre,1-8780407946,SCL,Dale Park Avenue,Kilburn,,Belper,Derbyshire,DE56 0NR,Tel: 01332880644,No ratings yet Rate it yourself - /Services/careproviders/LeaveReview/DefaultView.aspx?id=1-8780407946,0,0,,
Amber View Care Home,1-9371346510,SCL,35 Wagstaff Lane,Jacksdale,,Nottingham,Nottinghamshire,NG16 5JL,Tel: 01773776096,No ratings yet Rate it yourself - /Services/careproviders/LeaveReview/DefaultView.aspx?id=1-9371346510,0,0,,
Birchwood Homecaring Services Limited,1-119598068,SCL,29 Derby Road,,,Ripley,Derbyshire,DE5 3HR,Tel: 01773570057,No ratings yet Rate it yourself - /Services/careproviders/LeaveReview/DefaultView.aspx?id=1-119598068,0,0,,
Derbyshire Autism Service,1-3022239255,SCL,Unit 3a,"Unicorn Business Park, Wellington Street",,Ripley,Derbyshire,DE5 3EH,Tel: 01773741221,1 rating Rate it yourself - /Services/careproviders/LeaveReview/DefaultView.aspx?id=1-3022239255,,,,
Reignscare Ltd,1-15280863496,SCL,1A Unicorn House,Wellington Street,,Ripley,Derbyshire,DE5 3EH,Tel: 02037733476,1 rating Rate it yourself - /Services/careproviders/LeaveReview/DefaultView.aspx?id=1-15280863496,,,,
Sagecare (Derby),1-6438548534,SCL,Unicorn House,Wellington Street,,Ripley,Derbyshire,DE5 3DZ,Tel: 01773514990,No ratings yet Rate it yourself - /Services/careproviders/LeaveReview/DefaultView.aspx?id=1-6438548534,0,0,,
Maple Leaf House,1-117977414,SCL,Kirk Close,,,Ripley,Derbyshire,DE5 3RY,Tel: 01773513361,No ratings yet Rate it yourself - /Services/careproviders/LeaveReview/DefaultView.aspx?id=1-117977414,0,0,,
The Old Vicarage,1-137960760,SCL,Bullock Lane,Ironville,,Nottingham,Nottinghamshire,NG16 5NP,Tel: 01773541254,No ratings yet Rate it yourself - /Services/careproviders/LeaveReview/DefaultView.aspx?id=1-137960760,0,0,,
Avanti Homecare (Ripley),1-9038333663,SCL,"1st and 2nd Floor Offices, Old Post Office Building",Market Place,,Ripley,,DE5 3FJ,Tel: 01773447344,No ratings yet Rate it yourself - /Services/careproviders/LeaveReview/DefaultView.aspx?id=1-9038333663,0,0,,
Butterley House,1-6129138309,SCL,Coach Road,Butterley,,Ripley,Derbyshire,DE5 3QU,Tel: 01773745636,1 rating Rate it yourself - /Services/careproviders/LeaveReview/DefaultView.aspx?id=1-6129138309,,,,
Acacia Lodge,1-1968460365,SCL,Peveril Court,Sandham Lane,,Ripley,Derbyshire,DE5 3NR,Tel: 01773570248,No ratings yet Rate it yourself - /Services/careproviders/LeaveReview/DefaultView.aspx?id=1-1968460365,0,0,,
Little Acres,1-131819834,SCL,5 Spencer Drive,Nuthall,,Nottingham,Nottinghamshire,NG16 1DQ,Tel: 01159382236,No ratings yet Rate it yourself - /Services/careproviders/LeaveReview/DefaultView.aspx?id=1-131819834,0,0,,
Woodlands Nursing Home,1-124688308,SCL,Butterley Hill,,,Ripley,Derbyshire,DE5 3LW,Tel: 01773744919,No ratings yet Rate it yourself - /Services/careproviders/LeaveReview/DefaultView.aspx?id=1-124688308,0,0,,
The Old Vicarage,1-110052965,SCL,Market Place,Riddings,,Alfreton,Derbyshire,DE55 4BQ,Tel: 01773607479,No ratings yet Rate it yourself - /Services/careproviders/LeaveReview/DefaultView.aspx?id=1-110052965,0,0,,
First Class Care Services,1-15128968768,SCL,"Beaumont Hat Room, Strelley Hall","Main Street, Strelley",,Nottingham,,NG8 6PE,Tel: 01582969393,No ratings yet Rate it yourself - /Services/careproviders/LeaveReview/DefaultView.aspx?id=1-15128968768,0,0,,
Treetops,1-118580161,SCL,10 Church Street,Riddings,,Alfreton,Derbyshire,DE55 4BX,Tel: 01773528080,No ratings yet Rate it yourself - /Services/careproviders/LeaveReview/DefaultView.aspx?id=1-118580161,0,0,,
The King William Care Home,1-3150346713,SCL,Lowes Hill,,,Ripley,Derbyshire,DE5 3DW,Tel: 08456022059,No ratings yet Rate it yourself - /Services/careproviders/LeaveReview/DefaultView.aspx?id=1-3150346713,0,0,,
Fosse Healthcare - Nottingham,1-10199022721,SCL,"Unit H5, Ash Tree Court","Mellors Way, Nottingham Business Park",,Nottingham,,NG8 6PY,Tel: 01157841866,No ratings yet Rate it yourself - /Services/careproviders/LeaveReview/DefaultView.aspx?id=1-10199022721,0,0,,
Wren Hall Nursing Home,1-112059070,SCL,234 Nottingham Road,Selston,,Nottingham,Nottinghamshire,NG16 6AB,Tel: 01773 581203,No ratings yet Rate it yourself - /Services/careproviders/LeaveReview/DefaultView.aspx?id=1-112059070,0,0,,
Coxbench Hall,1-123560965,SCL,Alfreton Road,Coxbench,,Derby,Derbyshire,DE21 5BB,Tel: 01332880200,No ratings yet Rate it yourself - /Services/careproviders/LeaveReview/DefaultView.aspx?id=1-123560965,0,0,,
Beech Court Care Home,1-3005517842,SCL,52 Church Lane,Selston,,Nottingham,Nottinghamshire,NG16 6EW,Tel: 01773581450,No ratings yet Rate it yourself - /Services/careproviders/LeaveReview/DefaultView.aspx?id=1-3005517842,0,0,,
Harrier House Care Home,1-10438524205,SCL,Hurricane Road,Hucknall,,Nottingham,,NG15 6WN,Tel: 01455274273,No ratings yet Rate it yourself - /Services/careproviders/LeaveReview/DefaultView.aspx?id=1-10438524205,0,0,,
Moorgreen,1-2672721587,SCL,Lancaster Road,Hucknall,,Nottingham,Nottinghamshire,NG15 6WG,Tel: 01159632374,1 rating Rate it yourself - /Services/careproviders/LeaveReview/DefaultView.aspx?id=1-2672721587,,,,
Hucknall and Watnall,1-2496594519,SCL,Lancaster Road,Hucknall,,Nottingham,Nottinghamshire,NG15 6WG,Tel: 01159630707,No ratings yet Rate it yourself - /Services/careproviders/LeaveReview/DefaultView.aspx?id=1-2496594519,0,0,,
Cooperate Home Healthcare Ltd,1-15316344164,SCL,5 Pennington Way,Hucknall,,Nottingham,,NG15 6XD,Tel: 07832275375,No ratings yet Rate it yourself - /Services/careproviders/LeaveReview/DefaultView.aspx?id=1-15316344164,0,0,,
Millington Springs,1-3670198353,SCL,160 Portland Road,Selston,,Nottingham,Nottinghamshire,NG16 6AN,Tel: 01773863557,No ratings yet Rate it yourself - /Services/careproviders/LeaveReview/DefaultView.aspx?id=1-3670198353,0,0,,
Holbrook Hall,1-118433596,SCL,"Makeney Road, Holbrook",,,Belper,Derbyshire,DE56 0TF,Tel: 01332880698,No ratings yet Rate it yourself - /Services/careproviders/LeaveReview/DefaultView.aspx?id=1-118433596,0,0,,
Housing 21 - Seagrave Court,1-5518579092,SCL,"Seagrave Court, Seagrave Road",Strelley,,Nottingham,,NG8 6PU,Tel: 03701924969,No ratings yet Rate it yourself - /Services/careproviders/LeaveReview/DefaultView.aspx?id=1-5518579092,0,0,,
Jubilee Court,1-390648330,SCL,Nabbs Lane,Hucknall,,Nottingham,Nottinghamshire,NG15 6HB,Tel: 01159834630,No ratings yet Rate it yourself - /Services/careproviders/LeaveReview/DefaultView.aspx?id=1-390648330,0,0,,
Bilborough,1-3641242498,SCL,20 Oakland Way,Bilborough,,Nottingham,Nottinghamshire,NG8 4JS,Tel: 01159296992,No ratings yet Rate it yourself - /Services/careproviders/LeaveReview/DefaultView.aspx?id=1-3641242498,0,0,,
Bulwell,1-3986560133,SCL,Snape Wood Road,Bulwell,,Nottingham,Nottinghamshire,NG6 7GH,Tel: 02038317924,No ratings yet Rate it yourself - /Services/careproviders/LeaveReview/DefaultView.aspx?id=1-3986560133,0,0,,
Positive Horizons Learning Disability Services Limited,1-9527301655,SCL,155 Belper Road,Bargate,,Belper,Derbyshire,DE56 0SU,Tel: 01773827385,No ratings yet Rate it yourself - /Services/careproviders/LeaveReview/DefaultView.aspx?id=1-9527301655,0,0,,
Tottle Brook House,1-10564182313,SCL,Calverton Drive,Strelley,,Nottingham,Nottinghamshire,NG8 6QN,Tel: 01156660902,No ratings yet Rate it yourself - /Services/careproviders/LeaveReview/DefaultView.aspx?id=1-10564182313,0,0,,
Homelink Care Support Services LTD,1-18385842971,SCL,129 Westwick Road,Bilborough,,Nottingham,,NG8 4HB,Tel: 07476125115,No ratings yet Rate it yourself - /Services/careproviders/LeaveReview/DefaultView.aspx?id=1-18385842971,0,0,,
Deltaecho Care Ltd,1-19134295138,SCL,28 Field Farm Way,Stapleford,,Nottingham,,NG9 8JP,Tel: 07883024345,No ratings yet Rate it yourself - /Services/careproviders/LeaveReview/DefaultView.aspx?id=1-19134295138,0,0,,
St Martins,1-3802488097,SCL,42 St Martins Road,,,Nottingham,Nottinghamshire,NG8 3AR,Tel: 01159297325,No ratings yet Rate it yourself - /Services/careproviders/LeaveReview/DefaultView.aspx?id=1-3802488097,0,0,,
Spring Lodge,1-19027302358,SCL,11 St. Agnes Close,,,Nottingham,,NG8 4BJ,Tel: 07803492660,No ratings yet Rate it yourself - /Services/careproviders/LeaveReview/DefaultView.aspx?id=1-19027302358,0,0,,
Taylor View and Gilbert Lodge,1-118413397,SCL,220 Watnall Road,Hucknall,,Nottingham,Nottinghamshire,NG15 6EY,Tel: 01159636379,No ratings yet Rate it yourself - /Services/careproviders/LeaveReview/DefaultView.aspx?id=1-118413397,0,0,,
Rowthorne Care Home,1-121909863,SCL,Rowthorne Avenue,Swanwick,,Alfreton,Derbyshire,DE55 1RZ,Tel: 01629531865,6 ratings Rate it yourself - /Services/careproviders/LeaveReview/DefaultView.aspx?id=1-121909863,,,,
Cockington House,1-1142951439,SCL,38 Cockington Road,,,Nottingham,Nottinghamshire,NG8 4BZ,Tel: 01159288013,No ratings yet Rate it yourself - /Services/careproviders/LeaveReview/DefaultView.aspx?id=1-1142951439,0,0,,
Woodvale,1-6097479390,SCL,315 Wollaton Vale,,,Nottingham,Nottinghamshire,NG8 2PX,,No ratings yet Rate it yourself - /Services/careproviders/LeaveReview/DefaultView.aspx?id=1-6097479390,0,0,,
Mulberry Court Care Home,1-2320527018,SCL,61 Darnhall Crescent,Bilborough,,Nottingham,Nottinghamshire,NG8 4QA,Tel: 0115 929 4483,No ratings yet Rate it yourself - /Services/careproviders/LeaveReview/DefaultView.aspx?id=1-2320527018,0,0,,
Anja Care Services,1-16608004382,SCL,23 Maple Drive,,,Belper,,DE56 1LR,,No ratings yet Rate it yourself - /Services/careproviders/LeaveReview/DefaultView.aspx?id=1-16608004382,0,0,,
Complete Care Needs,1-13937532942,SCL,38 Shipley Road,,,Nottingham,,NG8 6JE,,No ratings yet Rate it yourself - /Services/careproviders/LeaveReview/DefaultView.aspx?id=1-13937532942,0,0,,
Advantage Healthcare - Nottingham,1-2655498135,SCL,COMO Office Lakeview,,,Nottingham,,NG15 0ED,Tel: 01623727660,No ratings yet Rate it yourself - /Services/careproviders/LeaveReview/DefaultView.aspx?id=1-2655498135,0,0,,
Comfort Call Nottingham,1-18794927668,SCL,COMO Office Lakeview,Sherwood Park,,Nottingham,,NG15 0ED,Tel: 01159751441,No ratings yet Rate it yourself - /Services/careproviders/LeaveReview/DefaultView.aspx?id=1-18794927668,0,0,,
Topview Healthcare Ltd,1-16858860252,SCL,79 Fenwick Road,,,Nottingham,,NG8 6FU,Tel: 01159771585,No ratings yet Rate it yourself - /Services/careproviders/LeaveReview/DefaultView.aspx?id=1-16858860252,0,0,,
Beechdale Manor Care Home,1-4675873280,SCL,40 Beechdale Road,,,Nottingham,Nottinghamshire,NG8 3AJ,Tel: 01158496400,2 ratings Rate it yourself - /Services/careproviders/LeaveReview/DefaultView.aspx?id=1-4675873280,,,,
Acer Court Care Home,1-319747838,SCL,172 Nottingham Road,,,Nuthall,Nottinghamshire,NG8 6AX,Tel: 01159777370,No ratings yet Rate it yourself - /Services/careproviders/LeaveReview/DefaultView.aspx?id=1-319747838,0,0,,
Alder House Care Home,1-1763259648,SCL,172a Nottingham Road,Nuthall,,Nottingham,Nottinghamshire,NG8 6AX,Tel: 01159758110,No ratings yet Rate it yourself - /Services/careproviders/LeaveReview/DefaultView.aspx?id=1-1763259648,0,0,,
Aldercar Residential Care Home,1-276840652,SCL,36 Wood Lane,Hucknall,,Nottingham,Nottinghamshire,NG15 6LR,Tel: 01159637797,No ratings yet Rate it yourself - /Services/careproviders/LeaveReview/DefaultView.aspx?id=1-276840652,0,0,,
Henath Home Care Service,1-14809676963,SCL,26 Alport Heights Drive,Oakwood,,Derby,,DE21 2AE,,No ratings yet Rate it yourself - /Services/careproviders/LeaveReview/DefaultView.aspx?id=1-14809676963,0,0,,
Care Solutions Nottingham,1-9856011601,SCL,"Suite 144, Pure Offices, Lake View Drive",Annesley,,Nottingham,,NG15 0DT,Tel: 01618820404,No ratings yet Rate it yourself - /Services/careproviders/LeaveReview/DefaultView.aspx?id=1-9856011601,0,0,,