Organisation Name,NACS Code,Organisation Type,Address1,Address2,Address3,Address4,Address5,PostCode,Telephone Number,NHS.UK users rating,Value  (NHS.UK users rating),Banding Classification  (NHS.UK users rating),Car parking (Is there car parking at this organisation?),Disabled access (Disabled access)
Waterside Care Centre,1-123533948,SCL,Leigh Sinton,,,Malvern,Worcestershire,WR13 5EQ,Tel: 01886833706,No ratings yet Rate it yourself - /Services/careproviders/LeaveReview/DefaultView.aspx?id=1-123533948,0,0,,
Hamilton House,1-376104650,SCL,Leigh Sinton,,,Malvern,Worcestershire,WR13 5DZ,Tel: 01886832456,No ratings yet Rate it yourself - /Services/careproviders/LeaveReview/DefaultView.aspx?id=1-376104650,0,0,,
Sanctuary Supported Living (Hazel Court),1-2207969105,SCL,3 University Park Drive,,,Worcester,Worcestershire,WR2 5FG,Tel: 01905796561,No ratings yet Rate it yourself - /Services/careproviders/LeaveReview/DefaultView.aspx?id=1-2207969105,0,0,,
Bedwardine House Residential Care Home,1-115230808,SCL,Upper Wick Lane,Rushwick,,Worcester,Worcestershire,WR2 5SU,Tel: 01905425101,No ratings yet Rate it yourself - /Services/careproviders/LeaveReview/DefaultView.aspx?id=1-115230808,0,0,,
Stanfield Nursing Home Limited,1-114409532,SCL,Upper Wick Lane,Rushwick,,Worcester,Worcestershire,WR2 5SU,,No ratings yet Rate it yourself - /Services/careproviders/LeaveReview/DefaultView.aspx?id=1-114409532,0,0,,
Juniper House Residential Care Home,1-2148344202,SCL,2 Oak View Way,St Johns,,Worcester,Worcestershire,WR2 5FJ,Tel: 01905676950,No ratings yet Rate it yourself - /Services/careproviders/LeaveReview/DefaultView.aspx?id=1-2148344202,0,0,,
Sanctuary Home Care Ltd- Worcester,1-2305128804,SCL,Noble House,1 Oak View Way,,Worcester,Worcestershire,WR2 5FH,Tel: 01905676946,No ratings yet Rate it yourself - /Services/careproviders/LeaveReview/DefaultView.aspx?id=1-2305128804,0,0,,
Constable House,1-187540626,SCL,6-8 Howard Road,Dines Green,,Worcester,Worcestershire,WR2 5RB,Tel: 01905422150,No ratings yet Rate it yourself - /Services/careproviders/LeaveReview/DefaultView.aspx?id=1-187540626,0,0,,
Options Bredon House,1-476877271,SCL,Hospital Lane,Powick,,Worcester,,WR2 4SQ,Tel: 01905830234,No ratings yet Rate it yourself - /Services/careproviders/LeaveReview/DefaultView.aspx?id=1-476877271,0,0,,
Dalvington/The Oaks,1-120634754,SCL,Dalvington,146 Lower Howsell Road,,Malvern,Worcestershire,WR14 1DL,Tel: 01886833424,No ratings yet Rate it yourself - /Services/careproviders/LeaveReview/DefaultView.aspx?id=1-120634754,0,0,,
Woodbury View,1-289659568,SCL,Martley Road,,,Worcester,Worcestershire,WR2 6QG,Tel: 01905641745,No ratings yet Rate it yourself - /Services/careproviders/LeaveReview/DefaultView.aspx?id=1-289659568,0,0,,
Radis Community Care (Clarence Park Village),1-4279579084,SCL,Clarence Park Village,415 Worcester Road,,Malvern,Worcestershire,WR14 1PP,Tel: 01684583010,No ratings yet Rate it yourself - /Services/careproviders/LeaveReview/DefaultView.aspx?id=1-4279579084,0,0,,
Inspire Neurocare Worcester,1-8296451126,SCL,195 Oldbury Road,,,Worcester,,WR2 6AS,Tel: 01905969000,No ratings yet Rate it yourself - /Services/careproviders/LeaveReview/DefaultView.aspx?id=1-8296451126,0,0,,
Matrixcare,1-3229146212,SCL,369 Worcester Road,,,Malvern,Worcestershire,WR14 1AR,Tel: 01684568097,No ratings yet Rate it yourself - /Services/careproviders/LeaveReview/DefaultView.aspx?id=1-3229146212,0,0,,
Teme Court Residential Care Home,1-113398333,SCL,Old Road,Lower Wick,,Worcester,Worcestershire,WR2 4BU,Tel: 01905972023,No ratings yet Rate it yourself - /Services/careproviders/LeaveReview/DefaultView.aspx?id=1-113398333,0,0,,
Dependable Home Care Services Limited,1-4207242680,SCL,61 Canada Way,,,Worcester,,WR2 4XA,Tel: 07594683830,No ratings yet Rate it yourself - /Services/careproviders/LeaveReview/DefaultView.aspx?id=1-4207242680,0,0,,
Springfield House,1-2061660719,SCL,3-5 Ranelagh Road,,,Malvern,Worcestershire,WR14 1BQ,Tel: 01684574248,No ratings yet Rate it yourself - /Services/careproviders/LeaveReview/DefaultView.aspx?id=1-2061660719,0,0,,
Phoenix House,1-10867338350,SCL,122 Bromyard Road,,,Worcester,,WR2 5DJ,,No ratings yet Rate it yourself - /Services/careproviders/LeaveReview/DefaultView.aspx?id=1-10867338350,0,0,,
Regent Residential Care Home,1-124396200,SCL,School Road,St Johns,,Worcester,Worcestershire,WR2 4HF,Tel: 01905337100,No ratings yet Rate it yourself - /Services/careproviders/LeaveReview/DefaultView.aspx?id=1-124396200,0,0,,
Newlife Care Providers,1-2922803038,SCL,"HDAnywhere, The Haysfield",Spring Lane North,,Malvern,,WR14 1GF,Tel: 07414260226,No ratings yet Rate it yourself - /Services/careproviders/LeaveReview/DefaultView.aspx?id=1-2922803038,0,0,,
95 Bromyard Road,1-304923242,SCL,95 Bromyard Road,St Johns,,Worcester,Worcestershire,WR2 5BZ,Tel: 01905 429527,No ratings yet Rate it yourself - /Services/careproviders/LeaveReview/DefaultView.aspx?id=1-304923242,0,0,,
Bethany Lodge,1-120814501,SCL,222 Malvern Road,,,Worcester,Worcestershire,WR2 4PA,Tel: 01905420088,No ratings yet Rate it yourself - /Services/careproviders/LeaveReview/DefaultView.aspx?id=1-120814501,0,0,,
The Firs Rest Home,1-118565717,SCL,141 Malvern Road,St Johns,,Worcester,Worcestershire,WR2 4LN,Tel: 01905426194,No ratings yet Rate it yourself - /Services/careproviders/LeaveReview/DefaultView.aspx?id=1-118565717,0,0,,
The Springs Care Home,1-130120870,SCL,Spring Lane,,,Malvern,Worcestershire,WR14 1AL,Tel: 01684571300,No ratings yet Rate it yourself - /Services/careproviders/LeaveReview/DefaultView.aspx?id=1-130120870,0,0,,
Home Instead Senior Care,1-377680897,SCL,Suite 5B,"Malvern Gate, Bromwich Road",,Worcester,Worcestershire,WR2 4BN,Tel: 01905420404,No ratings yet Rate it yourself - /Services/careproviders/LeaveReview/DefaultView.aspx?id=1-377680897,0,0,,
Radfield Home Care Worcester,1-5271995588,SCL,6 King Charles Place,St. Johns,,Worcester,,WR2 5AJ,Tel: 01905 427 863,No ratings yet Rate it yourself - /Services/careproviders/LeaveReview/DefaultView.aspx?id=1-5271995588,0,0,,
Severn Vale Home Care Worcester,1-12119336784,SCL,"Office F2, New Venture House",Park Boulevard,,Worcester,,WR2 4AY,Tel: 01905950409,No ratings yet Rate it yourself - /Services/careproviders/LeaveReview/DefaultView.aspx?id=1-12119336784,0,0,,
Crossroads Caring for Carers,1-130618228,SCL,Crossroads Caring for Carers (Worcestershire),"Weir Lane, Lower Wick",,Worcester,Worcestershire,WR2 4AY,Tel: 01905729293,No ratings yet Rate it yourself - /Services/careproviders/LeaveReview/DefaultView.aspx?id=1-130618228,0,0,,
Rely Care Agency Limited,1-122138077,SCL,33A Himbleton Road,St Johns,,Worcester,Worcestershire,WR2 6BA,Tel: 01905339331,No ratings yet Rate it yourself - /Services/careproviders/LeaveReview/DefaultView.aspx?id=1-122138077,0,0,,
Ashwell Home Care Services Limited,1-7499411096,SCL,Troyte House,Sandys Road,,Malvern,,WR14 1JJ,Tel: 01684778750,No ratings yet Rate it yourself - /Services/careproviders/LeaveReview/DefaultView.aspx?id=1-7499411096,0,0,,
Henwick Grange,1-326347049,SCL,68 Hallow Road,St Johns,,Worcester,Worcestershire,WR2 6BY,Tel: 01905424705,No ratings yet Rate it yourself - /Services/careproviders/LeaveReview/DefaultView.aspx?id=1-326347049,0,0,,
The Oaks,1-113493371,SCL,165 Worcester Road,,,Malvern,Worcestershire,WR14 1ET,Tel: 01684572079,No ratings yet Rate it yourself - /Services/careproviders/LeaveReview/DefaultView.aspx?id=1-113493371,0,0,,
Cleeve House,1-135441632,SCL,49 Hornyold Road,,,Malvern,Worcestershire,WR14 1QH,Tel: 01684564454,No ratings yet Rate it yourself - /Services/careproviders/LeaveReview/DefaultView.aspx?id=1-135441632,0,0,,
Ablegrange Severn Heights Limited,1-125587087,SCL,Old Hills,Callow End,,Worcester,Worcestershire,WR2 4TQ,Tel: 01905831199,No ratings yet Rate it yourself - /Services/careproviders/LeaveReview/DefaultView.aspx?id=1-125587087,0,0,,
Howbury House Resource Centre,1-147763036,SCL,Pickersleigh Grove,,,Malvern,Worcestershire,WR14 2LU,Tel: 01684571750,No ratings yet Rate it yourself - /Services/careproviders/LeaveReview/DefaultView.aspx?id=1-147763036,0,0,,
Friends of the Elderly Malvern,1-117309799,SCL,148 Graham Road,,,Malvern,Worcestershire,WR14 2HY,Tel: 01684574385,No ratings yet Rate it yourself - /Services/careproviders/LeaveReview/DefaultView.aspx?id=1-117309799,0,0,,
Helping Hands Worcester,1-6692732361,SCL,32 Broad Street,,,Worcester,,WR1 3NH,Tel: 01905676981,No ratings yet Rate it yourself - /Services/careproviders/LeaveReview/DefaultView.aspx?id=1-6692732361,0,0,,
Carefour,1-3657527547,SCL,3 Moor Street,,,Worcester,Worcestershire,WR1 3DB,Tel: 01905699699,No ratings yet Rate it yourself - /Services/careproviders/LeaveReview/DefaultView.aspx?id=1-3657527547,0,0,,
Millfields Care Ltd,1-12353191854,SCL,40 Cockshot Road,,,Malvern,,WR14 2TT,Tel: 07515541158,No ratings yet Rate it yourself - /Services/careproviders/LeaveReview/DefaultView.aspx?id=1-12353191854,0,0,,
The Willows Care Home,1-5375195863,SCL,2 Tower Road,,,Worcester,Worcestershire,WR3 7AF,Tel: 0190520658,No ratings yet Rate it yourself - /Services/careproviders/LeaveReview/DefaultView.aspx?id=1-5375195863,0,0,,
Priory Supported Living The Shires,1-10525531173,SCL,Anbrian House,1 The Tything,,Worcester,,WR1 1HD,Tel: 01905611042,No ratings yet Rate it yourself - /Services/careproviders/LeaveReview/DefaultView.aspx?id=1-10525531173,0,0,,
Home Force Care Worcester,1-14906231910,SCL,8 Edgar Street,,,Worcester,,WR1 2LR,,No ratings yet Rate it yourself - /Services/careproviders/LeaveReview/DefaultView.aspx?id=1-14906231910,0,0,,
The Broad Group - 85 Bath Road,1-109967775,SCL,85 Bath Road,,,Worcester,Worcestershire,WR5 3AE,,No ratings yet Rate it yourself - /Services/careproviders/LeaveReview/DefaultView.aspx?id=1-109967775,0,0,,
Nurseplus - Worcester,1-18092255813,SCL,County House,St. Marys Street,,Worcester,,WR1 1HB,Tel: 0190525279,No ratings yet Rate it yourself - /Services/careproviders/LeaveReview/DefaultView.aspx?id=1-18092255813,0,0,,
"Eclipse HomeCare (Worcester, Malvern, Kidderminster & Bromsgrove)",1-122963052,SCL,County House,1 St Mary's Street,,Worcester,Worcestershire,WR1 1HB,Tel: 01905 641070,No ratings yet Rate it yourself - /Services/careproviders/LeaveReview/DefaultView.aspx?id=1-122963052,0,0,,
Evans Healthcare Group - Worcester,1-15712164285,SCL,"T15, County House",St. Marys Street,,Worcester,,WR1 1HB,Tel: 07534663697,No ratings yet Rate it yourself - /Services/careproviders/LeaveReview/DefaultView.aspx?id=1-15712164285,0,0,,
Touchheart Healthcare Worcester Office,1-12515157010,SCL,County House,St. Marys Street,,Worcester,,WR1 1HB,Tel: 07403680808,No ratings yet Rate it yourself - /Services/careproviders/LeaveReview/DefaultView.aspx?id=1-12515157010,0,0,,
Simply The Best Care Ltd,1-9960242615,SCL,County House,St. Marys Street,,Worcester,,WR1 1HB,Tel: 07710888553,No ratings yet Rate it yourself - /Services/careproviders/LeaveReview/DefaultView.aspx?id=1-9960242615,0,0,,
Firstcall 247 Limited (Worcestershire),1-16888189378,SCL,01 Third Floor County House Business Centre,St. Marys Street,,Worcester,,WR1 1HB,Tel: 01905972288,No ratings yet Rate it yourself - /Services/careproviders/LeaveReview/DefaultView.aspx?id=1-16888189378,0,0,,
Mowbray Nursing Home,1-123533751,SCL,Victoria Road,,,Malvern,Worcestershire,WR14 2TF,Tel: 01684572946,No ratings yet Rate it yourself - /Services/careproviders/LeaveReview/DefaultView.aspx?id=1-123533751,0,0,,
Windsor Court Care Home,1-11264924028,SCL,Lansdowne Crescent,,,Malvern,Worcestershire,WR14 2AW,Tel: 01684882399,No ratings yet Rate it yourself - /Services/careproviders/LeaveReview/DefaultView.aspx?id=1-11264924028,0,0,,
Northwick Grange,1-146821579,SCL,19 Old Northwick Lane,,,Worcester,Worcestershire,WR3 7NB,Tel: 01905453916,No ratings yet Rate it yourself - /Services/careproviders/LeaveReview/DefaultView.aspx?id=1-146821579,0,0,,
Your Life (Malvern),1-965110947,SCL,Cartwright Court,Victoria Road,,Malvern,Worcestershire,WR14 2GE,Tel: 01684892076,No ratings yet Rate it yourself - /Services/careproviders/LeaveReview/DefaultView.aspx?id=1-965110947,0,0,,
Ignite Health and Home Care Service - Worcester,1-8531329627,SCL,1c Lowesmoor Terrace,,,Worcester,,WR1 2RX,Tel: 01905252718,No ratings yet Rate it yourself - /Services/careproviders/LeaveReview/DefaultView.aspx?id=1-8531329627,0,0,,
Headway Worcestershire,1-359238177,SCL,The Mill,Gregory's Mill Street,,Worcester,Worcestershire,WR3 8BA,Tel: 01905729729,No ratings yet Rate it yourself - /Services/careproviders/LeaveReview/DefaultView.aspx?id=1-359238177,0,0,,
Phemacare Ltd,1-1607928970,SCL,78 London Road,,,Worcester,Worcestershire,WR5 2DY,Tel: 01905360105,No ratings yet Rate it yourself - /Services/careproviders/LeaveReview/DefaultView.aspx?id=1-1607928970,0,0,,
St Stephen's Care Home,1-3583146841,SCL,St Stephens Terrace,Droitwich Road,,Worcester,Worcestershire,WR3 7HU,Tel: 0190529224,No ratings yet Rate it yourself - /Services/careproviders/LeaveReview/DefaultView.aspx?id=1-3583146841,0,0,,
South Hayes Care Home,1-154110564,SCL,101 London Road,,,Worcester,Worcestershire,WR5 2DZ,Tel: 01905357429,No ratings yet Rate it yourself - /Services/careproviders/LeaveReview/DefaultView.aspx?id=1-154110564,0,0,,
Assisted Lives (Worcester),1-9110930808,SCL,Unity House & Community Centre,Stanley Road,,Worcester,,WR5 1BE,Tel: 01527313690,No ratings yet Rate it yourself - /Services/careproviders/LeaveReview/DefaultView.aspx?id=1-9110930808,0,0,,
Happylife Care,1-2033159442,SCL,Unit 3D,Shrub Hill Industrial Estate,,Worcester,Worcestershire,WR4 9EL,Tel: 07401772572,No ratings yet Rate it yourself - /Services/careproviders/LeaveReview/DefaultView.aspx?id=1-2033159442,0,0,,
Blossom House,1-465217737,SCL,5 Avenue Road,,,Malvern,Worcestershire,WR14 3AL,Tel: 01684 574000,No ratings yet Rate it yourself - /Services/careproviders/LeaveReview/DefaultView.aspx?id=1-465217737,0,0,,
SENSE Tanglewood,1-120446158,SCL,72 Albert Road South,,,Malvern,Worcestershire,WR14 3AH,Tel: 01684576327,No ratings yet Rate it yourself - /Services/careproviders/LeaveReview/DefaultView.aspx?id=1-120446158,0,0,,
Wishmoor,1-128543581,SCL,21 Avenue Road,,,Malvern,Worcestershire,WR14 3AY,Tel: 01684 569162,No ratings yet Rate it yourself - /Services/careproviders/LeaveReview/DefaultView.aspx?id=1-128543581,0,0,,
The Avenue Care Home,1-115277863,SCL,23 Avenue Road,,,Malvern,Worcestershire,WR14 3AY,Tel: 01684575922,No ratings yet Rate it yourself - /Services/careproviders/LeaveReview/DefaultView.aspx?id=1-115277863,0,0,,
Court House Care Home,1-11985267647,SCL,3-5 Court Road,,,Malvern,Worcestershire,WR14 3BU,Tel: 01684572271,No ratings yet Rate it yourself - /Services/careproviders/LeaveReview/DefaultView.aspx?id=1-11985267647,0,0,,
Hastings Residential Care Home,1-124396149,SCL,130 Barnards Green Road,,,Malvern,Worcestershire,WR14 3NA,Tel: 01684585000,No ratings yet Rate it yourself - /Services/careproviders/LeaveReview/DefaultView.aspx?id=1-124396149,0,0,,
The Broad Group Ltd,1-4572626217,SCL,12 Astwood Road,,,Worcester,,WR3 8ET,Tel: 01905330602,No ratings yet Rate it yourself - /Services/careproviders/LeaveReview/DefaultView.aspx?id=1-4572626217,0,0,,
The Belmont,1-11976471025,SCL,John Comyn Drive,,,Worcester,,WR3 7NS,Tel: 01905590012,No ratings yet Rate it yourself - /Services/careproviders/LeaveReview/DefaultView.aspx?id=1-11976471025,0,0,,
The Lawns,1-115758642,SCL,Main Road,Kempsey,,Worcester,Worcestershire,WR5 3NF,Tel: 01905 821388,No ratings yet Rate it yourself - /Services/careproviders/LeaveReview/DefaultView.aspx?id=1-115758642,0,0,,
Audley Care Ellerslie,1-4076170590,SCL,Audley Ellerslie Abbey Road,,,Malvern,Worcestershire,WR14 3HL,Tel: 01684 437104,No ratings yet Rate it yourself - /Services/careproviders/LeaveReview/DefaultView.aspx?id=1-4076170590,0,0,,
Shaw Red Hill Care Centre,1-8157662470,SCL,229 London Road,,,Worcester,Worcestershire,WR5 2JG,Tel: 01905354000,No ratings yet Rate it yourself - /Services/careproviders/LeaveReview/DefaultView.aspx?id=1-8157662470,0,0,,
Staffing Plus Ltd,1-2482960110,SCL,58 Cherwell Close,,,Worcester,,WR4 9BN,Tel: 01212968416,No ratings yet Rate it yourself - /Services/careproviders/LeaveReview/DefaultView.aspx?id=1-2482960110,0,0,,
Glarm Health Care Services Limited,1-17576806035,SCL,18 Blackthorn Road,,,Worcester,,WR4 9TD,Tel: 07427412381,No ratings yet Rate it yourself - /Services/careproviders/LeaveReview/DefaultView.aspx?id=1-17576806035,0,0,,
Crookbarrow View,1-11099525152,SCL,3 Gotland Road,Off Whittington Road,,Worcester,,WR5 2GN,Tel: 03701924347,No ratings yet Rate it yourself - /Services/careproviders/LeaveReview/DefaultView.aspx?id=1-11099525152,0,0,,
Elgar Court Care Home,1-16539671822,SCL,35 St. Andrews Road,,,Malvern,,WR14 3PT,Tel: 01684211720,No ratings yet Rate it yourself - /Services/careproviders/LeaveReview/DefaultView.aspx?id=1-16539671822,0,0,,
Worcestershire,1-14478954029,SCL,Suite G05,"Oak House, Bridgewater Road",,Worcester,,WR4 9FX,Tel: 07450936311,No ratings yet Rate it yourself - /Services/careproviders/LeaveReview/DefaultView.aspx?id=1-14478954029,0,0,,
Shining Star Home Care Limited,1-11058533433,SCL,40 Malvern Oaks Close,Cradley,,Malvern,,WR13 5NE,Tel: 07958591470,No ratings yet Rate it yourself - /Services/careproviders/LeaveReview/DefaultView.aspx?id=1-11058533433,0,0,,
Radis Community Care (Meadow Court),1-4279578771,SCL,Meadow Court,Darwin Avenue,,Worcester,,WR5 1AP,Tel: 01905353453,No ratings yet Rate it yourself - /Services/careproviders/LeaveReview/DefaultView.aspx?id=1-4279578771,0,0,,
Latimer Court,1-592699847,SCL,Darwin Avenue,,,Worcester,Worcestershire,WR5 1SP,Tel: 01905363270,No ratings yet Rate it yourself - /Services/careproviders/LeaveReview/DefaultView.aspx?id=1-592699847,0,0,,
Nationwide Care Services Ltd (Worcester),1-2694538733,SCL,Blackpole Business Centre,Blackpole,,Worcester,,WR3 8SQ,Tel: 01905458792,No ratings yet Rate it yourself - /Services/careproviders/LeaveReview/DefaultView.aspx?id=1-2694538733,0,0,,
MJSGBig5RewardsHealthcare Limited,1-2420422302,SCL,"Room 11A1, Blackpole Business Centre",Blackpole Road,,Worcester,,WR3 8SQ,Tel: 01905923356,No ratings yet Rate it yourself - /Services/careproviders/LeaveReview/DefaultView.aspx?id=1-2420422302,0,0,,
Wyndsor Home Care Ltd,1-388246437,SCL,21 Otley Close,Heron Grange,,Worcester,Worcestershire,WR4 0BJ,Tel: 01905613725,No ratings yet Rate it yourself - /Services/careproviders/LeaveReview/DefaultView.aspx?id=1-388246437,0,0,,
Reablement Service,1-982233141,SCL,G3 County Hall,Spetchley Road,,Worcester,,WR5 2NP,Tel: 01905843341,No ratings yet Rate it yourself - /Services/careproviders/LeaveReview/DefaultView.aspx?id=1-982233141,0,0,,
Shared Lives,1-982233179,SCL,G3 County Hall,Spetchley Road,,Worcester,,WR5 2NP,Tel: 01905844264,No ratings yet Rate it yourself - /Services/careproviders/LeaveReview/DefaultView.aspx?id=1-982233179,0,0,,
Caremark (Wychavon & Wyre Forest),1-12836256485,SCL,Polysec House,"Blackpole Trading Estate West, Hindlip Lane",,Worcester,,WR3 8TJ,Tel: 01562543290,No ratings yet Rate it yourself - /Services/careproviders/LeaveReview/DefaultView.aspx?id=1-12836256485,0,0,,
Caremark (Worcester & Malvern Hills),1-2446245822,SCL,Polysec House,Blackpole Trading Estate West,,Worcester,Worcestershire,WR3 8TJ,Tel: 01905 452595,No ratings yet Rate it yourself - /Services/careproviders/LeaveReview/DefaultView.aspx?id=1-2446245822,0,0,,
Fernhill House,1-5383009245,SCL,Grange Lane,Fernhill Heath,,Worcester,Worcestershire,WR3 7UR,Tel: 01905679300,No ratings yet Rate it yourself - /Services/careproviders/LeaveReview/DefaultView.aspx?id=1-5383009245,0,0,,
People in Action Domiciliary Care - Worcester,1-111132927,SCL,"Suite 2, Crown House",Blackpole East,,Worcester,Worcestershire,WR3 8SG,Tel: 01905755843,No ratings yet Rate it yourself - /Services/careproviders/LeaveReview/DefaultView.aspx?id=1-111132927,0,0,,
Options Malvern View,1-119276146,SCL,The Rhydd,,,Hanley Castle,Worcestershire,WR8 0AD,Tel: 01684312610,No ratings yet Rate it yourself - /Services/careproviders/LeaveReview/DefaultView.aspx?id=1-119276146,0,0,,
Perry Manor,1-1459306141,SCL,Charles Hastings Way,,,Worcester,Worcestershire,WR5 1ET,Tel: 01905728410,No ratings yet Rate it yourself - /Services/careproviders/LeaveReview/DefaultView.aspx?id=1-1459306141,0,0,,
Your Elysium Limited,1-3005110455,SCL,"Unit 5b, Top Barn Business Centre,","Worcester Road, Holt Heath",,Worcester,,WR6 6NH,Tel: 01905930699,No ratings yet Rate it yourself - /Services/careproviders/LeaveReview/DefaultView.aspx?id=1-3005110455,0,0,,
Snow Bengal Ltd,1-14907954822,SCL,"Unit 18a, Top Barn Business Centre","Worcester Road, Holt Heath",,Worcester,,WR6 6NH,Tel: 01905954694,No ratings yet Rate it yourself - /Services/careproviders/LeaveReview/DefaultView.aspx?id=1-14907954822,0,0,,
Dimensions Worcestershire Domiciliary Care Office,1-352614727,SCL,"Unit 6A1, Revolution House","Stanier Road, Warndon",,Worcester,Worcestershire,WR4 9FE,Tel: 03003039037,No ratings yet Rate it yourself - /Services/careproviders/LeaveReview/DefaultView.aspx?id=1-352614727,0,0,,
TruCARE UK Ltd,1-7216735073,SCL,29 Bridgnorth Row,Berkeley Beverborne,,Worcester,,WR4 0QF,Tel: 07834704945,No ratings yet Rate it yourself - /Services/careproviders/LeaveReview/DefaultView.aspx?id=1-7216735073,0,0,,
Norton Hall,1-129942411,SCL,Woodbury Park,Norton,,Worcester,Worcestershire,WR5 2QU,Tel: 01905357766,No ratings yet Rate it yourself - /Services/careproviders/LeaveReview/DefaultView.aspx?id=1-129942411,0,0,,
Albion Lodge Retirement Home,1-1693301436,SCL,Hanley Swan,Robert End,,Worcester,Worcestershire,WR8 0DN,Tel: 01684310626,No ratings yet Rate it yourself - /Services/careproviders/LeaveReview/DefaultView.aspx?id=1-1693301436,0,0,,
Acer Care and Care 4 Me,1-10324127390,SCL,Homestead,"Roberts End, Hanley Swan",,Worcester,Worcestershire,WR8 0DN,Tel: 01684491607,No ratings yet Rate it yourself - /Services/careproviders/LeaveReview/DefaultView.aspx?id=1-10324127390,0,0,,
Pirton Grange Specialist Services,1-142667700,SCL,Worcester Road,Pirton,,Worcester,Worcestershire,WR8 9EF,,No ratings yet Rate it yourself - /Services/careproviders/LeaveReview/DefaultView.aspx?id=1-142667700,0,0,,
The Chace Rest Home,1-115173007,SCL,Chase Road,Upper Welland,,Malvern,Worcestershire,WR14 4JY,Tel: 01684561813,No ratings yet Rate it yourself - /Services/careproviders/LeaveReview/DefaultView.aspx?id=1-115173007,0,0,,
R & L Healthcare,1-13363730271,SCL,"Unit 7, Offerton Barns Business Centre","Offerton Lane, Hindlip",,Worcester,Worcestershire,WR3 8SX,Tel: 01905455669,No ratings yet Rate it yourself - /Services/careproviders/LeaveReview/DefaultView.aspx?id=1-13363730271,0,0,,
Evendine House,1-144581960,SCL,Evendine House,Evendine Lane,,Malvern,Worcestershire,WR13 6DT,Tel: 033 0097 7373,No ratings yet Rate it yourself - /Services/careproviders/LeaveReview/DefaultView.aspx?id=1-144581960,0,0,,
Park House,1-119959899,SCL,28 Sherford Street,,,Bromyard,Herefordshire,HR7 4DL,Tel: 01885 483935,No ratings yet Rate it yourself - /Services/careproviders/LeaveReview/DefaultView.aspx?id=1-119959899,0,0,,
Froome Bank,1-134889315,SCL,Tower Hill,,,Bromyard,Herefordshire,HR7 4DF,Tel: 080 0902 0092,No ratings yet Rate it yourself - /Services/careproviders/LeaveReview/DefaultView.aspx?id=1-134889315,0,0,,
Welland House Care Centre,1-147134659,SCL,Lime Grove,Welland,,Malvern,Worcestershire,WR13 6LY,Tel: 01684310840,No ratings yet Rate it yourself - /Services/careproviders/LeaveReview/DefaultView.aspx?id=1-147134659,0,0,,
Allcare Services and Training Limited,1-2320856620,SCL,1 Rowberry Street,,,Bromyard,Herefordshire,HR7 4DU,Tel: 0190520205,No ratings yet Rate it yourself - /Services/careproviders/LeaveReview/DefaultView.aspx?id=1-2320856620,0,0,,