Organisation Name,NACS Code,Organisation Type,Address1,Address2,Address3,Address4,Address5,PostCode,Telephone Number,NHS.UK users rating,Value  (NHS.UK users rating),Banding Classification  (NHS.UK users rating),Car parking (Is there car parking at this organisation?),Disabled access (Disabled access)
The Old Vicarage,1-121398520,SCL,Ford Street,Wigmore,,Near Leominster,Herefordshire,HR6 9UW,Tel: 01568770564,No ratings yet Rate it yourself - /Services/careproviders/LeaveReview/DefaultView.aspx?id=1-121398520,0,0,,
Ashfield House Residential Home,1-15357343421,SCL,Ashfield House,Bargates,,Leominster,,HR6 8QX,Tel: 01568614662,No ratings yet Rate it yourself - /Services/careproviders/LeaveReview/DefaultView.aspx?id=1-15357343421,0,0,,
Ashfield House - Leominister,1-114968051,SCL,Bargates,,,Leominster,Herefordshire,HR6 8QX,Tel: 01568614662,2 ratings Rate it yourself - /Services/careproviders/LeaveReview/DefaultView.aspx?id=1-114968051,,,,
Buckfield House,1-109100867,SCL,Barons Cross Road,,,Leominster,Herefordshire,HR6 8QX,Tel: 01568613119,No ratings yet Rate it yourself - /Services/careproviders/LeaveReview/DefaultView.aspx?id=1-109100867,0,0,,
Ridgemoor Road,1-12366376197,SCL,The Mallards,Ridgemoor Road,,Leominster,,HR6 8UN,Tel: 01432261766,No ratings yet Rate it yourself - /Services/careproviders/LeaveReview/DefaultView.aspx?id=1-12366376197,0,0,,
Leominster Care Home,1-130120575,SCL,44 Bargates,,,Leominster,Herefordshire,HR6 8EY,Tel: 01568611800,No ratings yet Rate it yourself - /Services/careproviders/LeaveReview/DefaultView.aspx?id=1-130120575,0,0,,
Inspiration Care Domicilliary Care,1-933125711,SCL,West Lodge Chambers,Rainbow Street,,Leominster,Herefordshire,HR6 8DQ,Tel: 01568616540,No ratings yet Rate it yourself - /Services/careproviders/LeaveReview/DefaultView.aspx?id=1-933125711,0,0,,
Agincare UK Leominster,1-296363758,SCL,1 Lion Court,Broad Street,,Leominster,Herefordshire,HR6 8LS,Tel: 01568611160,No ratings yet Rate it yourself - /Services/careproviders/LeaveReview/DefaultView.aspx?id=1-296363758,0,0,,
Abel Care and Support Office,1-3237616108,SCL,2 Rugg House,New Street,,Leominster,Herefordshire,HR6 8DR,Tel: 07860115195,No ratings yet Rate it yourself - /Services/careproviders/LeaveReview/DefaultView.aspx?id=1-3237616108,0,0,,
Mortimer Homecare Limited,1-2855486574,SCL,5A Broad Street,,,Leominster,,HR6 8BT,Tel: 01568250169,No ratings yet Rate it yourself - /Services/careproviders/LeaveReview/DefaultView.aspx?id=1-2855486574,0,0,,
Kelsam Support Services Ltd,1-5895712963,SCL,Leominster Community Centre,School Road,,Leominster,,HR6 8NJ,Tel: 01568614100,No ratings yet Rate it yourself - /Services/careproviders/LeaveReview/DefaultView.aspx?id=1-5895712963,0,0,,
The Forbury,1-129867179,SCL,Church Street,,,Leominster,Herefordshire,HR6 8NQ,Tel: 01568613877,No ratings yet Rate it yourself - /Services/careproviders/LeaveReview/DefaultView.aspx?id=1-129867179,0,0,,
Chesfield House,1-109100750,SCL,112 South Street,,,Leominster,Herefordshire,HR6 8JF,Tel: 01568615877,1 rating Rate it yourself - /Services/careproviders/LeaveReview/DefaultView.aspx?id=1-109100750,,,,
Waverley House,1-134889478,SCL,Etnam Street,,,Leominster,Herefordshire,HR6 8AQ,Tel: 0800 902 0092,No ratings yet Rate it yourself - /Services/careproviders/LeaveReview/DefaultView.aspx?id=1-134889478,0,0,,
Cheadle Care Ltd,1-11229605290,SCL,Grange Court,Pinsley Road,,Leominster,Herefordshire,HR6 8NL,Tel: 01568701065,No ratings yet Rate it yourself - /Services/careproviders/LeaveReview/DefaultView.aspx?id=1-11229605290,0,0,,
Marches Home Care Services,1-137554598,SCL,"The Ellison Room, Grange Court",Pinsley Road,,Leominster,,HR6 8NL,Tel: 01568617699,No ratings yet Rate it yourself - /Services/careproviders/LeaveReview/DefaultView.aspx?id=1-137554598,0,0,,
Services for Independent Living,1-243372884,SCL,Unit 1 Owen Way,Leominster Enterprise Park,,Leominster,Herefordshire,HR6 0LA,Tel: 01568616653,No ratings yet Rate it yourself - /Services/careproviders/LeaveReview/DefaultView.aspx?id=1-243372884,0,0,,
West Eaton Nursing and Residential home,1-115758615,SCL,Worcester Road,,,Leominster,Herefordshire,HR6 0QJ,Tel: 01568 610395,No ratings yet Rate it yourself - /Services/careproviders/LeaveReview/DefaultView.aspx?id=1-115758615,0,0,,
Lynhales Hall Nursing Home,1-2272858428,SCL,Lyonshall,,,Kington,Herefordshire,HR5 3LN,Tel: 01544340238,1 rating Rate it yourself - /Services/careproviders/LeaveReview/DefaultView.aspx?id=1-2272858428,,,,
SunCare,1-2123875569,SCL,3 Bron Offices,"Manor Farm, Brampton Bryan",,Bucknell,Shropshire,SY7 0DH,Tel: 01547530633,No ratings yet Rate it yourself - /Services/careproviders/LeaveReview/DefaultView.aspx?id=1-2123875569,0,0,,
We Are Your Care Ltd,1-9602932947,SCL,"Community Centre, High Street",Leintwardine,,Craven Arms,,SY7 0LB,Tel: 01547540531,No ratings yet Rate it yourself - /Services/careproviders/LeaveReview/DefaultView.aspx?id=1-9602932947,0,0,,
Woofferton Residential Care Home,1-123567394,SCL,Woofferton,,,Ludlow,Shropshire,SY8 4AL,Tel: 01584711207,No ratings yet Rate it yourself - /Services/careproviders/LeaveReview/DefaultView.aspx?id=1-123567394,0,0,,
Kington Court Nursing Home,1-12369527774,SCL,Victoria Road,,,Kington,Herefordshire,HR5 3BX,Tel: 01544232333,No ratings yet Rate it yourself - /Services/careproviders/LeaveReview/DefaultView.aspx?id=1-12369527774,0,0,,
SunCare,1-1872295447,SCL,The Old Surgery,The Meads,,Kington,Herefordshire,HR5 3DQ,Tel: 01544231413,No ratings yet Rate it yourself - /Services/careproviders/LeaveReview/DefaultView.aspx?id=1-1872295447,0,0,,
Border Care Ltd,1-3260259536,SCL,"1 Reception Office,The Old Police Station",1 Market Hall Street,,Kington,Herefordshire,HR5 3DP,Tel: 01544231500,No ratings yet Rate it yourself - /Services/careproviders/LeaveReview/DefaultView.aspx?id=1-3260259536,0,0,,
The Garth Care Home with Nursing,1-16287667075,SCL,The Square,,,Kington,Herefordshire,HR5 3BA,Tel: 01544230502,No ratings yet Rate it yourself - /Services/careproviders/LeaveReview/DefaultView.aspx?id=1-16287667075,0,0,,
BlueBelles Care Agency,1-842043966,SCL,9 Park View,,,Kington,Herefordshire,HR5 3AR,Tel: 01544231135,No ratings yet Rate it yourself - /Services/careproviders/LeaveReview/DefaultView.aspx?id=1-842043966,0,0,,
Montfort Fields,1-119126128,SCL,12 Montfort Fields,,,Kington,Herefordshire,HR5 3AT,Tel: 01544231030,No ratings yet Rate it yourself - /Services/careproviders/LeaveReview/DefaultView.aspx?id=1-119126128,0,0,,
Fairfield House,1-119959929,SCL,Bleathwood,,,Ludlow,Herefordshire,SY8 4LF,Tel: 01584 711878,No ratings yet Rate it yourself - /Services/careproviders/LeaveReview/DefaultView.aspx?id=1-119959929,0,0,,
Alexandra House Diamond Life Healthcare Ltd,1-357618515,SCL,Suite 6,54 Broad Street,,Ludlow,,SY8 1NH,Tel: 01584872233,No ratings yet Rate it yourself - /Services/careproviders/LeaveReview/DefaultView.aspx?id=1-357618515,0,0,,
Onny Cottage,1-10483548208,SCL,Bromfield,,,Ludlow,Shropshire,SY8 2JU,,No ratings yet Rate it yourself - /Services/careproviders/LeaveReview/DefaultView.aspx?id=1-10483548208,0,0,,
Glenview,1-119126254,SCL,54 Gravel Hill,,,Ludlow,Shropshire,SY8 1QS,Tel: 01584876262,No ratings yet Rate it yourself - /Services/careproviders/LeaveReview/DefaultView.aspx?id=1-119126254,0,0,,
Four Rivers Nursing Home,1-122877090,SCL,Bromfield Road,,,Ludlow,Shropshire,SY8 1DW,Tel: 01584813500,No ratings yet Rate it yourself - /Services/careproviders/LeaveReview/DefaultView.aspx?id=1-122877090,0,0,,
Vision Homes Association Supported Living Services,1-120266717,SCL,16 Burway Trading Estate,Bromfield Road,,Ludlow,,SY8 1EN,Tel: 01584877166,No ratings yet Rate it yourself - /Services/careproviders/LeaveReview/DefaultView.aspx?id=1-120266717,0,0,,
Hagley Place,1-426954409,SCL,Foldgate Lane,,,Ludlow,Shropshire,SY8 1LS,Tel: 01584519849,No ratings yet Rate it yourself - /Services/careproviders/LeaveReview/DefaultView.aspx?id=1-426954409,0,0,,
Vision Homes Association - 1B Toll Gate Road,1-120266639,SCL,1b Toll Gate Road,,,Ludlow,Shropshire,SY8 1TQ,Tel: 01584877870,No ratings yet Rate it yourself - /Services/careproviders/LeaveReview/DefaultView.aspx?id=1-120266639,0,0,,
Vision Homes Association - 1C Toll Gate Road,1-120266656,SCL,1c Toll Gate Road,,,Ludlow,Shropshire,SY8 1TQ,Tel: 01584877566,No ratings yet Rate it yourself - /Services/careproviders/LeaveReview/DefaultView.aspx?id=1-120266656,0,0,,
Vision Homes Association - 1A Toll Gate Road,1-120227670,SCL,1A Toll Gate Road,,,Ludlow,Shropshire,SY8 1TQ,Tel: 01584877737,No ratings yet Rate it yourself - /Services/careproviders/LeaveReview/DefaultView.aspx?id=1-120227670,0,0,,
Alexandra House - Ludlow,1-113552529,SCL,Poyner Road,,,Ludlow,Shropshire,SY8 1QT,Tel: 01584872412,No ratings yet Rate it yourself - /Services/careproviders/LeaveReview/DefaultView.aspx?id=1-113552529,0,0,,
Churchill House Care Home,1-123824337,SCL,Keepside Close,Bromfield Road,,Ludlow,Shropshire,SY8 1EL,Tel: 01584877500,No ratings yet Rate it yourself - /Services/careproviders/LeaveReview/DefaultView.aspx?id=1-123824337,0,0,,
Quality Community Care Ltd,1-7077012415,SCL,Rockspring Community Centre,Sandford Road,,Ludlow,,SY8 1SX,Tel: 01584318861,No ratings yet Rate it yourself - /Services/careproviders/LeaveReview/DefaultView.aspx?id=1-7077012415,0,0,,
Hendra House Residential Home,1-110422537,SCL,15 Sandpits Road,,,Ludlow,Shropshire,SY8 1HH,Tel: 01584 873041,No ratings yet Rate it yourself - /Services/careproviders/LeaveReview/DefaultView.aspx?id=1-110422537,0,0,,
Care at Home (Shropshire) Limited,1-1181587812,SCL,Unit 1,"Rural Enterprise Centre, Eco Park Road",,Ludlow,Shropshire,SY8 1FF,Tel: 01584838420,No ratings yet Rate it yourself - /Services/careproviders/LeaveReview/DefaultView.aspx?id=1-1181587812,0,0,,
Care of Excellence Limited,1-1905070106,SCL,Unit 21 Rural Enterprise Centre,Eco Park Road,,Ludlow,Shropshire,SY8 1FF,Tel: 01584838413,No ratings yet Rate it yourself - /Services/careproviders/LeaveReview/DefaultView.aspx?id=1-1905070106,0,0,,
Sapphire Community Care Ltd,1-6659134549,SCL,"Office 3 Flowfit, Ludlow Business Park",Coder Road,,Ludlow,,SY8 1XE,Tel: 01584876475,No ratings yet Rate it yourself - /Services/careproviders/LeaveReview/DefaultView.aspx?id=1-6659134549,0,0,,
Orchard End,1-119959914,SCL,Auberrow,Wellington,,Hereford,Herefordshire,HR4 8AL,Tel: 01432 839038,No ratings yet Rate it yourself - /Services/careproviders/LeaveReview/DefaultView.aspx?id=1-119959914,0,0,,
Haresbrook Park Care Home,1-1935889079,SCL,Haresbrook Lane,,,Tenbury Wells,Worcestershire,WR15 8FD,Tel: 01584811786,No ratings yet Rate it yourself - /Services/careproviders/LeaveReview/DefaultView.aspx?id=1-1935889079,0,0,,
New Dawn Care Agency ,1-115483525,SCL,The Old Shippon,Onibury,,Craven Arms,Shropshire,SY7 9AW,,No ratings yet Rate it yourself - /Services/careproviders/LeaveReview/DefaultView.aspx?id=1-115483525,0,0,,
Moor Court,1-116682569,SCL,Moor Court Residential Home,Bodenham,,Hereford,Herefordshire,HR1 3HW,Tel: 01568797461,No ratings yet Rate it yourself - /Services/careproviders/LeaveReview/DefaultView.aspx?id=1-116682569,0,0,,
Credenhill Court Rest Home,1-118086037,SCL,Credenhill Court,Credenhill,,Hereford,Herefordshire,HR4 7DL,Tel: 01432760349,No ratings yet Rate it yourself - /Services/careproviders/LeaveReview/DefaultView.aspx?id=1-118086037,0,0,,
Stretton Nursing Home,1-115803913,SCL,Manor Fields,Burghill,,Hereford,Herefordshire,HR4 7RR,Tel: 01432761066,No ratings yet Rate it yourself - /Services/careproviders/LeaveReview/DefaultView.aspx?id=1-115803913,0,0,,
"Eclipse HomeCare (The Teme Valley, Tenbury & Bromyard)",1-2827219712,SCL,21 Teme Street,21 Teme Street,,Tenbury Wells,Worcestershire,WR15 8BB,Tel: 01905641070,No ratings yet Rate it yourself - /Services/careproviders/LeaveReview/DefaultView.aspx?id=1-2827219712,0,0,,
The Weir Nursing Home,1-117345200,SCL,Swainshill,,,Hereford,Herefordshire,HR4 7QF,Tel: 01981590229,No ratings yet Rate it yourself - /Services/careproviders/LeaveReview/DefaultView.aspx?id=1-117345200,0,0,,
Forever Loving Care LTD,1-9142597120,SCL,The Wishing Well,Market Street,,Craven Arms,,SY7 9NN,Tel: 01588673733,No ratings yet Rate it yourself - /Services/careproviders/LeaveReview/DefaultView.aspx?id=1-9142597120,0,0,,
Pencombe Hall,1-140403915,SCL,Pencombe,,,Bromyard,Herefordshire,HR7 4RL,Tel: 01885400217,No ratings yet Rate it yourself - /Services/careproviders/LeaveReview/DefaultView.aspx?id=1-140403915,0,0,,
Sunnydale,1-117283343,SCL,32 Shrewsbury Road,,,Craven Arms,Shropshire,SY7 9PY,Tel: 01588673443,1 rating Rate it yourself - /Services/careproviders/LeaveReview/DefaultView.aspx?id=1-117283343,,,,
Coldwells House,1-121568241,SCL,Coldwell's Road,Holmer,,Hereford,Herefordshire,HR1 1LH,Tel: 01432272414,No ratings yet Rate it yourself - /Services/careproviders/LeaveReview/DefaultView.aspx?id=1-121568241,0,0,,
Holmer Care Home with Nursing,1-6186788341,SCL,Leominster Road,Holmer,,Hereford,Herefordshire,HR4 9RG,Tel: 01432344012,No ratings yet Rate it yourself - /Services/careproviders/LeaveReview/DefaultView.aspx?id=1-6186788341,0,0,,
Aspire Living - 94 Chatsworth Road,1-121620597,SCL,Westfields,,,Hereford,Herefordshire,HR4 9HZ,Tel: 01432340560,No ratings yet Rate it yourself - /Services/careproviders/LeaveReview/DefaultView.aspx?id=1-121620597,0,0,,
Holmer Court Residential Home,1-121455558,SCL,Attwood Lane,,,Hereford,Herefordshire,HR1 1LJ,Tel: 01432351335,No ratings yet Rate it yourself - /Services/careproviders/LeaveReview/DefaultView.aspx?id=1-121455558,0,0,,
Mobile Care,1-784186305,SCL,Mortimer House,Holmer Road,,Hereford,,HR4 9TA,Tel: 01432268406,No ratings yet Rate it yourself - /Services/careproviders/LeaveReview/DefaultView.aspx?id=1-784186305,0,0,,
Cedar Lodge,1-2097943890,SCL,West Midlands Learning Campus,Rowden,,Bromyard,Herefordshire,HR7 4LS,Tel: 01885 488096,No ratings yet Rate it yourself - /Services/careproviders/LeaveReview/DefaultView.aspx?id=1-2097943890,0,0,,
Winslow Court,1-119959868,SCL,Rowden,,,Bromyard,Herefordshire,HR7 4LS,Tel: 01885 488096,No ratings yet Rate it yourself - /Services/careproviders/LeaveReview/DefaultView.aspx?id=1-119959868,0,0,,
Blackwells,1-120393554,SCL,210 Whitecross Road,,,Hereford,Herefordshire,HR4 0DJ,Tel: 01432350853,No ratings yet Rate it yourself - /Services/careproviders/LeaveReview/DefaultView.aspx?id=1-120393554,0,0,,
July VII Ltd t/a Wykenhurst Residential Home,1-131460958,SCL,17/19 Baggallay Street,,,Hereford,Herefordshire,HR4 0DZ,,No ratings yet Rate it yourself - /Services/careproviders/LeaveReview/DefaultView.aspx?id=1-131460958,0,0,,
Altogether Care,1-2172230912,SCL,Nestcliffe House,"Fields Yard, Plough Lane",,Hereford,Herefordshire,HR4 0EL,Tel: 01432344844,No ratings yet Rate it yourself - /Services/careproviders/LeaveReview/DefaultView.aspx?id=1-2172230912,0,0,,
First Key Hereford,1-4695602718,SCL,13 Holmer Street,,,Hereford,Herefordshire,HR4 0HS,Tel: 01432342402,No ratings yet Rate it yourself - /Services/careproviders/LeaveReview/DefaultView.aspx?id=1-4695602718,0,0,,
Newstead House Nursing and Residential Home,1-2353783860,SCL,43 Venns Lane,,,Hereford,Herefordshire,HR1 1DT,Tel: 01432 263131,No ratings yet Rate it yourself - /Services/careproviders/LeaveReview/DefaultView.aspx?id=1-2353783860,0,0,,
Venns Lane Care Home,1-4838607090,SCL,47 Venns Lane,,,Hereford,Herefordshire,HR1 1DT,Tel: 01432345181,No ratings yet Rate it yourself - /Services/careproviders/LeaveReview/DefaultView.aspx?id=1-4838607090,0,0,,
Whitehall Place,1-17412422384,SCL,Whitehall Place,Madley,,Hereford,,HR2 9LS,Tel: 07792116492,No ratings yet Rate it yourself - /Services/careproviders/LeaveReview/DefaultView.aspx?id=1-17412422384,0,0,,
Herefordshire Shared Lives,1-5985974050,SCL,County Offices,Plough Lane,,Hereford,Herefordshire,HR4 0LE,,1 rating Rate it yourself - /Services/careproviders/LeaveReview/DefaultView.aspx?id=1-5985974050,,,,
Radis Community Care (Hereford Supported Living),1-6253913911,SCL,Henffordd Gardens,Penhaligon Way,,Hereford,,HR4 9YJ,Tel: 07562437921,No ratings yet Rate it yourself - /Services/careproviders/LeaveReview/DefaultView.aspx?id=1-6253913911,0,0,,
Elgar Care Ltd,1-3081986036,SCL,178 Widemarsh Street,,,Hereford,,HR4 9HN,Tel: 01432507560,No ratings yet Rate it yourself - /Services/careproviders/LeaveReview/DefaultView.aspx?id=1-3081986036,0,0,,
Aspire Support,1-2206520209,SCL,Aspire Community Hub,Canal Road,,Hereford,Herefordshire,HR1 2EA,Tel: 01432266881,No ratings yet Rate it yourself - /Services/careproviders/LeaveReview/DefaultView.aspx?id=1-2206520209,0,0,,
Livability Wall Street,1-119325067,SCL,14 Wall Street,,,Hereford,Herefordshire,HR4 9HP,Tel: 01432342683,No ratings yet Rate it yourself - /Services/careproviders/LeaveReview/DefaultView.aspx?id=1-119325067,0,0,,
Broomy Hill Nursing Home,1-121455542,SCL,43 Breinton Road,,,Hereford,Herefordshire,HR4 0JY,Tel: 01432274474,No ratings yet Rate it yourself - /Services/careproviders/LeaveReview/DefaultView.aspx?id=1-121455542,0,0,,
One Team Domiciliary,1-11064506667,SCL,Unit 5,26-28 Aubrey Street,,Hereford,,HR4 0BU,Tel: 07730432302,No ratings yet Rate it yourself - /Services/careproviders/LeaveReview/DefaultView.aspx?id=1-11064506667,0,0,,
Joghide Home Care (Worcestershire),1-9043434272,SCL,"Suite 2, Third Floor, Kemble House",36-39 Broad Street,,Hereford,,HR4 9AR,Tel: 07726402204,No ratings yet Rate it yourself - /Services/careproviders/LeaveReview/DefaultView.aspx?id=1-9043434272,0,0,,
Katherine Harriet,1-3007109115,SCL,9 Broad Street,,,Hereford,,HR4 9AP,Tel: 01432483083,No ratings yet Rate it yourself - /Services/careproviders/LeaveReview/DefaultView.aspx?id=1-3007109115,0,0,,
Southbank,1-12369615149,SCL,4 Southbank Close,,,Hereford,Herefordshire,HR1 2TQ,Tel: 01432261766,No ratings yet Rate it yourself - /Services/careproviders/LeaveReview/DefaultView.aspx?id=1-12369615149,0,0,,
Lyndale,1-117283322,SCL,24 Southbank Close,,,Hereford,Herefordshire,HR1 2TQ,Tel: 01432378118,No ratings yet Rate it yourself - /Services/careproviders/LeaveReview/DefaultView.aspx?id=1-117283322,0,0,,
New Hope Care Hereford,1-13727045202,SCL,3 Jubilee Building,Faraday Road,,Hereford,,HR4 9BB,Tel: 01432350057,No ratings yet Rate it yourself - /Services/careproviders/LeaveReview/DefaultView.aspx?id=1-13727045202,0,0,,
Home First,1-13258077198,SCL,Town Hall,10 St. Owen Street,,Hereford,,HR1 2PJ,Tel: 01432216766,No ratings yet Rate it yourself - /Services/careproviders/LeaveReview/DefaultView.aspx?id=1-13258077198,0,0,,
Candela Healthcare Ltd,1-12566526711,SCL,"No. 5A, Former Magistrates Court",Gaol Street,,Hereford,,HR1 2HU,,No ratings yet Rate it yourself - /Services/careproviders/LeaveReview/DefaultView.aspx?id=1-12566526711,0,0,,
Orchard House,1-134889418,SCL,The Walk,Withington,,Hereford,Herefordshire,HR1 3PR,Tel: 0800 902 0092,No ratings yet Rate it yourself - /Services/careproviders/LeaveReview/DefaultView.aspx?id=1-134889418,0,0,,
Oaklands Nursing Home,1-137884892,SCL,43 Bodenham Road,,,Hereford,Herefordshire,HR1 2TP,Tel: 01432272775,2 ratings Rate it yourself - /Services/careproviders/LeaveReview/DefaultView.aspx?id=1-137884892,,,,
Doddington Lodge,1-7194606597,SCL,Doddington,Hopton Wafers,,Kidderminster,,DY14 0HJ,Tel: 01584707084,No ratings yet Rate it yourself - /Services/careproviders/LeaveReview/DefaultView.aspx?id=1-7194606597,0,0,,
Whitegates,1-121568276,SCL,25 Hereford Road,,,Bromyard,Herefordshire,HR7 4ES,Tel: 01885482437,No ratings yet Rate it yourself - /Services/careproviders/LeaveReview/DefaultView.aspx?id=1-121568276,0,0,,
The Trio House,1-152560698,SCL,15 Abbotsmead Road,Belmont,,Hereford,Herefordshire,HR2 7SH,Tel: 01432342416,No ratings yet Rate it yourself - /Services/careproviders/LeaveReview/DefaultView.aspx?id=1-152560698,0,0,,
Noble Manor,1-11896216140,SCL,Ledbury Court,Ledbury Road,,Hereford,Herefordshire,HR1 2SZ,,No ratings yet Rate it yourself - /Services/careproviders/LeaveReview/DefaultView.aspx?id=1-11896216140,0,0,,
Eastbank,1-116698252,SCL,26 Ledbury Road,,,Hereford,Herefordshire,HR1 2SY,Tel: 01432266177,No ratings yet Rate it yourself - /Services/careproviders/LeaveReview/DefaultView.aspx?id=1-116698252,0,0,,
National Star at Ledbury Road,1-7740554773,SCL,1,Ledbury Road,,Hereford,,HR1 2SX,Tel: 01432802925,No ratings yet Rate it yourself - /Services/careproviders/LeaveReview/DefaultView.aspx?id=1-7740554773,0,0,,
Old Court Barn Residential Care Home,1-114140620,SCL,Old Court Barn,Lumber Lane,,Lugwardine,Herefordshire,HR1 4AQ,Tel: 01432851260,No ratings yet Rate it yourself - /Services/careproviders/LeaveReview/DefaultView.aspx?id=1-114140620,0,0,,
Highwell House Care Home with Nursing,1-121568260,SCL,32 Highwell Lane,,,Bromyard,Herefordshire,HR7 4DG,Tel: 01885488282,No ratings yet Rate it yourself - /Services/careproviders/LeaveReview/DefaultView.aspx?id=1-121568260,0,0,,
Allcare Services and Training Limited,1-2320856620,SCL,1 Rowberry Street,,,Bromyard,Herefordshire,HR7 4DU,Tel: 0190520205,No ratings yet Rate it yourself - /Services/careproviders/LeaveReview/DefaultView.aspx?id=1-2320856620,0,0,,
Froome Bank,1-134889315,SCL,Tower Hill,,,Bromyard,Herefordshire,HR7 4DF,Tel: 080 0902 0092,No ratings yet Rate it yourself - /Services/careproviders/LeaveReview/DefaultView.aspx?id=1-134889315,0,0,,
Brockington House Care Community,1-7237908552,SCL,Hafod Road,,,Hereford,,HR1 1SQ,Tel: 01432623301,No ratings yet Rate it yourself - /Services/careproviders/LeaveReview/DefaultView.aspx?id=1-7237908552,0,0,,
Park House,1-119959899,SCL,28 Sherford Street,,,Bromyard,Herefordshire,HR7 4DL,Tel: 01885 483935,No ratings yet Rate it yourself - /Services/careproviders/LeaveReview/DefaultView.aspx?id=1-119959899,0,0,,
Lammas Lodge,1-350355992,SCL,Lugwardine,,,Hereford,Herefordshire,HR1 4DS,Tel: 01432853185,No ratings yet Rate it yourself - /Services/careproviders/LeaveReview/DefaultView.aspx?id=1-350355992,0,0,,
H.M. Care Agency,1-2209588099,SCL,172 Ross Road,,,Hereford,Herefordshire,HR2 7PH,Tel: 01432360518,No ratings yet Rate it yourself - /Services/careproviders/LeaveReview/DefaultView.aspx?id=1-2209588099,0,0,,
Hillside Care Centre,1-13266974097,SCL,9 Pentwyn Avenue,,,Hereford,,HR2 7LB,Tel: 01432261627,No ratings yet Rate it yourself - /Services/careproviders/LeaveReview/DefaultView.aspx?id=1-13266974097,0,0,,
Martha House,1-113958355,SCL,"Martha House, Hampton Green",Old Eign Hill,,Hereford,Herefordshire,HR1 1UB,Tel: 01432279314,No ratings yet Rate it yourself - /Services/careproviders/LeaveReview/DefaultView.aspx?id=1-113958355,0,0,,
Gwen Walford House,1-2259504714,SCL,48-50 Hampton Park Road,,,Hereford,Herefordshire,HR1 1TH,Tel: 01432272418,1 rating Rate it yourself - /Services/careproviders/LeaveReview/DefaultView.aspx?id=1-2259504714,,,,
Hampton Grange Nursing Home,1-2289805209,SCL,48-50 Hampton Park Road,,,Hereford,Herefordshire,HR1 1TH,Tel: 01432272418,No ratings yet Rate it yourself - /Services/careproviders/LeaveReview/DefaultView.aspx?id=1-2289805209,0,0,,
Aston House,1-10048660596,SCL,45 Hampton Park Road,,,Hereford,Herefordshire,HR1 1TJ,Tel: 01432267996,No ratings yet Rate it yourself - /Services/careproviders/LeaveReview/DefaultView.aspx?id=1-10048660596,0,0,,
Sophie House,1-473349271,SCL,Holywell Gutter Lane,,,Hampton Bishop,Herefordshire,HR1 4JN,Tel: 01432378149,No ratings yet Rate it yourself - /Services/careproviders/LeaveReview/DefaultView.aspx?id=1-473349271,0,0,,
Charles Court Care Home,1-126476591,SCL,The Ploughman,,,Hereford,Herefordshire,HR2 6GG,Tel: 01432374330,No ratings yet Rate it yourself - /Services/careproviders/LeaveReview/DefaultView.aspx?id=1-126476591,0,0,,
Quality Care @ Home,1-1846171018,SCL,"Suite 4B, Thorn Office Centre",Thorn Business Park,,Hereford,,HR2 6JT,Tel: 01432639736,No ratings yet Rate it yourself - /Services/careproviders/LeaveReview/DefaultView.aspx?id=1-1846171018,0,0,,