Organisation Name,NACS Code,Organisation Type,Address1,Address2,Address3,Address4,Address5,PostCode,Telephone Number,NHS.UK users rating,Value  (NHS.UK users rating),Banding Classification  (NHS.UK users rating),Car parking (Is there car parking at this organisation?),Disabled access (Disabled access)
Churchview and Larklands,1-12236475958,SCL,St. Johns Road,,,Ilkeston,,DE7 5PA,Tel: 01159323209,No ratings yet Rate it yourself - /Services/careproviders/LeaveReview/DefaultView.aspx?id=1-12236475958,0,0,,
Hillside,1-12236475864,SCL,31 Albany Street,,,Ilkeston,Derbyshire,DE7 5AD,Tel: 01159300171,No ratings yet Rate it yourself - /Services/careproviders/LeaveReview/DefaultView.aspx?id=1-12236475864,0,0,,
Avanti Homecare Limited,1-6146756844,SCL,Unit 10,Kensington Street,,Ilkeston,,DE7 5NY,Tel: 01158571001,No ratings yet Rate it yourself - /Services/careproviders/LeaveReview/DefaultView.aspx?id=1-6146756844,0,0,,
Independent Care Link Ltd,1-12853537496,SCL,233 Nottingham Road,,,Ilkeston,,DE7 5AT,,No ratings yet Rate it yourself - /Services/careproviders/LeaveReview/DefaultView.aspx?id=1-12853537496,0,0,,
Firstcall 247 Limited,1-12776305587,SCL,Toll Bar House Business Centre,1 Derby Road,,Ilkeston,,DE7 5FH,,No ratings yet Rate it yourself - /Services/careproviders/LeaveReview/DefaultView.aspx?id=1-12776305587,0,0,,
Harmony Care & Support Ltd,1-361298347,SCL,16 South Street,,,Ilkeston,,DE7 5QE,Tel: 01159725292,1 rating Rate it yourself - /Services/careproviders/LeaveReview/DefaultView.aspx?id=1-361298347,,,,
Home Instead Ilkeston and Hucknall,1-18576519495,SCL,The Old Police Station,Wharncliffe Road,,Ilkeston,,DE7 5GF,Tel: 01156719970,No ratings yet Rate it yourself - /Services/careproviders/LeaveReview/DefaultView.aspx?id=1-18576519495,0,0,,
The Red House,1-1472074648,SCL,49 Wharncliffe Road,Ilkeston,,Derby,Derbyshire,DE7 5GF,Tel: 01159447869,No ratings yet Rate it yourself - /Services/careproviders/LeaveReview/DefaultView.aspx?id=1-1472074648,0,0,,
Sterling Supported Living Limited,1-17593429531,SCL,The Old Police Station,Wharncliffe Road,,Ilkeston,,DE7 5GF,Tel: 07947373786,No ratings yet Rate it yourself - /Services/careproviders/LeaveReview/DefaultView.aspx?id=1-17593429531,0,0,,
The Cedars and Larches Care Home,1-17949200212,SCL,16 Queens Drive,,,Ilkeston,Derbyshire,DE7 5GR,Tel: 01159308758,No ratings yet Rate it yourself - /Services/careproviders/LeaveReview/DefaultView.aspx?id=1-17949200212,0,0,,
Premier Community,1-5963870132,SCL,148 Bath Street,,,Ilkeston,,DE7 8FF,Tel: 01623810100,No ratings yet Rate it yourself - /Services/careproviders/LeaveReview/DefaultView.aspx?id=1-5963870132,0,0,,
Victoria Court,1-126242349,SCL,Nesfield Road,,,Ilkeston,Derbyshire,DE7 8AY,Tel: 01159322303,No ratings yet Rate it yourself - /Services/careproviders/LeaveReview/DefaultView.aspx?id=1-126242349,0,0,,
Fullwood House,1-1690710989,SCL,67 Lord Haddon Road,,,Ilkeston,Derbyshire,DE7 8AU,Tel: 01159323469,No ratings yet Rate it yourself - /Services/careproviders/LeaveReview/DefaultView.aspx?id=1-1690710989,0,0,,
Haddon House Care Home,1-128584534,SCL,38 Lord Haddon Road,,,Ilkeston,Derbyshire,DE7 8AW,Tel: 01159441641,No ratings yet Rate it yourself - /Services/careproviders/LeaveReview/DefaultView.aspx?id=1-128584534,0,0,,
Ladywood,1-320350941,SCL,Eaton Avenue,,,Ilkeston,Derbyshire,DE7 4HL,Tel: 01159440577,1 rating Rate it yourself - /Services/careproviders/LeaveReview/DefaultView.aspx?id=1-320350941,,,,
Victoria Park Care Home (Ilkeston),1-320756284,SCL,Manners Road,,,Ilkeston,Derbyshire,DE7 5HB,Tel: 01159440774,No ratings yet Rate it yourself - /Services/careproviders/LeaveReview/DefaultView.aspx?id=1-320756284,0,0,,
Oliver House,1-8921677520,SCL,33 Oliver Road,,,Ilkeston,Derbyshire,DE7 4JY,Tel: 01159440484,No ratings yet Rate it yourself - /Services/careproviders/LeaveReview/DefaultView.aspx?id=1-8921677520,0,0,,
Canal Vue,1-18388754032,SCL,107 Awsworth Road,,,Ilkeston,Derbyshire,DE7 8JF,Tel: 01159326390,No ratings yet Rate it yourself - /Services/careproviders/LeaveReview/DefaultView.aspx?id=1-18388754032,0,0,,
Peak Home Assist,1-9849576341,SCL,Wentworth House,"Manners Avenue, Manners Industrial Estate",,Ilkeston,,DE7 8EF,Tel: 01773306110,No ratings yet Rate it yourself - /Services/careproviders/LeaveReview/DefaultView.aspx?id=1-9849576341,0,0,,
Rutland Manor Nursing Home,1-132710146,SCL,99-109 Heanor Road,,,Ilkeston,Derbyshire,DE7 8TA,Tel: 01159440322,No ratings yet Rate it yourself - /Services/careproviders/LeaveReview/DefaultView.aspx?id=1-132710146,0,0,,
Bennerley Fields Centre,1-13897910445,SCL,22 Bennerley Avenue,,,Ilkeston,,DE7 8PF,Tel: 01629539590,No ratings yet Rate it yourself - /Services/careproviders/LeaveReview/DefaultView.aspx?id=1-13897910445,0,0,,
DCC Erewash Home Care,1-10391983393,SCL,Bennerley Fields Centre,22 Bennerley Fields,,Ilkeston,,DE7 8PF,Tel: 01629531944,No ratings yet Rate it yourself - /Services/careproviders/LeaveReview/DefaultView.aspx?id=1-10391983393,0,0,,
Coppice and Oakside,1-12236476025,SCL,Shipley Common lane,,,Ilkeston,Derbyshire,DE7 8TQ,Tel: 01159443690,No ratings yet Rate it yourself - /Services/careproviders/LeaveReview/DefaultView.aspx?id=1-12236476025,0,0,,
Deltaecho Care Ltd,1-19134295138,SCL,28 Field Farm Way,Stapleford,,Nottingham,,NG9 8JP,Tel: 07883024345,No ratings yet Rate it yourself - /Services/careproviders/LeaveReview/DefaultView.aspx?id=1-19134295138,0,0,,
First Class Care Services,1-15128968768,SCL,"Beaumont Hat Room, Strelley Hall","Main Street, Strelley",,Nottingham,,NG8 6PE,Tel: 01582969393,No ratings yet Rate it yourself - /Services/careproviders/LeaveReview/DefaultView.aspx?id=1-15128968768,0,0,,
Woodvale,1-6097479390,SCL,315 Wollaton Vale,,,Nottingham,Nottinghamshire,NG8 2PX,,No ratings yet Rate it yourself - /Services/careproviders/LeaveReview/DefaultView.aspx?id=1-6097479390,0,0,,
Homelink Care Support Services LTD,1-18385842971,SCL,129 Westwick Road,Bilborough,,Nottingham,,NG8 4HB,Tel: 07476125115,No ratings yet Rate it yourself - /Services/careproviders/LeaveReview/DefaultView.aspx?id=1-18385842971,0,0,,
Cockington House,1-1142951439,SCL,38 Cockington Road,,,Nottingham,Nottinghamshire,NG8 4BZ,Tel: 01159288013,No ratings yet Rate it yourself - /Services/careproviders/LeaveReview/DefaultView.aspx?id=1-1142951439,0,0,,
Bilborough,1-3641242498,SCL,20 Oakland Way,Bilborough,,Nottingham,Nottinghamshire,NG8 4JS,Tel: 01159296992,No ratings yet Rate it yourself - /Services/careproviders/LeaveReview/DefaultView.aspx?id=1-3641242498,0,0,,
Obsidian Supported Living,1-18998427370,SCL,"Office 1, Stapleford Business Hub","1 Toton Lane, Stapleford",,Nottingham,,NG9 7JQ,Tel: 01157846385,No ratings yet Rate it yourself - /Services/careproviders/LeaveReview/DefaultView.aspx?id=1-18998427370,0,0,,
Fosse Healthcare - Nottingham,1-10199022721,SCL,"Unit H5, Ash Tree Court","Mellors Way, Nottingham Business Park",,Nottingham,,NG8 6PY,Tel: 01157841866,No ratings yet Rate it yourself - /Services/careproviders/LeaveReview/DefaultView.aspx?id=1-10199022721,0,0,,
Future Home Care Limited Nottinghamshire North,1-2723924905,SCL,SHG House Cliff Hill Avenue,Stapleford,,Nottingham,,NG9 7HD,Tel: 01157530970,No ratings yet Rate it yourself - /Services/careproviders/LeaveReview/DefaultView.aspx?id=1-2723924905,0,0,,
Lifeways Community Care Limited (Nottingham),1-13354407048,SCL,"SHG House, Cliff Hill Avenue",Stapleford,,Nottingham,,NG9 7HD,,No ratings yet Rate it yourself - /Services/careproviders/LeaveReview/DefaultView.aspx?id=1-13354407048,0,0,,
Bramble Lodge,1-7209683149,SCL,82 High Lane West,West Hallam,,Ilkeston,Derbyshire,DE7 6HQ,Tel: 01159444545,1 rating Rate it yourself - /Services/careproviders/LeaveReview/DefaultView.aspx?id=1-7209683149,,,,
GHC Nursing Home,1-10809146644,SCL,472 Nottingham Road,Giltbrook,,Nottingham,Nottinghamshire,NG16 2GE,Tel: 01159383535,1 rating Rate it yourself - /Services/careproviders/LeaveReview/DefaultView.aspx?id=1-10809146644,,,,
Particular Healthcare Ltd,1-12003065169,SCL,25 Butt Street,Sandiacre,,Nottingham,,NG10 5JG,Tel: 07807037822,No ratings yet Rate it yourself - /Services/careproviders/LeaveReview/DefaultView.aspx?id=1-12003065169,0,0,,
Housing 21 - Seagrave Court,1-5518579092,SCL,"Seagrave Court, Seagrave Road",Strelley,,Nottingham,,NG8 6PU,Tel: 03701924969,No ratings yet Rate it yourself - /Services/careproviders/LeaveReview/DefaultView.aspx?id=1-5518579092,0,0,,
Mulberry Court Care Home,1-2320527018,SCL,61 Darnhall Crescent,Bilborough,,Nottingham,Nottinghamshire,NG8 4QA,Tel: 0115 929 4483,No ratings yet Rate it yourself - /Services/careproviders/LeaveReview/DefaultView.aspx?id=1-2320527018,0,0,,
Spring Lodge,1-19027302358,SCL,11 St. Agnes Close,,,Nottingham,,NG8 4BJ,Tel: 07803492660,No ratings yet Rate it yourself - /Services/careproviders/LeaveReview/DefaultView.aspx?id=1-19027302358,0,0,,
St Martins,1-3802488097,SCL,42 St Martins Road,,,Nottingham,Nottinghamshire,NG8 3AR,Tel: 01159297325,No ratings yet Rate it yourself - /Services/careproviders/LeaveReview/DefaultView.aspx?id=1-3802488097,0,0,,
Angels Care Management Services Ltd,1-1485684105,SCL,58 Station Road,Sandiacre,,Nottingham,Nottinghamshire,NG10 5AS,Tel: 01159720559,No ratings yet Rate it yourself - /Services/careproviders/LeaveReview/DefaultView.aspx?id=1-1485684105,0,0,,
West Hallam Care Home,1-3150346963,SCL,8 Newdigate Street,West Hallam,,Ilkeston,Derbyshire,DE7 6GZ,Tel: 01159440329,No ratings yet Rate it yourself - /Services/careproviders/LeaveReview/DefaultView.aspx?id=1-3150346963,0,0,,
Enable Support Limited,1-8501996163,SCL,175 Newthorpe Common,Newthorpe,,Nottingham,Nottinghamshire,NG16 2AW,Tel: 07764486075,1 rating Rate it yourself - /Services/careproviders/LeaveReview/DefaultView.aspx?id=1-8501996163,,,,
Elfcareuk Ltd,1-5837249837,SCL,26a Belper Road,West Hallam,,Ilkeston,,DE7 6GY,Tel: 01159986076,No ratings yet Rate it yourself - /Services/careproviders/LeaveReview/DefaultView.aspx?id=1-5837249837,0,0,,
Sandiacre Court Care Centre,1-1785539706,SCL,Derby Road,Sandiacre,,Nottingham,Nottinghamshire,NG10 5GT,Tel: 01158963940,No ratings yet Rate it yourself - /Services/careproviders/LeaveReview/DefaultView.aspx?id=1-1785539706,0,0,,
Bramcote Hills Care Home,1-260687651,SCL,Sandringham Drive,Bramcote,,Nottingham,Nottinghamshire,NG9 3EJ,Tel: 01159221414,1 rating Rate it yourself - /Services/careproviders/LeaveReview/DefaultView.aspx?id=1-260687651,,,,
Tottle Brook House,1-10564182313,SCL,Calverton Drive,Strelley,,Nottingham,Nottinghamshire,NG8 6QN,Tel: 01156660902,No ratings yet Rate it yourself - /Services/careproviders/LeaveReview/DefaultView.aspx?id=1-10564182313,0,0,,
Sandiacre Lodge,1-11680865223,SCL,280 Derby Road,Sandiacre,,Nottingham,,NG10 5HE,Tel: 07478653701,No ratings yet Rate it yourself - /Services/careproviders/LeaveReview/DefaultView.aspx?id=1-11680865223,0,0,,
The Rookery Care Home,1-1739390292,SCL,130 Church Street,Eastwood,,Nottingham,Nottinghamshire,NG16 3HT,Tel: 01773 713176,No ratings yet Rate it yourself - /Services/careproviders/LeaveReview/DefaultView.aspx?id=1-1739390292,0,0,,
Lawrence Mews,1-124361099,SCL,132 Church Street,Eastwood,,Nottingham,Nottinghamshire,NG16 3HT,Tel: 01773760849,No ratings yet Rate it yourself - /Services/careproviders/LeaveReview/DefaultView.aspx?id=1-124361099,0,0,,
University Care 3,1-9358522459,SCL,10 Derby Road,Bramcote,,Nottingham,,NG9 3BA,Tel: 07861372769,No ratings yet Rate it yourself - /Services/careproviders/LeaveReview/DefaultView.aspx?id=1-9358522459,0,0,,
The Grange Residential Care Home,1-118052463,SCL,39 Bostocks Lane,Sandiacre,,Nottingham,Nottinghamshire,NG10 5NL,Tel: 01159399489,No ratings yet Rate it yourself - /Services/careproviders/LeaveReview/DefaultView.aspx?id=1-118052463,0,0,,
Edward House,1-243554515,SCL,175 Nottingham Road,,,Eastwood,Nottinghamshire,NG16 3GS,Tel: 01773531591,No ratings yet Rate it yourself - /Services/careproviders/LeaveReview/DefaultView.aspx?id=1-243554515,0,0,,
Church Street Care Home,1-215791098,SCL,84 Church Street,,,Eastwood,Nottinghamshire,NG16 3HS,Tel: 01773765494,No ratings yet Rate it yourself - /Services/careproviders/LeaveReview/DefaultView.aspx?id=1-215791098,0,0,,
Eastwood House,1-123986699,SCL,24 Church Street,Eastwood,,Nottingham,Nottinghamshire,NG16 3HS,Tel: 01773712003,No ratings yet Rate it yourself - /Services/careproviders/LeaveReview/DefaultView.aspx?id=1-123986699,0,0,,
Alexandra House,1-17882516459,SCL,Nottingham Road,"Wroughton Court, Eastwood",,Nottingham,,NG16 3GP,Tel: 01773530749,No ratings yet Rate it yourself - /Services/careproviders/LeaveReview/DefaultView.aspx?id=1-17882516459,0,0,,
Longmoor Lodge Care Home,1-133544319,SCL,114 Longmoor Lane,Sandiacre,,Nottingham,Nottinghamshire,NG10 5JP,Tel: 01159499991,No ratings yet Rate it yourself - /Services/careproviders/LeaveReview/DefaultView.aspx?id=1-133544319,0,0,,
Little Acres,1-131819834,SCL,5 Spencer Drive,Nuthall,,Nottingham,Nottinghamshire,NG16 1DQ,Tel: 01159382236,No ratings yet Rate it yourself - /Services/careproviders/LeaveReview/DefaultView.aspx?id=1-131819834,0,0,,
Beechdale Manor Care Home,1-4675873280,SCL,40 Beechdale Road,,,Nottingham,Nottinghamshire,NG8 3AJ,Tel: 01158496400,2 ratings Rate it yourself - /Services/careproviders/LeaveReview/DefaultView.aspx?id=1-4675873280,,,,
Derbyshire Regional Office (Eden Supported Living Limited),1-6064200278,SCL,Bluebell Court,Bluebell Way,,Heanor,,DE75 7RF,Tel: 01636555140,No ratings yet Rate it yourself - /Services/careproviders/LeaveReview/DefaultView.aspx?id=1-6064200278,0,0,,
Woodhall Park Nursing Home,1-118326874,SCL,Risley Hall,Derby Road,,Risley,Derbyshire,DE72 3SS,Tel: 01159490444,No ratings yet Rate it yourself - /Services/careproviders/LeaveReview/DefaultView.aspx?id=1-118326874,0,0,,
Ashton Court Residential Home,1-141491563,SCL,56 Three Tuns Road,Eastwood,,Nottingham,Nottinghamshire,NG16 3EJ,Tel: 01773712017,No ratings yet Rate it yourself - /Services/careproviders/LeaveReview/DefaultView.aspx?id=1-141491563,0,0,,
Complete Care Needs,1-13937532942,SCL,38 Shipley Road,,,Nottingham,,NG8 6JE,,No ratings yet Rate it yourself - /Services/careproviders/LeaveReview/DefaultView.aspx?id=1-13937532942,0,0,,
Nottingham Home Care,1-1891781390,SCL,Dragon Court,Woolsthorpe Close,,Nottingham,,NG8 3BP,Tel: 01158763222,No ratings yet Rate it yourself - /Services/careproviders/LeaveReview/DefaultView.aspx?id=1-1891781390,0,0,,
Diamond Care Solutions Ltd,1-9079215306,SCL,8 Mansfield Road,Eastwood,,Nottingham,,NG16 3AQ,,No ratings yet Rate it yourself - /Services/careproviders/LeaveReview/DefaultView.aspx?id=1-9079215306,0,0,,
Topview Healthcare Ltd,1-16858860252,SCL,79 Fenwick Road,,,Nottingham,,NG8 6FU,Tel: 01159771585,No ratings yet Rate it yourself - /Services/careproviders/LeaveReview/DefaultView.aspx?id=1-16858860252,0,0,,
Bramwell,1-390674069,SCL,Bramwell Residential Care Home,"Bramwell Drive, Bramcote",,Nottingham,,NG9 3ST,Tel: 01159677571,No ratings yet Rate it yourself - /Services/careproviders/LeaveReview/DefaultView.aspx?id=1-390674069,0,0,,
Wollaton View Care Home,1-3087516929,SCL,21 Lambourne Drive,Wollaton,,Nottingham,Nottinghamshire,NG8 1GR,Tel: 01159289119,No ratings yet Rate it yourself - /Services/careproviders/LeaveReview/DefaultView.aspx?id=1-3087516929,0,0,,
Wollaton Park Care Home,1-434400852,SCL,2A Lambourne Drive,Wollaton,,Nottingham,Nottinghamshire,NG8 1GR,Tel: 01159283030,No ratings yet Rate it yourself - /Services/careproviders/LeaveReview/DefaultView.aspx?id=1-434400852,0,0,,
University Care 2,1-4835003000,SCL,53 Derby Road,Beeston,,Nottingham,,NG9 2TB,Tel: 01159168573,No ratings yet Rate it yourself - /Services/careproviders/LeaveReview/DefaultView.aspx?id=1-4835003000,0,0,,
Heanor Park Care Home,1-7899174085,SCL,Ilkeston Road,,,Heanor,,DE75 7DT,Tel: 01159346090,No ratings yet Rate it yourself - /Services/careproviders/LeaveReview/DefaultView.aspx?id=1-7899174085,0,0,,
Chetwynd House,1-4298697948,SCL,Slade Road,Chilwell,,Nottingham,Nottinghamshire,NG9 4GS,Tel: 01156979767,2 ratings Rate it yourself - /Services/careproviders/LeaveReview/DefaultView.aspx?id=1-4298697948,,,,
Gentle Hands Home Care,1-2731608549,SCL,Kable House,"Amber Drive, Langley Mill",,Nottingham,Nottinghamshire,NG16 4BE,Tel: 01773713935,No ratings yet Rate it yourself - /Services/careproviders/LeaveReview/DefaultView.aspx?id=1-2731608549,0,0,,
J&R Care Services,1-379716241,SCL,417 Bennett Street,,,Long Eaton,Nottinghamshire,NG10 4JE,Tel: 07931957704,No ratings yet Rate it yourself - /Services/careproviders/LeaveReview/DefaultView.aspx?id=1-379716241,0,0,,
Anchits Ltd,1-18038934465,SCL,9 Spean Court,Wollaton Road,,Nottingham,,NG8 1GL,Tel: 07523767217,No ratings yet Rate it yourself - /Services/careproviders/LeaveReview/DefaultView.aspx?id=1-18038934465,0,0,,
Shared Lives,1-13234307413,SCL,The Willows,Ambergate Road,,Nottingham,Nottinghamshire,NG8 3GD,Tel: 01158765846,No ratings yet Rate it yourself - /Services/careproviders/LeaveReview/DefaultView.aspx?id=1-13234307413,0,0,,
University Care,1-1755256775,SCL,17 Derby Road,Beeston,,Nottingham,Nottinghamshire,NG9 2TA,Tel: 01158758568,No ratings yet Rate it yourself - /Services/careproviders/LeaveReview/DefaultView.aspx?id=1-1755256775,0,0,,
Queenswood,1-18387636374,SCL,Cliffgrove Avenue,,,Nottingham,,NG9 4DP,Tel: 01156472530,No ratings yet Rate it yourself - /Services/careproviders/LeaveReview/DefaultView.aspx?id=1-18387636374,0,0,,
Beechdale House Care Home,1-117663787,SCL,Beechdale Road,Aspley,,Nottingham,Nottinghamshire,NG8 3EZ,Tel: 01159292792,No ratings yet Rate it yourself - /Services/careproviders/LeaveReview/DefaultView.aspx?id=1-117663787,0,0,,
Langley Homes,1-8583130735,SCL,Peel Street Villas 37a - 39,"Station Road, Langley Mill",,Nottingham,,NG16 4DQ,Tel: 01332470256,No ratings yet Rate it yourself - /Services/careproviders/LeaveReview/DefaultView.aspx?id=1-8583130735,0,0,,
Ashfields Care Home,1-1673105354,SCL,34 Mansfield Road,,,Heanor,Derbyshire,DE75 7AQ,Tel: 01773 712664,No ratings yet Rate it yourself - /Services/careproviders/LeaveReview/DefaultView.aspx?id=1-1673105354,0,0,,
Melbourne House,1-17883945666,SCL,Grannis Drive,Aspley,,Nottingham,Nottinghamshire,NG8 5RU,Tel: 01159292784,No ratings yet Rate it yourself - /Services/careproviders/LeaveReview/DefaultView.aspx?id=1-17883945666,0,0,,
Florence Shipley Residential and Community Care Centre,1-2492798155,SCL,Market Place,,,Heanor,Derbyshire,DE75 7AA,Tel: 01629531367,2 ratings Rate it yourself - /Services/careproviders/LeaveReview/DefaultView.aspx?id=1-2492798155,,,,
Alder House Care Home,1-1763259648,SCL,172a Nottingham Road,Nuthall,,Nottingham,Nottinghamshire,NG8 6AX,Tel: 01159758110,No ratings yet Rate it yourself - /Services/careproviders/LeaveReview/DefaultView.aspx?id=1-1763259648,0,0,,
Acer Court Care Home,1-319747838,SCL,172 Nottingham Road,,,Nuthall,Nottinghamshire,NG8 6AX,Tel: 01159777370,No ratings yet Rate it yourself - /Services/careproviders/LeaveReview/DefaultView.aspx?id=1-319747838,0,0,,
Thistle Lodge Robins Wood Road,1-12495211869,SCL,20 Robins Wood Road,,,Nottingham,,NG8 3LD,Tel: 01156487586,No ratings yet Rate it yourself - /Services/careproviders/LeaveReview/DefaultView.aspx?id=1-12495211869,0,0,,
Shipley Lodge,1-130502736,SCL,94 Derby Road,,,Heanor,Derbyshire,DE75 7QJ,Tel: 01773535212,No ratings yet Rate it yourself - /Services/careproviders/LeaveReview/DefaultView.aspx?id=1-130502736,0,0,,
Shirecare,1-17713452805,SCL,"Bradgate House, Derby Road",,,Heanor,,DE75 7QL,Tel: 01629583304,No ratings yet Rate it yourself - /Services/careproviders/LeaveReview/DefaultView.aspx?id=1-17713452805,0,0,,
Mencap South Notts Services,1-1326722605,SCL,96A Douglas Road,Long Eaton,,Nottingham,Nottinghamshire,NG10 4BD,Tel: 01159835731,No ratings yet Rate it yourself - /Services/careproviders/LeaveReview/DefaultView.aspx?id=1-1326722605,0,0,,
Mencap Derbyshire and Derby City Domiciliary Care Agency,1-119189036,SCL,96a Douglas Road,Long Eaton,,Nottingham,Nottinghamshire,NG10 4BD,Tel: 01159835731,1 rating Rate it yourself - /Services/careproviders/LeaveReview/DefaultView.aspx?id=1-119189036,,,,
Solid Healthcare Ltd,1-14878085585,SCL,"Office Q111, The Quadrant","Nuart Road, Beeston",,Nottingham,,NG9 2NH,,No ratings yet Rate it yourself - /Services/careproviders/LeaveReview/DefaultView.aspx?id=1-14878085585,0,0,,
Your Homecare Provider Ltd,1-18046458890,SCL,The Quadrant,"Nuart Road, Beeston",,Nottingham,,NG9 2NH,,No ratings yet Rate it yourself - /Services/careproviders/LeaveReview/DefaultView.aspx?id=1-18046458890,0,0,,
Fast Supporting Services Limited,1-18316880072,SCL,"The Quadrant, Office Q117","Nuart Road, Beeston",,Nottingham,,NG9 2NH,,No ratings yet Rate it yourself - /Services/careproviders/LeaveReview/DefaultView.aspx?id=1-18316880072,0,0,,
Petersham Community Team (DCC Homecare Service),1-121909383,SCL,The Petersham Centre,"58-60 Petersham Road, Long Eaton",,Nottingham,Nottinghamshire,NG10 4DD,,No ratings yet Rate it yourself - /Services/careproviders/LeaveReview/DefaultView.aspx?id=1-121909383,0,0,,
Petersham Centre Care Home,1-121909611,SCL,The Petersham Centre,"58-60 Petersham Road, Long Eaton",,Nottingham,Nottinghamshire,NG10 4DD,Tel: 01629531850,No ratings yet Rate it yourself - /Services/careproviders/LeaveReview/DefaultView.aspx?id=1-121909611,0,0,,
Bulwell,1-3986560133,SCL,Snape Wood Road,Bulwell,,Nottingham,Nottinghamshire,NG6 7GH,Tel: 02038317924,No ratings yet Rate it yourself - /Services/careproviders/LeaveReview/DefaultView.aspx?id=1-3986560133,0,0,,
DCK Care Ltd,1-4603189161,SCL,35 Wollaton Road,Beeston,,Nottingham,,NG9 2NG,Tel: 01159899122,3 ratings Rate it yourself - /Services/careproviders/LeaveReview/DefaultView.aspx?id=1-4603189161,,,,
Brooke Healthcare Ltd,1-15753571350,SCL,1 Crispin Way,,,Nottingham,,NG8 3QH,Tel: 07462723860,No ratings yet Rate it yourself - /Services/careproviders/LeaveReview/DefaultView.aspx?id=1-15753571350,0,0,,
Milberry Care Agency,1-5203432545,SCL,92 Hilcot Drive,,,Nottingham,Nottinghamshire,NG8 5HS,Tel: 01157833493,No ratings yet Rate it yourself - /Services/careproviders/LeaveReview/DefaultView.aspx?id=1-5203432545,0,0,,
ATT Group Limited,1-13946238932,SCL,78 Harwill Crescent,,,Nottingham,,NG8 5LB,,No ratings yet Rate it yourself - /Services/careproviders/LeaveReview/DefaultView.aspx?id=1-13946238932,0,0,,
1 Devonshire Avenue,1-119791925,SCL,1 Devonshire Avenue,Beeston,,Nottingham,Nottinghamshire,NG9 1BS,Tel: 01159255422,No ratings yet Rate it yourself - /Services/careproviders/LeaveReview/DefaultView.aspx?id=1-119791925,0,0,,
Cross House,1-10572200202,SCL,2 Cross Street,Beeston,,Nottingham,,NG9 2NX,Tel: 07917916552,No ratings yet Rate it yourself - /Services/careproviders/LeaveReview/DefaultView.aspx?id=1-10572200202,0,0,,
4 Smedley Close,1-15981239665,SCL,4 Smedley Close,,,Nottingham,Nottinghamshire,NG8 5BZ,,No ratings yet Rate it yourself - /Services/careproviders/LeaveReview/DefaultView.aspx?id=1-15981239665,0,0,,
Silverwood (Nottingham),1-320588720,SCL,Imperial Road,Beeston,,Nottingham,Nottinghamshire,NG9 1FN,Tel: 01159253699,No ratings yet Rate it yourself - /Services/careproviders/LeaveReview/DefaultView.aspx?id=1-320588720,0,0,,
Landermeads Care Home,1-137775082,SCL,265 High Road,"Chilwell, Beeston",,Nottingham,Nottinghamshire,NG9 5DD,Tel: 01159683888,1 rating Rate it yourself - /Services/careproviders/LeaveReview/DefaultView.aspx?id=1-137775082,,,,
Catherine Tam Agency,1-262534813,SCL,265 High Road,"Chilwell, Beeston",,Nottingham,Nottinghamshire,NG9 5DD,Tel: 01159683888,No ratings yet Rate it yourself - /Services/careproviders/LeaveReview/DefaultView.aspx?id=1-262534813,0,0,,
Helping Hands West Bridgford,1-14766733840,SCL,"Office 2, 18-20","Wollaton Road, Beeston",,Nottingham,,NG9 2NR,,No ratings yet Rate it yourself - /Services/careproviders/LeaveReview/DefaultView.aspx?id=1-14766733840,0,0,,