Organisation Name,NACS Code,Organisation Type,Address1,Address2,Address3,Address4,Address5,PostCode,Telephone Number,NHS.UK users rating,Value  (NHS.UK users rating),Banding Classification  (NHS.UK users rating),Car parking (Is there car parking at this organisation?),Disabled access (Disabled access)
Risby Park Nursing Home,1-121065992,SCL,Hall Lane,Risby,,Bury St Edmunds,Suffolk,IP28 6RS,,No ratings yet Rate it yourself - /Services/careproviders/LeaveReview/DefaultView.aspx?id=1-121065992,0,0,,
Risby Hall Nursing Home,1-121065975,SCL,Hall Lane,Risby,,Bury St Edmunds,Suffolk,IP28 6RS,,No ratings yet Rate it yourself - /Services/careproviders/LeaveReview/DefaultView.aspx?id=1-121065975,0,0,,
Cedar Lodge,1-4922344749,SCL,Culford,,,Bury St. Edmunds,,IP28 6DX,Tel: 01284728744,No ratings yet Rate it yourself - /Services/careproviders/LeaveReview/DefaultView.aspx?id=1-4922344749,0,0,,
Marham House Care Home,1-13694078242,SCL,Simcoe Road,,,Bury St. Edmunds,,IP32 6FD,Tel: 01284335964,No ratings yet Rate it yourself - /Services/careproviders/LeaveReview/DefaultView.aspx?id=1-13694078242,0,0,,
Lifetree Homecare Ltd,1-11939209142,SCL,"Unit 9, Woodside Business Park","Thetford Road, Ingham",,Bury St. Edmunds,,IP31 1NR,Tel: 01284330379,No ratings yet Rate it yourself - /Services/careproviders/LeaveReview/DefaultView.aspx?id=1-11939209142,0,0,,
The Pines,1-306059636,SCL,Culford Road,,,Fornham St Mary,Suffolk,IP28 6TN,Tel: 01284705062,No ratings yet Rate it yourself - /Services/careproviders/LeaveReview/DefaultView.aspx?id=1-306059636,0,0,,
Fornham House Residential Home,1-121919754,SCL,Fornham St Martin,,,Bury St Edmunds,Suffolk,IP31 1SR,Tel: 01284768327,1 rating Rate it yourself - /Services/careproviders/LeaveReview/DefaultView.aspx?id=1-121919754,,,,
Bury Home Care,1-145680661,SCL,West Suffolk House,Western Way,,Bury St Edmunds,Suffolk,IP33 3YU,Tel: 01284758561,No ratings yet Rate it yourself - /Services/careproviders/LeaveReview/DefaultView.aspx?id=1-145680661,0,0,,
St Edmunds Care,1-6193818659,SCL,"Risbygate Suite, Ask House",2 Northgate Avenue,,Bury St. Edmunds,,IP32 6BB,Tel: 01284336222,No ratings yet Rate it yourself - /Services/careproviders/LeaveReview/DefaultView.aspx?id=1-6193818659,0,0,,
Hartewell Homecare,1-18028335658,SCL,11 Manners Road,Fornham St. Martin,,Bury St. Edmunds,,IP31 1TE,Tel: 01284636681,No ratings yet Rate it yourself - /Services/careproviders/LeaveReview/DefaultView.aspx?id=1-18028335658,0,0,,
St Peter's House,1-9976760806,SCL,29 Out Risbygate,,,Bury St. Edmunds,,IP33 3RJ,Tel: 01284706603,No ratings yet Rate it yourself - /Services/careproviders/LeaveReview/DefaultView.aspx?id=1-9976760806,0,0,,
Glastonbury Court,1-2397838058,SCL,Glastonbury Road,,,Bury St Edmunds,Suffolk,IP33 2EX,Tel: 03333211989,No ratings yet Rate it yourself - /Services/careproviders/LeaveReview/DefaultView.aspx?id=1-2397838058,0,0,,
North Court Care Home,1-18296156434,SCL,108 Northgate Street,,,Bury St. Edmunds,,IP33 1HS,Tel: 01284763621,No ratings yet Rate it yourself - /Services/careproviders/LeaveReview/DefaultView.aspx?id=1-18296156434,0,0,,
Helping Hands Bury St Edmunds,1-9005783097,SCL,4 Kings Mews,Kings Road,,Bury St. Edmunds,,IP33 3DE,Tel: 01284334049,1 rating Rate it yourself - /Services/careproviders/LeaveReview/DefaultView.aspx?id=1-9005783097,,,,
Royal Mencap Society - Drummond Court,1-310333551,SCL,Mill Road South,,,Bury St Edmunds,Suffolk,IP33 3NN,Tel: 01284767445,No ratings yet Rate it yourself - /Services/careproviders/LeaveReview/DefaultView.aspx?id=1-310333551,0,0,,
Manson House,1-13319120539,SCL,Northgate Street,,,Bury St. Edmunds,,IP33 1HP,Tel: 01284753106,No ratings yet Rate it yourself - /Services/careproviders/LeaveReview/DefaultView.aspx?id=1-13319120539,0,0,,
NAS Community Services (East Anglia),1-2669733472,SCL,Willow House,40 St Andrews Street,,Mildenhall,Suffolk,IP28 7HB,Tel: 01638717661,No ratings yet Rate it yourself - /Services/careproviders/LeaveReview/DefaultView.aspx?id=1-2669733472,0,0,,
Mabbs Hall Care Home,1-119138865,SCL,45 High Street,,,Mildenhall,Suffolk,IP28 7EA,Tel: 01638712222,3 ratings Rate it yourself - /Services/careproviders/LeaveReview/DefaultView.aspx?id=1-119138865,,,,
Fonjock's Social Work Practice Limited,1-2110782795,SCL,Orchard House,1 Old Convent Orchard,,Bury St Edmunds,Suffolk,IP33 3PQ,Tel: 01284764411,No ratings yet Rate it yourself - /Services/careproviders/LeaveReview/DefaultView.aspx?id=1-2110782795,0,0,,
Cornwallis Court,1-2508473270,SCL,Hospital Road,,,Bury St Edmunds,Suffolk,IP33 3NH,Tel: 01284768028,No ratings yet Rate it yourself - /Services/careproviders/LeaveReview/DefaultView.aspx?id=1-2508473270,0,0,,
Availl (Bury St Edmunds),1-6782894325,SCL,85A Guildhall Street,,,Bury St. Edmunds,,IP33 1PR,Tel: 01284630575,1 rating Rate it yourself - /Services/careproviders/LeaveReview/DefaultView.aspx?id=1-6782894325,,,,
PnS Domiciliary Services,1-5446781338,SCL,9 Guildhall Street,,,Bury St. Edmunds,,IP33 1PR,Tel: 01284724223,No ratings yet Rate it yourself - /Services/careproviders/LeaveReview/DefaultView.aspx?id=1-5446781338,0,0,,
Assured Optimal Care - Main Office,1-17428509005,SCL,"Office B, 2nd Floor",9 Guildhall Street,,Bury St. Edmunds,,IP33 1PR,Tel: 07507986286,No ratings yet Rate it yourself - /Services/careproviders/LeaveReview/DefaultView.aspx?id=1-17428509005,0,0,,
Mildenhall Lodge,1-1465022022,SCL,St Johns Close,,,Mildenhall,Suffolk,IP28 7NX,Tel: 01638582510,No ratings yet Rate it yourself - /Services/careproviders/LeaveReview/DefaultView.aspx?id=1-1465022022,0,0,,
Warren Homecare Ltd,1-12446560904,SCL,26 Marigold Drive,Red Lodge,,Bury St. Edmunds,,IP28 8TL,,No ratings yet Rate it yourself - /Services/careproviders/LeaveReview/DefaultView.aspx?id=1-12446560904,0,0,,
Home Instead Bury St Edmunds,1-12958090508,SCL,Unit 3,"Old Wool Warehouse, St. Andrews Street South",,Bury St. Edmunds,,IP33 3PH,Tel: 01284658100,No ratings yet Rate it yourself - /Services/careproviders/LeaveReview/DefaultView.aspx?id=1-12958090508,0,0,,
Multi-Care Community Services Suffolk Ltd,1-18536358161,SCL,8b Old Bakery,St. Andrews Street South,,Bury St. Edmunds,,IP33 3PH,Tel: 01284247042,No ratings yet Rate it yourself - /Services/careproviders/LeaveReview/DefaultView.aspx?id=1-18536358161,0,0,,
SylvianCare Bury St Edmunds,1-15659339552,SCL,"Active Business Centre, St. Andrews Castle",33 St. Andrews Street South,,Bury St. Edmunds,,IP33 3PH,Tel: 01284365588,No ratings yet Rate it yourself - /Services/careproviders/LeaveReview/DefaultView.aspx?id=1-15659339552,0,0,,
Yourlife (Bury),1-2679793374,SCL,Cross Penny Court,Cotton Lane,,Bury St Edmunds,Suffolk,IP33 1XY,Tel: 01284760489,No ratings yet Rate it yourself - /Services/careproviders/LeaveReview/DefaultView.aspx?id=1-2679793374,0,0,,
FitzRoy Supported Living Suffolk,1-2679829948,SCL,"Unit 18, The Vision Centre",Eastern Way,,Bury St. Edmunds,,IP32 7AB,Tel: 07896891174,No ratings yet Rate it yourself - /Services/careproviders/LeaveReview/DefaultView.aspx?id=1-2679829948,0,0,,
SuffolkHomeCare,1-151257173,SCL,11 Brunel Business Court,Eastern Way,,Bury St Edmunds,Suffolk,IP32 7AB,Tel: 01284702002,No ratings yet Rate it yourself - /Services/careproviders/LeaveReview/DefaultView.aspx?id=1-151257173,0,0,,
Crossways,1-134620976,SCL,North Terrace,,,Mildenhall,Suffolk,IP28 7AE,Tel: 01638515556,No ratings yet Rate it yourself - /Services/careproviders/LeaveReview/DefaultView.aspx?id=1-134620976,0,0,,
Cathedral View,1-385482818,SCL,The Vinefields,,,Bury St Edmunds,Suffolk,IP33 1YU,Tel: 01284765046,No ratings yet Rate it yourself - /Services/careproviders/LeaveReview/DefaultView.aspx?id=1-385482818,0,0,,
Radis Community Care (Cullum Road),1-5764989165,SCL,11 Cullum Road,,,Bury St. Edmunds,,IP33 3PB,Tel: 01284750990,No ratings yet Rate it yourself - /Services/careproviders/LeaveReview/DefaultView.aspx?id=1-5764989165,0,0,,
The Grange Residential Home,1-106351203,SCL,The Grange,30 Vinery Road,,Bury St Edmunds,Suffolk,IP33 2JT,Tel: 01284769887,No ratings yet Rate it yourself - /Services/careproviders/LeaveReview/DefaultView.aspx?id=1-106351203,0,0,,
Support to Live at Home West,1-385503428,SCL,Bury Resource Centre,Hollow Road,,Bury St Edmunds,Suffolk,IP32 7AY,Tel: 01284718741,No ratings yet Rate it yourself - /Services/careproviders/LeaveReview/DefaultView.aspx?id=1-385503428,0,0,,
The Martins,1-117977429,SCL,Vinefields,,,Bury St Edmunds,Suffolk,IP33 1YA,Tel: 01284753467,No ratings yet Rate it yourself - /Services/careproviders/LeaveReview/DefaultView.aspx?id=1-117977429,0,0,,
Davers Court,1-1586577058,SCL,Shaker's Lane,,,Bury St Edmunds,Suffolk,IP32 7BN,Tel: 03333211982,No ratings yet Rate it yourself - /Services/careproviders/LeaveReview/DefaultView.aspx?id=1-1586577058,0,0,,
Harmony Homecare Suffolk,1-9856693805,SCL,"Office 4c, Rosemary House","Lanwades Business Park, Kennett",,Newmarket,,CB8 7PN,Tel: 01284663006,No ratings yet Rate it yourself - /Services/careproviders/LeaveReview/DefaultView.aspx?id=1-9856693805,0,0,,
Visionshealthcare Ltd,1-4616674851,SCL,4E Rosemary House,"Lanwades Business Park, Kennett",,Newmarket,,CB8 7PN,Tel: 01223426011,No ratings yet Rate it yourself - /Services/careproviders/LeaveReview/DefaultView.aspx?id=1-4616674851,0,0,,
Calm 365 Healthcare Ltd,1-15061985374,SCL,80 Folly Road,Mildenhall,,Bury St. Edmunds,,IP28 7BX,,No ratings yet Rate it yourself - /Services/careproviders/LeaveReview/DefaultView.aspx?id=1-15061985374,0,0,,
Kentford Manor,1-5315177207,SCL,Jeddah Way,Kennett,,Newmarket,Suffolk,CB8 8JY,Tel: 01638555090,No ratings yet Rate it yourself - /Services/careproviders/LeaveReview/DefaultView.aspx?id=1-5315177207,0,0,,
Kentford Manor,1-11457259392,SCL,Jeddah Way,Kennett,,Newmarket,Suffolk,CB8 8JY,Tel: 01638555090,No ratings yet Rate it yourself - /Services/careproviders/LeaveReview/DefaultView.aspx?id=1-11457259392,0,0,,
"Bluebird Care, Newmarket and Fenland",1-1041108285,SCL,Technologies House,26 Hampstead Avenue,,Mildenhall,Suffolk,IP28 7AS,Tel: 01638718855,12 ratings Rate it yourself - /Services/careproviders/LeaveReview/DefaultView.aspx?id=1-1041108285,,,,
Arukah Health Ltd,1-18785682091,SCL,"Unit 82a, James Carter Road",Mildenhall,,Bury St. Edmunds,,IP28 7DE,Tel: 07956004078,No ratings yet Rate it yourself - /Services/careproviders/LeaveReview/DefaultView.aspx?id=1-18785682091,0,0,,
Lots of Care Ltd,1-14484721645,SCL,15 Sebert Road,,,Bury St. Edmunds,,IP32 7EB,,No ratings yet Rate it yourself - /Services/careproviders/LeaveReview/DefaultView.aspx?id=1-14484721645,0,0,,
Hilltop House (Domiciliary Care),1-1492095485,SCL,2 Heldhaw Road,,,Bury St Edmunds,Suffolk,IP32 7ER,Tel: 01284724979,No ratings yet Rate it yourself - /Services/careproviders/LeaveReview/DefaultView.aspx?id=1-1492095485,0,0,,
Oxlip House,1-261437952,SCL,Airfield Road,,,Bury St Edmunds,Suffolk,IP32 7RH,Tel: 01284764864,No ratings yet Rate it yourself - /Services/careproviders/LeaveReview/DefaultView.aspx?id=1-261437952,0,0,,
Mencap - West Suffolk Domiciliary Care Agency,1-3617655390,SCL,West Suffolk Disability Resource Centre,4 Bunting Road,,Bury St Edmunds,Suffolk,IP32 7BX,Tel: 01284748874,No ratings yet Rate it yourself - /Services/careproviders/LeaveReview/DefaultView.aspx?id=1-3617655390,0,0,,
Montana Care Home Grace and Compassion Benedictines,1-118089078,SCL,East Barton Road,Great Barton,,Bury St Edmunds,Suffolk,IP31 2RF,Tel: 01284 787321,1 rating Rate it yourself - /Services/careproviders/LeaveReview/DefaultView.aspx?id=1-118089078,,,,
Berkeley Home Health - East of England,1-4349166701,SCL,"The Lilly Suite, Nowton Court Village",Nowton Road,,Bury St. Edmunds,,IP29 5LU,Tel: 01284756516,No ratings yet Rate it yourself - /Services/careproviders/LeaveReview/DefaultView.aspx?id=1-4349166701,0,0,,
Wings,1-2002296151,SCL,17 The Grove,Beck Row,,Mildenhall,Suffolk,IP28 8DP,Tel: 01638583934,No ratings yet Rate it yourself - /Services/careproviders/LeaveReview/DefaultView.aspx?id=1-2002296151,0,0,,
Laburnum Grove Housing with Care Scheme,1-285231364,SCL,Managers Office,Laburnum Grove,,Thetford,,IP24 3HS,Tel: 01842753185,No ratings yet Rate it yourself - /Services/careproviders/LeaveReview/DefaultView.aspx?id=1-285231364,0,0,,
Royal Mencap Society - Woodlands Residential Home,1-310333652,SCL,51a Elm Road,,,Thetford,,IP24 3HL,Tel: 01842762086,No ratings yet Rate it yourself - /Services/careproviders/LeaveReview/DefaultView.aspx?id=1-310333652,0,0,,
PentaCare (Bury St Edmunds),1-15183517217,SCL,"Unit GF2, Eagle House",Great Whelnetham,,Bury St. Edmunds,,IP30 0UN,Tel: 01284336136,No ratings yet Rate it yourself - /Services/careproviders/LeaveReview/DefaultView.aspx?id=1-15183517217,0,0,,
Blackbourne View,1-220311536,SCL,Thetford Road,Ixworth,,Bury St Edmunds,Suffolk,IP31 2HD,,No ratings yet Rate it yourself - /Services/careproviders/LeaveReview/DefaultView.aspx?id=1-220311536,0,0,,
The Beeches Residential Home,1-125108366,SCL,39-43 High Street,Ixworth,,Bury St Edmunds,Suffolk,IP31 2HJ,Tel: 01359230773,No ratings yet Rate it yourself - /Services/careproviders/LeaveReview/DefaultView.aspx?id=1-125108366,0,0,,
Brandon Park Residential and Nursing Home,1-4335876213,SCL,Brandon Country Park,,,Brandon,Suffolk,IP27 0SU,Tel: 01842812400,1 rating Rate it yourself - /Services/careproviders/LeaveReview/DefaultView.aspx?id=1-4335876213,,,,
Fara Healthcare Ltd,1-15152271663,SCL,"39 Bohemia Place, Bassingbourn Fields",Fordham,,Ely,,CB7 5XJ,Tel: 07481819648,No ratings yet Rate it yourself - /Services/careproviders/LeaveReview/DefaultView.aspx?id=1-15152271663,0,0,,
Ford Place Nursing Home,1-4335875944,SCL,Ford Street,,,Thetford,Norfolk,IP24 2EP,Tel: 01842755002,No ratings yet Rate it yourself - /Services/careproviders/LeaveReview/DefaultView.aspx?id=1-4335875944,0,0,,
Alexander Court,1-307272706,SCL,Raymond Street,,,Thetford,Norfolk,IP24 2EA,Tel: 01842753466,No ratings yet Rate it yourself - /Services/careproviders/LeaveReview/DefaultView.aspx?id=1-307272706,0,0,,
Care Consult ID,1-14143552383,SCL,15 Meadow Lane,,,Newmarket,,CB8 8FZ,,No ratings yet Rate it yourself - /Services/careproviders/LeaveReview/DefaultView.aspx?id=1-14143552383,0,0,,
Royal Mencap Society - Norfolk Domiciliary Care Agency,1-9671656845,SCL,53 Castle Street,,,Thetford,Norfolk,IP24 2DL,Tel: 01842766444,No ratings yet Rate it yourself - /Services/careproviders/LeaveReview/DefaultView.aspx?id=1-9671656845,0,0,,
Royal Mencap Society - North Suffolk and Coastal Domiciliary Care Agency,1-9671657163,SCL,53A Castle Street,,,Thetford,,IP24 2DL,Tel: 01842766444,No ratings yet Rate it yourself - /Services/careproviders/LeaveReview/DefaultView.aspx?id=1-9671657163,0,0,,
Royal Mencap Society - 6 Lamberts (Foxglove),1-9965724805,SCL,6 Lamberts,,,Thetford,,IP24 2EE,Tel: 01842766156,No ratings yet Rate it yourself - /Services/careproviders/LeaveReview/DefaultView.aspx?id=1-9965724805,0,0,,
Royal Mencap Society - 22 Lamberts (Daisy),1-9965724874,SCL,22 Lamberts,,,Thetford,,IP24 2EE,Tel: 01842755885,No ratings yet Rate it yourself - /Services/careproviders/LeaveReview/DefaultView.aspx?id=1-9965724874,0,0,,
Redgate House Residential Home,1-3863281367,SCL,Green Lane,,,Thetford,Norfolk,IP24 2EZ,Tel: 01842800400,No ratings yet Rate it yourself - /Services/careproviders/LeaveReview/DefaultView.aspx?id=1-3863281367,0,0,,
Brampton Manor,1-10936037140,SCL,Brampton Manor,Fordham Road,,Newmarket,,CB8 7AQ,,No ratings yet Rate it yourself - /Services/careproviders/LeaveReview/DefaultView.aspx?id=1-10936037140,0,0,,
Premier Homecare,1-125571979,SCL,Keystone Innovation Centre,Croxton Road,,Thetford,Norfolk,IP24 1JD,Tel: 01842824415,No ratings yet Rate it yourself - /Services/careproviders/LeaveReview/DefaultView.aspx?id=1-125571979,0,0,,
Utopia Care Limited,1-14422006973,SCL,Keystone Innovation Centre,Croxton Road,,Thetford,Norfolk,IP24 1JD,Tel: 01603319430,No ratings yet Rate it yourself - /Services/careproviders/LeaveReview/DefaultView.aspx?id=1-14422006973,0,0,,
6A Clock Tower Mews,1-2158395145,SCL,6A Clock Tower Mews,Exeter Road,,Newmarket,Suffolk,CB8 8LL,Tel: 01638676547,No ratings yet Rate it yourself - /Services/careproviders/LeaveReview/DefaultView.aspx?id=1-2158395145,0,0,,
Radis Community Care (Heathcote House),1-5764989535,SCL,Warren Close,,,Brandon,,IP27 0EE,Tel: 01842815889,No ratings yet Rate it yourself - /Services/careproviders/LeaveReview/DefaultView.aspx?id=1-5764989535,0,0,,
"Office 3, The Stable",1-14723565600,SCL,65 High Street,,,Newmarket,,CB8 8NA,Tel: 07411255594,No ratings yet Rate it yourself - /Services/careproviders/LeaveReview/DefaultView.aspx?id=1-14723565600,0,0,,
Radis Community Care (Childwick House),1-5764989478,SCL,Childwick House,Howard De Walden Way,,Newmarket,,CB8 0QZ,Tel: 01638660967,No ratings yet Rate it yourself - /Services/careproviders/LeaveReview/DefaultView.aspx?id=1-5764989478,0,0,,
Voyage (DCA) Cambridge City,1-2964480039,SCL,2 Fordham House Court,"Newmarket Road, Fordham",,Ely,,CB7 5LL,Tel: 01638721723,No ratings yet Rate it yourself - /Services/careproviders/LeaveReview/DefaultView.aspx?id=1-2964480039,0,0,,
Cambridge Care Company,1-6467897211,SCL,4 Kings Court,Willie Snaith Road,,Newmarket,,CB8 7SG,Tel: 01638561100,No ratings yet Rate it yourself - /Services/careproviders/LeaveReview/DefaultView.aspx?id=1-6467897211,0,0,,
Care Circle Ltd,1-18391343512,SCL,4 Kings Court,Willie Snaith Road,,Newmarket,,CB8 7SG,Tel: 03330062393,No ratings yet Rate it yourself - /Services/careproviders/LeaveReview/DefaultView.aspx?id=1-18391343512,0,0,,
Willowcare (Suffolk) Ltd,1-5257293732,SCL,41 Thetford Road,,,Brandon,,IP27 0BZ,Tel: 01842819591,No ratings yet Rate it yourself - /Services/careproviders/LeaveReview/DefaultView.aspx?id=1-5257293732,0,0,,
Time2Care (BSE) Ltd,1-1537123881,SCL,The Old Depot,Depot Road,,Newmarket,Suffolk,CB8 0AL,Tel: 03331212126,No ratings yet Rate it yourself - /Services/careproviders/LeaveReview/DefaultView.aspx?id=1-1537123881,0,0,,
The Willows,1-107340693,SCL,Corders Farm,"Bury Road, Lawshall",,Bury St Edmunds,Suffolk,IP29 4PJ,Tel: 01284830665,No ratings yet Rate it yourself - /Services/careproviders/LeaveReview/DefaultView.aspx?id=1-107340693,0,0,,
Kingfisher House Care Home,1-125339909,SCL,St Fabians Close,,,Newmarket,Suffolk,CB8 0EJ,Tel: 01638669919,No ratings yet Rate it yourself - /Services/careproviders/LeaveReview/DefaultView.aspx?id=1-125339909,0,0,,
Lav Care Services- East of Anglia,1-18390711425,SCL,"Suite 17, Newmarket Business Centre",341 Exning Road,,Newmarket,,CB8 0AT,Tel: 01223398500,No ratings yet Rate it yourself - /Services/careproviders/LeaveReview/DefaultView.aspx?id=1-18390711425,0,0,,
Care at Home Providers - Main Office,1-14588423471,SCL,"341, Suite 18a, Newmarket Business Centre",Exning Road,,Newmarket,,CB8 0AT,Tel: 03333391191,No ratings yet Rate it yourself - /Services/careproviders/LeaveReview/DefaultView.aspx?id=1-14588423471,0,0,,
Inspire Social Care,1-8775590353,SCL,Newmarket Business Centre,341 Exning Road,,Newmarket,,CB8 0AT,Tel: 07780562943,No ratings yet Rate it yourself - /Services/careproviders/LeaveReview/DefaultView.aspx?id=1-8775590353,0,0,,
ROYALE HOMECARE,1-6794046146,SCL,22 Waterloo Close,,,Newmarket,,CB8 7RP,Tel: 07888937229,No ratings yet Rate it yourself - /Services/careproviders/LeaveReview/DefaultView.aspx?id=1-6794046146,0,0,,
Red House Residential Home,1-1964540001,SCL,Norwich Road,Kilverstone,,Thetford,Norfolk,IP24 2RF,Tel: 01842753122,No ratings yet Rate it yourself - /Services/careproviders/LeaveReview/DefaultView.aspx?id=1-1964540001,0,0,,
Stowlangtoft Hall Nursing Home,1-4335875876,SCL,Kiln Lane,Stowlangtoft,,Bury St Edmunds,Suffolk,IP31 3JY,Tel: 01359230216,No ratings yet Rate it yourself - /Services/careproviders/LeaveReview/DefaultView.aspx?id=1-4335875876,0,0,,
Ashmore Nursing Home,1-106383494,SCL,Barningham Road,Stanton,,Bury St Edmunds,Suffolk,IP31 2AD,Tel: 01359251681,No ratings yet Rate it yourself - /Services/careproviders/LeaveReview/DefaultView.aspx?id=1-106383494,0,0,,
Anglia Case Management Limited,1-114103976,SCL,Ticehurst Yard,Beyton Road Tostock,,Bury St Edmunds,Suffolk,IP30 9PH,Tel: 01359271900,No ratings yet Rate it yourself - /Services/careproviders/LeaveReview/DefaultView.aspx?id=1-114103976,0,0,,
Robinson House,1-132388417,SCL,24c Fordham Road,Soham,,Ely,Cambridgeshire,CB7 5AQ,Tel: 01353624330,No ratings yet Rate it yourself - /Services/careproviders/LeaveReview/DefaultView.aspx?id=1-132388417,0,0,,
Soham Lodge,1-439906916,SCL,Soham Bypass,Soham,,Ely,Cambridgeshire,CB7 5WZ,Tel: 01353720775,No ratings yet Rate it yourself - /Services/careproviders/LeaveReview/DefaultView.aspx?id=1-439906916,0,0,,
Radis Community Care (Millbrook House),1-1015358696,SCL,50 Lode Close,Soham,,Ely,Cambridgeshire,CB7 5HR,Tel: 07563554509,No ratings yet Rate it yourself - /Services/careproviders/LeaveReview/DefaultView.aspx?id=1-1015358696,0,0,,
MS Care Ltd,1-8761806204,SCL,2 Station Road,Soham,,Ely,,CB7 5DY,Tel: 07385607272,No ratings yet Rate it yourself - /Services/careproviders/LeaveReview/DefaultView.aspx?id=1-8761806204,0,0,,
Radis Community Care (Ness Court ECH),1-1015358959,SCL,Managers Office,"Baker Drive, Burwell",,Cambridge,Cambridgeshire,CB25 0AB,Tel: 01638745594,No ratings yet Rate it yourself - /Services/careproviders/LeaveReview/DefaultView.aspx?id=1-1015358959,0,0,,
Fair Haven Care Home,1-2079988863,SCL,102 Station Road,Soham,,Ely,Cambridgeshire,CB7 5DZ,Tel: 01353720916,No ratings yet Rate it yourself - /Services/careproviders/LeaveReview/DefaultView.aspx?id=1-2079988863,0,0,,
The Brambles,1-124141242,SCL,The Brambles 104 Station Road,Soham,,Ely,Cambridgeshire,CB7 5DZ,Tel: 01353722971,No ratings yet Rate it yourself - /Services/careproviders/LeaveReview/DefaultView.aspx?id=1-124141242,0,0,,
Universal Complex Care Ltd,1-18392667306,SCL,"Willow Lodge, Mill Lane",Burwell,,Cambridge,,CB25 0HJ,Tel: 07535990329,No ratings yet Rate it yourself - /Services/careproviders/LeaveReview/DefaultView.aspx?id=1-18392667306,0,0,,
Guyatt House,1-114180661,SCL,42 The Causeway,Burwell,,Cambridge,Cambridgeshire,CB25 0DU,Tel: 01638610109,No ratings yet Rate it yourself - /Services/careproviders/LeaveReview/DefaultView.aspx?id=1-114180661,0,0,,
Townsend Manor,1-14278771563,SCL,Townsend Manor,"Evershed Fields, Soham",,Ely,,CB7 6BE,Tel: 01353478180,No ratings yet Rate it yourself - /Services/careproviders/LeaveReview/DefaultView.aspx?id=1-14278771563,0,0,,
Kirsten's Care Ltd,1-7268875105,SCL,"Unit 1, Brickfields Business Park","Old Stowmarket Road, Woolpit",,Bury St. Edmunds,,IP30 9QS,Tel: 07769201895,No ratings yet Rate it yourself - /Services/careproviders/LeaveReview/DefaultView.aspx?id=1-7268875105,0,0,,
Fareni Lifecare Ltd,1-17843656818,SCL,25 High Street,Feltwell,,Thetford,,IP26 4AF,Tel: 07932491915,No ratings yet Rate it yourself - /Services/careproviders/LeaveReview/DefaultView.aspx?id=1-17843656818,0,0,,
Feltwell Lodge,1-9823802423,SCL,Lodge Road,Feltwell,,Thetford,Norfolk,IP26 4DR,Tel: 01366728282,No ratings yet Rate it yourself - /Services/careproviders/LeaveReview/DefaultView.aspx?id=1-9823802423,0,0,,
The Briars Residential Care Home,1-877271524,SCL,23 Hunts Hill,Glemsford,,Sudbury,Suffolk,CO10 7RP,Tel: 01787282249,No ratings yet Rate it yourself - /Services/careproviders/LeaveReview/DefaultView.aspx?id=1-877271524,0,0,,
St Leonards Court,1-121919983,SCL,6 St Leonards Street,,,Mundford,Norfolk,IP26 5HG,Tel: 01842878225,1 rating Rate it yourself - /Services/careproviders/LeaveReview/DefaultView.aspx?id=1-121919983,,,,
Devonshire House,1-3306736227,SCL,High Street,Cavendish,,Sudbury,Suffolk,CO10 8AS,Tel: 01787283240,No ratings yet Rate it yourself - /Services/careproviders/LeaveReview/DefaultView.aspx?id=1-3306736227,0,0,,
Housing 21 - Mere View,1-125498357,SCL,Thompson Close,Haughley,,Stowmarket,Suffolk,IP14 3GQ,Tel: 03701924081,No ratings yet Rate it yourself - /Services/careproviders/LeaveReview/DefaultView.aspx?id=1-125498357,0,0,,