Organisation Name,NACS Code,Organisation Type,Address1,Address2,Address3,Address4,Address5,PostCode,Telephone Number,NHS.UK users rating,Value  (NHS.UK users rating),Banding Classification  (NHS.UK users rating),Car parking (Is there car parking at this organisation?),Disabled access (Disabled access)
Best@Care Limited,1-9800047917,SCL,Unit B,"Innovation House, 292 Worton Road",,Isleworth,,TW7 6EL,Tel: 07837905145,No ratings yet Rate it yourself - /Services/careproviders/LeaveReview/DefaultView.aspx?id=1-9800047917,0,0,,
Ami Home Care Limited,1-4305856227,SCL,Office A&C Unit B,"Innovation House, 292 Worton Road",,Isleworth,,TW7 6EL,Tel: 02030263706,No ratings yet Rate it yourself - /Services/careproviders/LeaveReview/DefaultView.aspx?id=1-4305856227,0,0,,
Octavia Housing -Bridge Water House,1-3629802692,SCL,"Bridgewater House, Egerton Drive",,,Isleworth,Middlesex,TW7 7FA,Tel: 0208 962 3560,No ratings yet Rate it yourself - /Services/careproviders/LeaveReview/DefaultView.aspx?id=1-3629802692,0,0,,
Atfield House,1-125862242,SCL,St Johns Road,,,Isleworth,Middlesex,TW7 6UH,Tel: 02085603994,1 rating Rate it yourself - /Services/careproviders/LeaveReview/DefaultView.aspx?id=1-125862242,,,,
ABS Care Ltd,1-10289640215,SCL,54 Crane Avenue,,,Isleworth,,TW7 7JW,,No ratings yet Rate it yourself - /Services/careproviders/LeaveReview/DefaultView.aspx?id=1-10289640215,0,0,,
Charlotte House,1-139851635,SCL,Snowy Fielder Waye,,,Isleworth,Middlesex,TW7 6AE,Tel: 02035044292,1 rating Rate it yourself - /Services/careproviders/LeaveReview/DefaultView.aspx?id=1-139851635,,,,
CHARISMASHAPE CARE LTD,1-17427817561,SCL,71 Sussex Avenue,,,Isleworth,,TW7 6LD,Tel: 02085815420,No ratings yet Rate it yourself - /Services/careproviders/LeaveReview/DefaultView.aspx?id=1-17427817561,0,0,,
Cole Park Care Ltd,1-15685867558,SCL,224 London Road,,,Twickenham,,TW1 1EU,Tel: 07841866565,No ratings yet Rate it yourself - /Services/careproviders/LeaveReview/DefaultView.aspx?id=1-15685867558,0,0,,
The Regard Partnership Limited - 225 London Road,1-136883282,SCL,225 London Road,,,Twickenham,Middlesex,TW1 1ES,Tel: 02088926406,No ratings yet Rate it yourself - /Services/careproviders/LeaveReview/DefaultView.aspx?id=1-136883282,0,0,,
48 The Grove,1-349839347,SCL,48 The Grove,,,Isleworth,Middlesex,TW7 4JF,Tel: 02087589158,No ratings yet Rate it yourself - /Services/careproviders/LeaveReview/DefaultView.aspx?id=1-349839347,0,0,,
46 The Grove,1-336055911,SCL,46 The Grove,,,Isleworth,Middlesex,TW7 4JF,Tel: 02085685660,No ratings yet Rate it yourself - /Services/careproviders/LeaveReview/DefaultView.aspx?id=1-336055911,0,0,,
No 36,1-1077792941,SCL,36 The Grove,,,Isleworth,Middlesex,TW7 4JF,Tel: 02085608989,No ratings yet Rate it yourself - /Services/careproviders/LeaveReview/DefaultView.aspx?id=1-1077792941,0,0,,
Spring Grove Road,1-129460180,SCL,231-233 Spring Grove Road,,,Isleworth,Middlesex,TW7 4AF,Tel: 02087582966,No ratings yet Rate it yourself - /Services/careproviders/LeaveReview/DefaultView.aspx?id=1-129460180,0,0,,
Star Road Respite Service,1-126430365,SCL,49 Star Road,,,Isleworth,Middlesex,TW7 4HU,Tel: 02085685133,No ratings yet Rate it yourself - /Services/careproviders/LeaveReview/DefaultView.aspx?id=1-126430365,0,0,,
Dalemead Care Home Limited,1-330456604,SCL,10-12 Riverdale Gardens,,,East Twickenham,Middlesex,TW1 2DA,Tel: 020 8892 2161,No ratings yet Rate it yourself - /Services/careproviders/LeaveReview/DefaultView.aspx?id=1-330456604,0,0,,
Cura Care Limited,1-2469055225,SCL,46 Crown Road,,,Twickenham,,TW1 3EH,Tel: 02088929222,10 ratings Rate it yourself - /Services/careproviders/LeaveReview/DefaultView.aspx?id=1-2469055225,,,,
89 Heathfield North,1-256560769,SCL,89 Heathfield North,,,Twickenham,,TW2 7QN,Tel: 02087441330,No ratings yet Rate it yourself - /Services/careproviders/LeaveReview/DefaultView.aspx?id=1-256560769,0,0,,
The White House,1-256561152,SCL,91 Heathfield North,,,Twickenham,,TW2 7QN,Tel: 02087441330,No ratings yet Rate it yourself - /Services/careproviders/LeaveReview/DefaultView.aspx?id=1-256561152,0,0,,
LD Care - Moreton Avenue,1-408202066,SCL,4 Moreton Avenue,Isleworth,,Hounslow,,TW7 4NW,Tel: 02085825081,No ratings yet Rate it yourself - /Services/careproviders/LeaveReview/DefaultView.aspx?id=1-408202066,0,0,,
Helping Hands Richmond,1-4262990043,SCL,5 Duke Street,,,Richmond,Surrey,TW9 1HP,Tel: 02036174145,1 rating Rate it yourself - /Services/careproviders/LeaveReview/DefaultView.aspx?id=1-4262990043,,,,
Parkshot House,1-1074491086,SCL,5 Kew Road,,,Richmond,Surrey,TW9 2PR,Tel: 07972193924,No ratings yet Rate it yourself - /Services/careproviders/LeaveReview/DefaultView.aspx?id=1-1074491086,0,0,,
Vigilance Care Services,1-10736752844,SCL,Parkshot House,5 Kew Road,,Richmond,Surrey,TW9 2PR,Tel: 07400239456,No ratings yet Rate it yourself - /Services/careproviders/LeaveReview/DefaultView.aspx?id=1-10736752844,0,0,,
Nightingale House,1-12314594519,SCL,10 Strafford Road,,,Twickenham,Middlesex,TW1 3AE,Tel: 02088921854,No ratings yet Rate it yourself - /Services/careproviders/LeaveReview/DefaultView.aspx?id=1-12314594519,0,0,,
Head Office - Triage Care Services,1-17189748851,SCL,17 Kingsley Road,,,Hounslow,,TW3 1PA,,No ratings yet Rate it yourself - /Services/careproviders/LeaveReview/DefaultView.aspx?id=1-17189748851,0,0,,
Direct Independent Care Limited,1-1745256288,SCL,Regal House,70 London Road,,Twickenham,Middlesex,TW1 3QS,,No ratings yet Rate it yourself - /Services/careproviders/LeaveReview/DefaultView.aspx?id=1-1745256288,0,0,,
Paragon Home Healthcare Ltd,1-6275602800,SCL,Goodwin House,5 Union Court,,Richmond,,TW9 1AA,Tel: 02030062802,No ratings yet Rate it yourself - /Services/careproviders/LeaveReview/DefaultView.aspx?id=1-6275602800,0,0,,
Cambridge Park,1-2451809589,SCL,40B Cambridge Park,,,Twickenham,Middlesex,TW1 2JU,Tel: 02088928592,No ratings yet Rate it yourself - /Services/careproviders/LeaveReview/DefaultView.aspx?id=1-2451809589,0,0,,
Richmond Community Support,1-8025039785,SCL,Metropolitan Thames Valley Housing Premier House,52 London Road,,Twickenham,,TW1 3RP,Tel: 07736362691,No ratings yet Rate it yourself - /Services/careproviders/LeaveReview/DefaultView.aspx?id=1-8025039785,0,0,,
Caremark Hounslow,1-11050249643,SCL,"Suite No 139, Westlink House",981 Great West Road,,Brentford,,TW8 9DN,Tel: 02085448037,No ratings yet Rate it yourself - /Services/careproviders/LeaveReview/DefaultView.aspx?id=1-11050249643,0,0,,
Key Point Agency,1-5937959762,SCL,Westlink House,981 Great West Road,,Brentford,,TW8 9DN,Tel: 02037409164,No ratings yet Rate it yourself - /Services/careproviders/LeaveReview/DefaultView.aspx?id=1-5937959762,0,0,,
Penmar Supported Living,1-7508808027,SCL,"G18, Westlink House",981 Great West Road,,Brentford,,TW8 9DN,Tel: 07578771825,No ratings yet Rate it yourself - /Services/careproviders/LeaveReview/DefaultView.aspx?id=1-7508808027,0,0,,
Rest Assure Care Ltd,1-11010857155,SCL,Westlink House,981 Great West Road,,Brentford,,TW8 9DN,Tel: 02038839571,No ratings yet Rate it yourself - /Services/careproviders/LeaveReview/DefaultView.aspx?id=1-11010857155,0,0,,
Westminster Homecare Limited (West London),1-254324554,SCL,Westlink House (Suites 103 and 118),981 Great West Road,,Brentford,,TW8 9DN,Tel: 02089878822,1 rating Rate it yourself - /Services/careproviders/LeaveReview/DefaultView.aspx?id=1-254324554,,,,
Astoria Homecare Ltd,1-3023610377,SCL,"Suite 153, Westlink House",981 Great West Road,,Brentford,,TW8 9DN,Tel: 02036673333,No ratings yet Rate it yourself - /Services/careproviders/LeaveReview/DefaultView.aspx?id=1-3023610377,0,0,,
Karechoice Ltd,1-4513639622,SCL,Westlink House,981 Great West Road,,Brentford,,TW8 9DN,Tel: 02039119300,No ratings yet Rate it yourself - /Services/careproviders/LeaveReview/DefaultView.aspx?id=1-4513639622,0,0,,
Prime Care Supported Ltd,1-18444848545,SCL,"Westlink House, Unit 140 E",981 Great West Road,,Brentford,,TW8 9DN,Tel: 07539203806,No ratings yet Rate it yourself - /Services/careproviders/LeaveReview/DefaultView.aspx?id=1-18444848545,0,0,,
LD Care,1-223800073,SCL,9 Gresham Road,,,Hounslow,Middlesex,TW3 4BT,Tel: 02085720162,No ratings yet Rate it yourself - /Services/careproviders/LeaveReview/DefaultView.aspx?id=1-223800073,0,0,,
Nation Care Agency,1-150055480,SCL,"Unit 1, Spruce House",Durham Wharf Drive,,Brentford,,TW8 8HR,Tel: 02079983003,No ratings yet Rate it yourself - /Services/careproviders/LeaveReview/DefaultView.aspx?id=1-150055480,0,0,,
Lynde House,1-125856379,SCL,Meadowbank,"28,  Cambridge Park",,Twickenham,Middlesex,TW1 2JB,Tel: 02088924772,No ratings yet Rate it yourself - /Services/careproviders/LeaveReview/DefaultView.aspx?id=1-125856379,0,0,,
United Response - 131 Kneller Road,1-123018041,SCL,131 Kneller Road,,,Whitton,Middlesex,TW2 7DY,Tel: 02088934636,No ratings yet Rate it yourself - /Services/careproviders/LeaveReview/DefaultView.aspx?id=1-123018041,0,0,,
The Regard Partnership Limited - Kneller Road,1-136883268,SCL,191 Kneller Road,,,Whitton,Middlesex,TW2 7DY,Tel: 02088985431,No ratings yet Rate it yourself - /Services/careproviders/LeaveReview/DefaultView.aspx?id=1-136883268,0,0,,
Allfor Care Alpha Care Recruitment West and Home Care Service Limited,1-115898258,SCL,15 Maswell Park Road,,,Hounslow,Middlesex,TW3 2DL,Tel: 02088982867,No ratings yet Rate it yourself - /Services/careproviders/LeaveReview/DefaultView.aspx?id=1-115898258,0,0,,
Lion Road,1-5001889903,SCL,59 Lion Road,,,Twickenham,Middlesex,TW1 4JF,Tel: 02088916025,No ratings yet Rate it yourself - /Services/careproviders/LeaveReview/DefaultView.aspx?id=1-5001889903,0,0,,
Filipino Care Givers,1-6134799086,SCL,Network International Business Centre,"2nd Floor, 30 Heath Road",,Twickenham,,TW1 4DD,Tel: 07960756004,No ratings yet Rate it yourself - /Services/careproviders/LeaveReview/DefaultView.aspx?id=1-6134799086,0,0,,
Humble Healthcare Limited,1-1765755534,SCL,"Unit 9, Red Lion Court",Alexandra Road,,Hounslow,Middlesex,TW3 1JS,Tel: 02085706279,1 rating Rate it yourself - /Services/careproviders/LeaveReview/DefaultView.aspx?id=1-1765755534,,,,
Unit 5 Red Lion,1-4499553487,SCL,Unit 5,"Red Lion Court, Alexandra Road",,Hounslow,Middlesex,TW3 1JS,Tel: 0203 477 8090,No ratings yet Rate it yourself - /Services/careproviders/LeaveReview/DefaultView.aspx?id=1-4499553487,0,0,,
Excelcare Agency Ltd,1-12955907456,SCL,"2nd Floor, Unit 5","Red Lion Court, Alexandra Road",,Hounslow,,TW3 1JS,Tel: 07887883211,No ratings yet Rate it yourself - /Services/careproviders/LeaveReview/DefaultView.aspx?id=1-12955907456,0,0,,
Goldcrest Healthcare Service (London),1-3895383690,SCL,Unit 1,"Red Lion Court, Alexandra Road",,Hounslow,Middlesex,TW3 1JS,Tel: 02085714402,No ratings yet Rate it yourself - /Services/careproviders/LeaveReview/DefaultView.aspx?id=1-3895383690,0,0,,
Whitefarm Lodge,1-139859302,SCL,Vicarage Road,Whitton,,Twickenham,Middlesex,TW2 7BY,Tel: 02087555740,No ratings yet Rate it yourself - /Services/careproviders/LeaveReview/DefaultView.aspx?id=1-139859302,0,0,,
Care Outlook (Twickenham)),1-5892304692,SCL,122 Nelson Road,,,Twickenham,,TW2 7AY,Tel: 02088142875,No ratings yet Rate it yourself - /Services/careproviders/LeaveReview/DefaultView.aspx?id=1-5892304692,0,0,,
Bluebird Care (Richmond & Twickenham),1-112035336,SCL,Electroline House,"15 Lion Road, Twickenham",,London,,TW1 4JH,,1 rating Rate it yourself - /Services/careproviders/LeaveReview/DefaultView.aspx?id=1-112035336,,,,
Elysium Care Partnerships Limited - 13 Alexandra Gardens,1-2172191305,SCL,13 Alexandra Gardens,,,Hounslow,Middlesex,TW3 4HT,Tel: 02081547445,No ratings yet Rate it yourself - /Services/careproviders/LeaveReview/DefaultView.aspx?id=1-2172191305,0,0,,
TC Care - Premier House,1-140978488,SCL,Premier House,50-52 Cross Lances Road,,Hounslow,Middlesex,TW3 2AA,Tel: 02085700086,1 rating Rate it yourself - /Services/careproviders/LeaveReview/DefaultView.aspx?id=1-140978488,,,,
St Raphael's,1-141696376,SCL,6-8 The Butts,,,Brentford,Middlesex,TW8 8BQ,Tel: 02085603745,1 rating Rate it yourself - /Services/careproviders/LeaveReview/DefaultView.aspx?id=1-141696376,,,,
Maryville Care Home,1-160392045,SCL,12-14 The Butts,,,Brentford,Middlesex,TW8 8BQ,Tel: 02085607124,No ratings yet Rate it yourself - /Services/careproviders/LeaveReview/DefaultView.aspx?id=1-160392045,0,0,,
Vivid Community Care Ltd,1-12730975744,SCL,37 Half Acre,,,Brentford,,TW8 8BH,Tel: 02081245000,No ratings yet Rate it yourself - /Services/careproviders/LeaveReview/DefaultView.aspx?id=1-12730975744,0,0,,
Hounslow and Ealing,1-13227722854,SCL,279-287 High Street,Second Floor Suite 5,,Hounslow,,TW3 1EF,Tel: 02081542715,No ratings yet Rate it yourself - /Services/careproviders/LeaveReview/DefaultView.aspx?id=1-13227722854,0,0,,
Haven Care - Hounslow Branch,1-2440252064,SCL,G W 1 Great West House,Great West Road,,Brentford,Middlesex,TW8 9DF,Tel: 02087589841,No ratings yet Rate it yourself - /Services/careproviders/LeaveReview/DefaultView.aspx?id=1-2440252064,0,0,,
Staffing Connect,1-2726389544,SCL,Suite 9,"Neals Corner, 2 Bath Road",,Hounslow,Middlesex,TW3 3HJ,Tel: 02038416440,No ratings yet Rate it yourself - /Services/careproviders/LeaveReview/DefaultView.aspx?id=1-2726389544,0,0,,
EBM Professional Services Limited,1-18610933325,SCL,1000 Great West Road,,,Brentford,,TW8 9DW,Tel: 02084399086,No ratings yet Rate it yourself - /Services/careproviders/LeaveReview/DefaultView.aspx?id=1-18610933325,0,0,,
Ashbright Agency Ltd,1-9785169569,SCL,1000 Great West Road,,,Brentford,,TW8 9DW,Tel: 07828063547,No ratings yet Rate it yourself - /Services/careproviders/LeaveReview/DefaultView.aspx?id=1-9785169569,0,0,,
1st Healthcare Ltd,1-2871345800,SCL,1000 Great West Road,,,Brentford,,TW8 9DW,Tel: 02086595576,No ratings yet Rate it yourself - /Services/careproviders/LeaveReview/DefaultView.aspx?id=1-2871345800,0,0,,
Dimensions London North/West Domiciliary Care Office,1-18843044425,SCL,"2nd floor, Hounslow House",7 Bath Road,,Hounslow,,TW3 3EB,Tel: 03003039010,No ratings yet Rate it yourself - /Services/careproviders/LeaveReview/DefaultView.aspx?id=1-18843044425,0,0,,
The Windham Croft Centre,1-2067803872,SCL,20 Windham Road,,,Richmond,Surrey,TW9 2HP,Tel: 02088316470,No ratings yet Rate it yourself - /Services/careproviders/LeaveReview/DefaultView.aspx?id=1-2067803872,0,0,,
United Response - 29 Mayfair Avenue,1-5088905448,SCL,29 Mayfair Avenue,,,Twickenham,,TW2 7JG,Tel: 02088942053,No ratings yet Rate it yourself - /Services/careproviders/LeaveReview/DefaultView.aspx?id=1-5088905448,0,0,,
Fawaz Homecare,1-10332077498,SCL,Holdsworth House,65-73 Staines Road,,Hounslow,London,TW3 3HW,Tel: 07429205250,No ratings yet Rate it yourself - /Services/careproviders/LeaveReview/DefaultView.aspx?id=1-10332077498,0,0,,
Pharma Homecare LTD,1-11064537248,SCL,Holdsworth House 65-73,Staines Road,,Hounslow,,TW3 3HW,Tel: 02088472462,No ratings yet Rate it yourself - /Services/careproviders/LeaveReview/DefaultView.aspx?id=1-11064537248,0,0,,
Grasmere Avenue,1-4314965384,SCL,13 Grasmere Avenue,Whitton,,Hounslow,Middlesex,TW3 2JG,,No ratings yet Rate it yourself - /Services/careproviders/LeaveReview/DefaultView.aspx?id=1-4314965384,0,0,,
Chertsey Road,1-4474419140,SCL,401A Chertsey Road,,,Twickenham,Middlesex,TW2 6LS,Tel: 02088947081,No ratings yet Rate it yourself - /Services/careproviders/LeaveReview/DefaultView.aspx?id=1-4474419140,0,0,,
49 Bath Road,1-15525372399,SCL,49 Bath Road,,,Hounslow,,TW3 3BN,Tel: 07828486827,No ratings yet Rate it yourself - /Services/careproviders/LeaveReview/DefaultView.aspx?id=1-15525372399,0,0,,
Elysium Care Partnerships Limited - 1 Lichfield Lane,1-279496420,SCL,1 Lichfield Lane,,,Twickenham,,TW2 6LA,Tel: 02088672715,No ratings yet Rate it yourself - /Services/careproviders/LeaveReview/DefaultView.aspx?id=1-279496420,0,0,,
Cloisters Care Home,1-189826618,SCL,70 Bath Road,,,London,,TW3 3EQ,Tel: 020 8538 0410,No ratings yet Rate it yourself - /Services/careproviders/LeaveReview/DefaultView.aspx?id=1-189826618,0,0,,
Dimensions The Mulberries,1-353888265,SCL,The Mulberries,68 Bath Road,,Hounslow,Middlesex,TW3 3EQ,Tel: 02085701793,No ratings yet Rate it yourself - /Services/careproviders/LeaveReview/DefaultView.aspx?id=1-353888265,0,0,,
Brinsworth House,1-122497565,SCL,72 Staines Road,,,Twickenham,Middlesex,TW2 5AL,Tel: 02088988164,No ratings yet Rate it yourself - /Services/careproviders/LeaveReview/DefaultView.aspx?id=1-122497565,0,0,,
Greville House,1-139851834,SCL,Greville Road,,,Richmond,Surrey,TW10 6HR,Tel: 02083342890,No ratings yet Rate it yourself - /Services/careproviders/LeaveReview/DefaultView.aspx?id=1-139851834,0,0,,
London Borough of Hounslow Home Care,1-2200669237,SCL,Heart of Hounslow Centre for Health,"92 Bath Road, Room 3E, Third Floor",,Hounslow,Middlesex,TW3 3EL,Tel: 02037716210,No ratings yet Rate it yourself - /Services/careproviders/LeaveReview/DefaultView.aspx?id=1-2200669237,0,0,,
Citywide Care Agency Ltd,1-11199984694,SCL,"Suite 204, 2nd Floor, Holdsworth House",65-73 Staines Road,,Hounslow,,TW3 3JB,Tel: 02086160740,No ratings yet Rate it yourself - /Services/careproviders/LeaveReview/DefaultView.aspx?id=1-11199984694,0,0,,
Safety First Care Ltd,1-11356302778,SCL,Boundary House,Boston Road,,London,,W7 2QE,,No ratings yet Rate it yourself - /Services/careproviders/LeaveReview/DefaultView.aspx?id=1-11356302778,0,0,,
Together at Home Ltd T/A Visiting Angels,1-8573664383,SCL,Suite 205 Boundary House,Boston Road,,London,,W7 2QE,Tel: 02031438878,No ratings yet Rate it yourself - /Services/careproviders/LeaveReview/DefaultView.aspx?id=1-8573664383,0,0,,
Healthvision - Hounslow,1-5369227910,SCL,Q West,Great West Road,,Brentford,,TW8 0GP,,No ratings yet Rate it yourself - /Services/careproviders/LeaveReview/DefaultView.aspx?id=1-5369227910,0,0,,
"Right at Home (Ealing, Hounslow, Hammersmith and Fulham)",1-4134627298,SCL,"Suite 309, 3rd Floor, Qwest",1110 Great West Road,,Brentford,,TW8 0GP,Tel: 02084329788,No ratings yet Rate it yourself - /Services/careproviders/LeaveReview/DefaultView.aspx?id=1-4134627298,0,0,,
Housing 21 - Greenrod Place,1-125498386,SCL,Clayponds Lane,,,Brentford,Middlesex,TW8 0BN,Tel: 03701924983,No ratings yet Rate it yourself - /Services/careproviders/LeaveReview/DefaultView.aspx?id=1-125498386,0,0,,
Roy Kinnear House,1-15199356138,SCL,289 Waldegrave Road,,,Twickenham,Middlesex,TW1 4SU,Tel: 02072614100,No ratings yet Rate it yourself - /Services/careproviders/LeaveReview/DefaultView.aspx?id=1-15199356138,0,0,,
Grosvenor House,1-291161849,SCL,29 Grosvenor Road,,,London,,TW3 3ER,Tel: 020 8569 5147,No ratings yet Rate it yourself - /Services/careproviders/LeaveReview/DefaultView.aspx?id=1-291161849,0,0,,
Octavia Housing - Park Lodge House,1-2129291436,SCL,31 Sutton Lane,,,Hounslow,London,TW3 3BB,Tel: 02085775688,No ratings yet Rate it yourself - /Services/careproviders/LeaveReview/DefaultView.aspx?id=1-2129291436,0,0,,
Great West Lodge,1-3675415189,SCL,320 Great West Road,,,Hounslow,Middlesex,TW5 0BA,Tel: 02085819313,No ratings yet Rate it yourself - /Services/careproviders/LeaveReview/DefaultView.aspx?id=1-3675415189,0,0,,
Aniis Care,1-4306263322,SCL,"Office 205, Diamond House",179-181 Lower Richmond Road,,Richmond,Surrey,TW9 4LN,Tel: 020 8004 1474,1 rating Rate it yourself - /Services/careproviders/LeaveReview/DefaultView.aspx?id=1-4306263322,,,,
Caremark (Richmond upon Thames),1-3602688960,SCL,Diamond House,179-181 Lower Richmond Road,,Richmond,Surrey,TW9 4LN,Tel: 02085448037,3 ratings Rate it yourself - /Services/careproviders/LeaveReview/DefaultView.aspx?id=1-3602688960,,,,
Sandown Court (Care Outlook),1-18096411579,SCL,Sandown Court,176 Hampton Road,,Twickenham,,TW2 5NE,,No ratings yet Rate it yourself - /Services/careproviders/LeaveReview/DefaultView.aspx?id=1-18096411579,0,0,,
Cecil Court,1-122477548,SCL,4 Priory Road,Kew,,Richmond,Surrey,TW9 3DG,Tel: 02089405242,No ratings yet Rate it yourself - /Services/careproviders/LeaveReview/DefaultView.aspx?id=1-122477548,0,0,,
United Response - 8 -10 Woodlawn Crescent,1-5089633283,SCL,8-10 Woodlawn Crescent,,,Twickenham,,TW2 6BE,Tel: 02036681557,No ratings yet Rate it yourself - /Services/careproviders/LeaveReview/DefaultView.aspx?id=1-5089633283,0,0,,
United Response - 36 Harvey Road,1-5089633116,SCL,36 Harvey Road,Whitton,,Hounslow,Middlesex,TW4 5LU,Tel: 02036681557,No ratings yet Rate it yourself - /Services/careproviders/LeaveReview/DefaultView.aspx?id=1-5089633116,0,0,,
Ashgrove Care Home - London,1-319142817,SCL,"Fir Tree Road, off Martindale Road",Hounslow,,London,,TW4 7HH,Tel: 02085776226,No ratings yet Rate it yourself - /Services/careproviders/LeaveReview/DefaultView.aspx?id=1-319142817,0,0,,
Heston Care Services Ltd,1-2851013974,SCL,16 Walnut Tree Road,,,Hounslow,Middlesex,TW5 0LR,Tel: 02085817027,No ratings yet Rate it yourself - /Services/careproviders/LeaveReview/DefaultView.aspx?id=1-2851013974,0,0,,
The AICS Group,1-1745295741,SCL,15 Broads Foundry,Trumpers Way,,London,,W7 2QP,Tel: 02088327496,No ratings yet Rate it yourself - /Services/careproviders/LeaveReview/DefaultView.aspx?id=1-1745295741,0,0,,
United Response - 198 Powder Mill Lane,1-123018083,SCL,198 Powder Mill Lane,,,Whitton,Middlesex,TW2 6EJ,Tel: 02088987445,No ratings yet Rate it yourself - /Services/careproviders/LeaveReview/DefaultView.aspx?id=1-123018083,0,0,,
Martindale Road,1-10970925165,SCL,329 Martindale Road,,,Hounslow,Middlesex,TW4 7HG,Tel: 01992443189,No ratings yet Rate it yourself - /Services/careproviders/LeaveReview/DefaultView.aspx?id=1-10970925165,0,0,,
The Mayfair,1-7413157450,SCL,139 Vicarage Farm Road,,,Hounslow,Middlesex,TW5 0AA,,No ratings yet Rate it yourself - /Services/careproviders/LeaveReview/DefaultView.aspx?id=1-7413157450,0,0,,
Vicarage Farm Nursing Home,1-495374249,SCL,139 Vicarage Farm Road,,,Hounslow,Middlesex,TW5 0AA,Tel: 02085774000,No ratings yet Rate it yourself - /Services/careproviders/LeaveReview/DefaultView.aspx?id=1-495374249,0,0,,
Norwood Green,1-17711494148,SCL,Tentelow Lane,Southall,,Middlesex,,UB2 4JA,Tel: 01895257010,No ratings yet Rate it yourself - /Services/careproviders/LeaveReview/DefaultView.aspx?id=1-17711494148,0,0,,
The Peaches Healthcare Limited,1-4897944586,SCL,339 Vicarage Farm Road,,,Hounslow,,TW5 0DZ,Tel: 02079987950,No ratings yet Rate it yourself - /Services/careproviders/LeaveReview/DefaultView.aspx?id=1-4897944586,0,0,,
Hanwell House,1-119658982,SCL,191 Boston Road,Hanwell,,London,,W7 2HW,Tel: 02085794798,No ratings yet Rate it yourself - /Services/careproviders/LeaveReview/DefaultView.aspx?id=1-119658982,0,0,,
United Response - 16 Curtis Road,1-123018055,SCL,16 Curtis Road,,,Whitton,Middlesex,TW4 5PT,Tel: 02088986026,No ratings yet Rate it yourself - /Services/careproviders/LeaveReview/DefaultView.aspx?id=1-123018055,0,0,,
Richmond Upon Thames Crossroads Caring for Carers,1-124419826,SCL,1 Beverley Court,26 Elmtree Road,,Teddington,Middlesex,TW11 8ST,Tel: 02089439421,No ratings yet Rate it yourself - /Services/careproviders/LeaveReview/DefaultView.aspx?id=1-124419826,0,0,,
Walsingham Support - St John's,1-7161991144,SCL,1 Ferry Road,,,Teddington,Middlesex,TW11 9NN,Tel: 02089777574,No ratings yet Rate it yourself - /Services/careproviders/LeaveReview/DefaultView.aspx?id=1-7161991144,0,0,,
Princes Road Residential Care Home,1-2450169226,SCL,46 Princes Road,,,Teddington,Middlesex,TW11 0RU,Tel: 07895329902,No ratings yet Rate it yourself - /Services/careproviders/LeaveReview/DefaultView.aspx?id=1-2450169226,0,0,,
Absolute Care Services (Richmond & Wandsworth),1-12213416978,SCL,4 Latimer Road,,,Teddington,Middlesex,TW11 8QA,Tel: 02038155453,No ratings yet Rate it yourself - /Services/careproviders/LeaveReview/DefaultView.aspx?id=1-12213416978,0,0,,
Amber Home Carers,1-4492275240,SCL,51A Sheen Lane,,,London,,SW14 8AB,Tel: 02085638209,1 rating Rate it yourself - /Services/careproviders/LeaveReview/DefaultView.aspx?id=1-4492275240,,,,