Organisation Name,NACS Code,Organisation Type,Address1,Address2,Address3,Address4,Address5,PostCode,Telephone Number,NHS.UK users rating,Value  (NHS.UK users rating),Banding Classification  (NHS.UK users rating),Car parking (Is there car parking at this organisation?),Disabled access (Disabled access)
Acer Care and Care 4 Me,1-10324127390,SCL,Homestead,"Roberts End, Hanley Swan",,Worcester,Worcestershire,WR8 0DN,Tel: 01684491607,No ratings yet Rate it yourself - /Services/careproviders/LeaveReview/DefaultView.aspx?id=1-10324127390,0,0,,
Albion Lodge Retirement Home,1-1693301436,SCL,Hanley Swan,Robert End,,Worcester,Worcestershire,WR8 0DN,Tel: 01684310626,No ratings yet Rate it yourself - /Services/careproviders/LeaveReview/DefaultView.aspx?id=1-1693301436,0,0,,
The Boynes Care Centre,1-140140646,SCL,Upper Hook Road,Upton-upon-Severn,,Worcester,Worcestershire,WR8 0SB,Tel: 01684594001,3 ratings Rate it yourself - /Services/careproviders/LeaveReview/DefaultView.aspx?id=1-140140646,,,,
Options Malvern View,1-119276146,SCL,The Rhydd,,,Hanley Castle,Worcestershire,WR8 0AD,Tel: 01684312610,No ratings yet Rate it yourself - /Services/careproviders/LeaveReview/DefaultView.aspx?id=1-119276146,0,0,,
Hastings Residential Care Home,1-124396149,SCL,130 Barnards Green Road,,,Malvern,Worcestershire,WR14 3NA,Tel: 01684585000,No ratings yet Rate it yourself - /Services/careproviders/LeaveReview/DefaultView.aspx?id=1-124396149,0,0,,
Welland House Care Centre,1-147134659,SCL,Lime Grove,Welland,,Malvern,Worcestershire,WR13 6LY,Tel: 01684310840,2 ratings Rate it yourself - /Services/careproviders/LeaveReview/DefaultView.aspx?id=1-147134659,,,,
Elgar Court Care Home,1-16539671822,SCL,35 St. Andrews Road,,,Malvern,,WR14 3PT,Tel: 01684211720,No ratings yet Rate it yourself - /Services/careproviders/LeaveReview/DefaultView.aspx?id=1-16539671822,0,0,,
Court House Care Home,1-11985267647,SCL,3-5 Court Road,,,Malvern,Worcestershire,WR14 3BU,Tel: 01684572271,No ratings yet Rate it yourself - /Services/careproviders/LeaveReview/DefaultView.aspx?id=1-11985267647,0,0,,
The Avenue Care Home,1-115277863,SCL,23 Avenue Road,,,Malvern,Worcestershire,WR14 3AY,Tel: 01684575922,No ratings yet Rate it yourself - /Services/careproviders/LeaveReview/DefaultView.aspx?id=1-115277863,0,0,,
Wishmoor,1-128543581,SCL,21 Avenue Road,,,Malvern,Worcestershire,WR14 3AY,Tel: 01684 569162,No ratings yet Rate it yourself - /Services/careproviders/LeaveReview/DefaultView.aspx?id=1-128543581,0,0,,
The Chace Rest Home,1-115173007,SCL,Chase Road,Upper Welland,,Malvern,Worcestershire,WR14 4JY,Tel: 01684561813,No ratings yet Rate it yourself - /Services/careproviders/LeaveReview/DefaultView.aspx?id=1-115173007,0,0,,
Blossom House,1-465217737,SCL,5 Avenue Road,,,Malvern,Worcestershire,WR14 3AL,Tel: 01684 574000,No ratings yet Rate it yourself - /Services/careproviders/LeaveReview/DefaultView.aspx?id=1-465217737,0,0,,
SENSE Tanglewood,1-120446158,SCL,72 Albert Road South,,,Malvern,Worcestershire,WR14 3AH,Tel: 01684576327,No ratings yet Rate it yourself - /Services/careproviders/LeaveReview/DefaultView.aspx?id=1-120446158,0,0,,
Audley Care Ellerslie,1-4076170590,SCL,Audley Ellerslie Abbey Road,,,Malvern,Worcestershire,WR14 3HL,Tel: 01684 437104,No ratings yet Rate it yourself - /Services/careproviders/LeaveReview/DefaultView.aspx?id=1-4076170590,0,0,,
Windsor Court Care Home,1-11264924028,SCL,Lansdowne Crescent,,,Malvern,Worcestershire,WR14 2AW,Tel: 01684882399,No ratings yet Rate it yourself - /Services/careproviders/LeaveReview/DefaultView.aspx?id=1-11264924028,0,0,,
Your Life (Malvern),1-965110947,SCL,Cartwright Court,Victoria Road,,Malvern,Worcestershire,WR14 2GE,Tel: 01684892076,No ratings yet Rate it yourself - /Services/careproviders/LeaveReview/DefaultView.aspx?id=1-965110947,0,0,,
Howbury House Resource Centre,1-147763036,SCL,Pickersleigh Grove,,,Malvern,Worcestershire,WR14 2LU,Tel: 01684571750,No ratings yet Rate it yourself - /Services/careproviders/LeaveReview/DefaultView.aspx?id=1-147763036,0,0,,
Ashwell Home Care Services Limited,1-7499411096,SCL,Troyte House,Sandys Road,,Malvern,,WR14 1JJ,Tel: 01684778750,No ratings yet Rate it yourself - /Services/careproviders/LeaveReview/DefaultView.aspx?id=1-7499411096,0,0,,
Mowbray Nursing Home,1-123533751,SCL,Victoria Road,,,Malvern,Worcestershire,WR14 2TF,Tel: 01684572946,No ratings yet Rate it yourself - /Services/careproviders/LeaveReview/DefaultView.aspx?id=1-123533751,0,0,,
Millfields Care Ltd,1-12353191854,SCL,40 Cockshot Road,,,Malvern,,WR14 2TT,Tel: 07515541158,1 rating Rate it yourself - /Services/careproviders/LeaveReview/DefaultView.aspx?id=1-12353191854,,,,
Friends of the Elderly Malvern,1-117309799,SCL,148 Graham Road,,,Malvern,Worcestershire,WR14 2HY,Tel: 01684574385,No ratings yet Rate it yourself - /Services/careproviders/LeaveReview/DefaultView.aspx?id=1-117309799,0,0,,
The Springs Care Home,1-130120870,SCL,Spring Lane,,,Malvern,Worcestershire,WR14 1AL,Tel: 01684571300,No ratings yet Rate it yourself - /Services/careproviders/LeaveReview/DefaultView.aspx?id=1-130120870,0,0,,
Newlife Care Providers,1-2922803038,SCL,"HDAnywhere, The Haysfield",Spring Lane North,,Malvern,,WR14 1GF,Tel: 07414260226,No ratings yet Rate it yourself - /Services/careproviders/LeaveReview/DefaultView.aspx?id=1-2922803038,0,0,,
The Oaks,1-113493371,SCL,165 Worcester Road,,,Malvern,Worcestershire,WR14 1ET,Tel: 01684572079,No ratings yet Rate it yourself - /Services/careproviders/LeaveReview/DefaultView.aspx?id=1-113493371,0,0,,
Springfield House,1-2061660719,SCL,3-5 Ranelagh Road,,,Malvern,Worcestershire,WR14 1BQ,Tel: 01684574248,No ratings yet Rate it yourself - /Services/careproviders/LeaveReview/DefaultView.aspx?id=1-2061660719,0,0,,
Beechwood Residential Care Home,1-124396235,SCL,The Beeches,Holly Green,,Upton-upon-Severn,Worcestershire,WR8 0RR,Tel: 01684595959,No ratings yet Rate it yourself - /Services/careproviders/LeaveReview/DefaultView.aspx?id=1-124396235,0,0,,
Matrixcare,1-3229146212,SCL,369 Worcester Road,,,Malvern,Worcestershire,WR14 1AR,Tel: 01684568097,No ratings yet Rate it yourself - /Services/careproviders/LeaveReview/DefaultView.aspx?id=1-3229146212,0,0,,
Radis Community Care (Clarence Park Village),1-4279579084,SCL,Clarence Park Village,415 Worcester Road,,Malvern,Worcestershire,WR14 1PP,Tel: 01684583010,No ratings yet Rate it yourself - /Services/careproviders/LeaveReview/DefaultView.aspx?id=1-4279579084,0,0,,
Cleeve House,1-135441632,SCL,49 Hornyold Road,,,Malvern,Worcestershire,WR14 1QH,Tel: 01684564454,No ratings yet Rate it yourself - /Services/careproviders/LeaveReview/DefaultView.aspx?id=1-135441632,0,0,,
Evendine House,1-144581960,SCL,Evendine House,Evendine Lane,,Malvern,Worcestershire,WR13 6DT,Tel: 033 0097 7373,No ratings yet Rate it yourself - /Services/careproviders/LeaveReview/DefaultView.aspx?id=1-144581960,0,0,,
Ablegrange Severn Heights Limited,1-125587087,SCL,Old Hills,Callow End,,Worcester,Worcestershire,WR2 4TQ,Tel: 01905831199,No ratings yet Rate it yourself - /Services/careproviders/LeaveReview/DefaultView.aspx?id=1-125587087,0,0,,
Dalvington/The Oaks,1-120634754,SCL,Dalvington,146 Lower Howsell Road,,Malvern,Worcestershire,WR14 1DL,Tel: 01886833424,No ratings yet Rate it yourself - /Services/careproviders/LeaveReview/DefaultView.aspx?id=1-120634754,0,0,,
The Lawns,1-115758642,SCL,Main Road,Kempsey,,Worcester,Worcestershire,WR5 3NF,Tel: 01905 821388,No ratings yet Rate it yourself - /Services/careproviders/LeaveReview/DefaultView.aspx?id=1-115758642,0,0,,
Pirton Grange Specialist Services,1-142667700,SCL,Worcester Road,Pirton,,Worcester,Worcestershire,WR8 9EF,,No ratings yet Rate it yourself - /Services/careproviders/LeaveReview/DefaultView.aspx?id=1-142667700,0,0,,
Options Bredon House,1-476877271,SCL,Hospital Lane,Powick,,Worcester,,WR2 4SQ,Tel: 01905830234,1 rating Rate it yourself - /Services/careproviders/LeaveReview/DefaultView.aspx?id=1-476877271,,,,
Hamilton House,1-376104650,SCL,Leigh Sinton,,,Malvern,Worcestershire,WR13 5DZ,Tel: 01886832456,No ratings yet Rate it yourself - /Services/careproviders/LeaveReview/DefaultView.aspx?id=1-376104650,0,0,,
Whitestone Care Limited Worcester,1-18211661535,SCL,Strensham M5 Northbound Service Area,"Strensham, Hillcroome, Upton-upon-severn",,Worcester,,WR8 0BZ,Tel: 08000851254,No ratings yet Rate it yourself - /Services/careproviders/LeaveReview/DefaultView.aspx?id=1-18211661535,0,0,,
Waterside Care Centre,1-123533948,SCL,Leigh Sinton,,,Malvern,Worcestershire,WR13 5EQ,Tel: 01886833706,No ratings yet Rate it yourself - /Services/careproviders/LeaveReview/DefaultView.aspx?id=1-123533948,0,0,,
Shining Star Home Care Limited,1-11058533433,SCL,40 Malvern Oaks Close,Cradley,,Malvern,,WR13 5NE,Tel: 07958591470,No ratings yet Rate it yourself - /Services/careproviders/LeaveReview/DefaultView.aspx?id=1-11058533433,0,0,,
Teme Court Residential Care Home,1-113398333,SCL,Old Road,Lower Wick,,Worcester,Worcestershire,WR2 4BU,Tel: 01905972023,No ratings yet Rate it yourself - /Services/careproviders/LeaveReview/DefaultView.aspx?id=1-113398333,0,0,,
Dependable Home Care Services Limited,1-4207242680,SCL,61 Canada Way,,,Worcester,,WR2 4XA,Tel: 07594683830,No ratings yet Rate it yourself - /Services/careproviders/LeaveReview/DefaultView.aspx?id=1-4207242680,0,0,,
Birchams Grange,1-118868224,SCL,Clenchers Lane,Eastnor,,Ledbury,Herefordshire,HR8 1RW,Tel: 01531632925,No ratings yet Rate it yourself - /Services/careproviders/LeaveReview/DefaultView.aspx?id=1-118868224,0,0,,
Home Instead Senior Care,1-377680897,SCL,Suite 5B,"Malvern Gate, Bromwich Road",,Worcester,Worcestershire,WR2 4BN,Tel: 01905420404,No ratings yet Rate it yourself - /Services/careproviders/LeaveReview/DefaultView.aspx?id=1-377680897,0,0,,
Stanfield Nursing Home Limited,1-114409532,SCL,Upper Wick Lane,Rushwick,,Worcester,Worcestershire,WR2 5SU,,No ratings yet Rate it yourself - /Services/careproviders/LeaveReview/DefaultView.aspx?id=1-114409532,0,0,,
Bedwardine House Residential Care Home,1-115230808,SCL,Upper Wick Lane,Rushwick,,Worcester,Worcestershire,WR2 5SU,Tel: 01905425101,No ratings yet Rate it yourself - /Services/careproviders/LeaveReview/DefaultView.aspx?id=1-115230808,0,0,,
Crossroads Caring for Carers,1-130618228,SCL,Crossroads Caring for Carers (Worcestershire),"Weir Lane, Lower Wick",,Worcester,Worcestershire,WR2 4AY,Tel: 01905729293,No ratings yet Rate it yourself - /Services/careproviders/LeaveReview/DefaultView.aspx?id=1-130618228,0,0,,
Severn Vale Home Care Worcester,1-12119336784,SCL,"Office F2, New Venture House",Park Boulevard,,Worcester,,WR2 4AY,Tel: 01905950409,No ratings yet Rate it yourself - /Services/careproviders/LeaveReview/DefaultView.aspx?id=1-12119336784,0,0,,
Bethany Lodge,1-120814501,SCL,222 Malvern Road,,,Worcester,Worcestershire,WR2 4PA,Tel: 01905420088,No ratings yet Rate it yourself - /Services/careproviders/LeaveReview/DefaultView.aspx?id=1-120814501,0,0,,
The Firs Rest Home,1-118565717,SCL,141 Malvern Road,St Johns,,Worcester,Worcestershire,WR2 4LN,Tel: 01905426194,No ratings yet Rate it yourself - /Services/careproviders/LeaveReview/DefaultView.aspx?id=1-118565717,0,0,,
Norton Hall,1-129942411,SCL,Woodbury Park,Norton,,Worcester,Worcestershire,WR5 2QU,Tel: 01905357766,No ratings yet Rate it yourself - /Services/careproviders/LeaveReview/DefaultView.aspx?id=1-129942411,0,0,,
Sanctuary Supported Living (Hazel Court),1-2207969105,SCL,3 University Park Drive,,,Worcester,Worcestershire,WR2 5FG,Tel: 01905796561,No ratings yet Rate it yourself - /Services/careproviders/LeaveReview/DefaultView.aspx?id=1-2207969105,0,0,,
Tewkesbury Fields,1-12957650694,SCL,The Oxhey,Bushley,,Tewkesbury,Gloucestershire,GL20 6HP,Tel: 01684850311,No ratings yet Rate it yourself - /Services/careproviders/LeaveReview/DefaultView.aspx?id=1-12957650694,0,0,,
Regent Residential Care Home,1-124396200,SCL,School Road,St Johns,,Worcester,Worcestershire,WR2 4HF,Tel: 01905337100,No ratings yet Rate it yourself - /Services/careproviders/LeaveReview/DefaultView.aspx?id=1-124396200,0,0,,
Juniper House Residential Care Home,1-2148344202,SCL,2 Oak View Way,St Johns,,Worcester,Worcestershire,WR2 5FJ,Tel: 01905676950,No ratings yet Rate it yourself - /Services/careproviders/LeaveReview/DefaultView.aspx?id=1-2148344202,0,0,,
Sanctuary Home Care Ltd- Worcester,1-2305128804,SCL,Noble House,1 Oak View Way,,Worcester,Worcestershire,WR2 5FH,Tel: 01905676946,No ratings yet Rate it yourself - /Services/careproviders/LeaveReview/DefaultView.aspx?id=1-2305128804,0,0,,
1st Class Care Services2 Ltd,1-2210769079,SCL,3 The Southend,,,Ledbury,,HR8 2EY,Tel: 01531635107,No ratings yet Rate it yourself - /Services/careproviders/LeaveReview/DefaultView.aspx?id=1-2210769079,0,0,,
Shaw Community Services Limited (DCA) -  Herefordshire Branch,1-126399191,SCL,Leadon Bank,Orchard Lane,,Ledbury,Herefordshire,HR8 1BY,Tel: 01531638138,No ratings yet Rate it yourself - /Services/careproviders/LeaveReview/DefaultView.aspx?id=1-126399191,0,0,,
Orchard Place,1-134889389,SCL,Leadon Bank,Orchard Lane,,Ledbury,Herefordshire,HR8 1BY,Tel: 0800 902 0092,No ratings yet Rate it yourself - /Services/careproviders/LeaveReview/DefaultView.aspx?id=1-134889389,0,0,,
The Broad Group - 85 Bath Road,1-109967775,SCL,85 Bath Road,,,Worcester,Worcestershire,WR5 3AE,,No ratings yet Rate it yourself - /Services/careproviders/LeaveReview/DefaultView.aspx?id=1-109967775,0,0,,
Ledbury ABI Unit Market Lodge,1-128335150,SCL,Market Street,,,Ledbury,Herefordshire,HR8 2AQ,Tel: 01531 637618,No ratings yet Rate it yourself - /Services/careproviders/LeaveReview/DefaultView.aspx?id=1-128335150,0,0,,
Ledbury Intermediate Care Unit,1-128364442,SCL,Market Street,,,Ledbury,Herefordshire,HR8 2AQ,Tel: 0800 902 0092,No ratings yet Rate it yourself - /Services/careproviders/LeaveReview/DefaultView.aspx?id=1-128364442,0,0,,
Ledbury Nursing Home,1-128364428,SCL,Market Street,,,Ledbury,Herefordshire,HR8 2AQ,Tel: 0800 902 0092,No ratings yet Rate it yourself - /Services/careproviders/LeaveReview/DefaultView.aspx?id=1-128364428,0,0,,
Phoenix House,1-10867338350,SCL,122 Bromyard Road,,,Worcester,,WR2 5DJ,,No ratings yet Rate it yourself - /Services/careproviders/LeaveReview/DefaultView.aspx?id=1-10867338350,0,0,,
95 Bromyard Road,1-304923242,SCL,95 Bromyard Road,St Johns,,Worcester,Worcestershire,WR2 5BZ,Tel: 01905 429527,No ratings yet Rate it yourself - /Services/careproviders/LeaveReview/DefaultView.aspx?id=1-304923242,0,0,,
Radfield Home Care Worcester,1-5271995588,SCL,6 King Charles Place,St. Johns,,Worcester,,WR2 5AJ,Tel: 01905 427 863,No ratings yet Rate it yourself - /Services/careproviders/LeaveReview/DefaultView.aspx?id=1-5271995588,0,0,,
Phemacare Ltd,1-1607928970,SCL,78 London Road,,,Worcester,Worcestershire,WR5 2DY,Tel: 01905360105,No ratings yet Rate it yourself - /Services/careproviders/LeaveReview/DefaultView.aspx?id=1-1607928970,0,0,,
South Hayes Care Home,1-154110564,SCL,101 London Road,,,Worcester,Worcestershire,WR5 2DZ,Tel: 01905357429,1 rating Rate it yourself - /Services/careproviders/LeaveReview/DefaultView.aspx?id=1-154110564,,,,
Home Force Care Worcester,1-14906231910,SCL,8 Edgar Street,,,Worcester,,WR1 2LR,,No ratings yet Rate it yourself - /Services/careproviders/LeaveReview/DefaultView.aspx?id=1-14906231910,0,0,,
Leadon Vale Care Ltd,1-7171778066,SCL,Ledbury Business Centre,136 Bridge Street,,Ledbury,,HR8 2AS,Tel: 01531248060,No ratings yet Rate it yourself - /Services/careproviders/LeaveReview/DefaultView.aspx?id=1-7171778066,0,0,,
Crookbarrow View,1-11099525152,SCL,3 Gotland Road,Off Whittington Road,,Worcester,,WR5 2GN,Tel: 03701924347,No ratings yet Rate it yourself - /Services/careproviders/LeaveReview/DefaultView.aspx?id=1-11099525152,0,0,,
Shaw Red Hill Care Centre,1-8157662470,SCL,229 London Road,,,Worcester,Worcestershire,WR5 2JG,Tel: 01905354000,No ratings yet Rate it yourself - /Services/careproviders/LeaveReview/DefaultView.aspx?id=1-8157662470,0,0,,
The Lawns,1-7799732558,SCL,The Lawns,"Link End Road, Corse Lawn",,Gloucester,,GL19 4NN,Tel: 01452780353,No ratings yet Rate it yourself - /Services/careproviders/LeaveReview/DefaultView.aspx?id=1-7799732558,0,0,,
Deer Park Care Home,1-12470851149,SCL,Martins Way,Off Leadon Way,,Ledbury,,HR8 2XW,Tel: 08081786565,No ratings yet Rate it yourself - /Services/careproviders/LeaveReview/DefaultView.aspx?id=1-12470851149,0,0,,
Constable House,1-187540626,SCL,6-8 Howard Road,Dines Green,,Worcester,Worcestershire,WR2 5RB,Tel: 01905422150,No ratings yet Rate it yourself - /Services/careproviders/LeaveReview/DefaultView.aspx?id=1-187540626,0,0,,
Helping Hands Worcester,1-6692732361,SCL,32 Broad Street,,,Worcester,,WR1 3NH,Tel: 01905676981,No ratings yet Rate it yourself - /Services/careproviders/LeaveReview/DefaultView.aspx?id=1-6692732361,0,0,,
Stepping Stones Red Marley,1-138359449,SCL,Bromsberrow Road,Redmarley,,Gloucester,Gloucestershire,GL19 3JU,Tel: 01531650880,No ratings yet Rate it yourself - /Services/careproviders/LeaveReview/DefaultView.aspx?id=1-138359449,0,0,,
Assisted Lives (Worcester),1-9110930808,SCL,Unity House & Community Centre,Stanley Road,,Worcester,,WR5 1BE,Tel: 01527313690,No ratings yet Rate it yourself - /Services/careproviders/LeaveReview/DefaultView.aspx?id=1-9110930808,0,0,,
Inspire Neurocare Worcester,1-8296451126,SCL,195 Oldbury Road,,,Worcester,,WR2 6AS,Tel: 01905969000,1 rating Rate it yourself - /Services/careproviders/LeaveReview/DefaultView.aspx?id=1-8296451126,,,,
Stanley House,1-117558045,SCL,Stanley House,Bosbury,,Ledbury,Herefordshire,HR8 1HB,Tel: 01531 640840,No ratings yet Rate it yourself - /Services/careproviders/LeaveReview/DefaultView.aspx?id=1-117558045,0,0,,
Bowley Court,1-686916505,SCL,Stanley House,Bosbury,,Ledbury,Herefordshire,HR8 1HB,Tel: 01531640840,No ratings yet Rate it yourself - /Services/careproviders/LeaveReview/DefaultView.aspx?id=1-686916505,0,0,,
Shared Lives,1-982233179,SCL,G3 County Hall,Spetchley Road,,Worcester,,WR5 2NP,Tel: 01905844264,No ratings yet Rate it yourself - /Services/careproviders/LeaveReview/DefaultView.aspx?id=1-982233179,0,0,,
Reablement Service,1-982233141,SCL,G3 County Hall,Spetchley Road,,Worcester,,WR5 2NP,Tel: 01905843341,1 rating Rate it yourself - /Services/careproviders/LeaveReview/DefaultView.aspx?id=1-982233141,,,,
Carefour,1-3657527547,SCL,3 Moor Street,,,Worcester,Worcestershire,WR1 3DB,Tel: 01905699699,No ratings yet Rate it yourself - /Services/careproviders/LeaveReview/DefaultView.aspx?id=1-3657527547,0,0,,
Rely Care Agency Limited,1-122138077,SCL,33A Himbleton Road,St Johns,,Worcester,Worcestershire,WR2 6BA,Tel: 01905339331,No ratings yet Rate it yourself - /Services/careproviders/LeaveReview/DefaultView.aspx?id=1-122138077,0,0,,
Happylife Care,1-2033159442,SCL,Unit 3D,Shrub Hill Industrial Estate,,Worcester,Worcestershire,WR4 9EL,Tel: 07401772572,No ratings yet Rate it yourself - /Services/careproviders/LeaveReview/DefaultView.aspx?id=1-2033159442,0,0,,
Touchheart Healthcare Worcester Office,1-12515157010,SCL,County House,St. Marys Street,,Worcester,,WR1 1HB,Tel: 07403680808,No ratings yet Rate it yourself - /Services/careproviders/LeaveReview/DefaultView.aspx?id=1-12515157010,0,0,,
Simply The Best Care Ltd,1-9960242615,SCL,County House,St. Marys Street,,Worcester,,WR1 1HB,Tel: 07710888553,1 rating Rate it yourself - /Services/careproviders/LeaveReview/DefaultView.aspx?id=1-9960242615,,,,
Nurseplus - Worcester,1-18092255813,SCL,County House,St. Marys Street,,Worcester,,WR1 1HB,Tel: 0190525279,No ratings yet Rate it yourself - /Services/careproviders/LeaveReview/DefaultView.aspx?id=1-18092255813,0,0,,
Firstcall 247 Limited (Worcestershire),1-16888189378,SCL,01 Third Floor County House Business Centre,St. Marys Street,,Worcester,,WR1 1HB,Tel: 01905972288,No ratings yet Rate it yourself - /Services/careproviders/LeaveReview/DefaultView.aspx?id=1-16888189378,0,0,,
Evans Healthcare Group - Worcester,1-15712164285,SCL,"T15, County House",St. Marys Street,,Worcester,,WR1 1HB,Tel: 07534663697,No ratings yet Rate it yourself - /Services/careproviders/LeaveReview/DefaultView.aspx?id=1-15712164285,0,0,,
"Eclipse HomeCare (Worcester, Malvern, Kidderminster & Bromsgrove)",1-122963052,SCL,County House,1 St Mary's Street,,Worcester,Worcestershire,WR1 1HB,Tel: 01905 641070,No ratings yet Rate it yourself - /Services/careproviders/LeaveReview/DefaultView.aspx?id=1-122963052,0,0,,
Priory Supported Living The Shires,1-10525531173,SCL,Anbrian House,1 The Tything,,Worcester,,WR1 1HD,Tel: 01905611042,No ratings yet Rate it yourself - /Services/careproviders/LeaveReview/DefaultView.aspx?id=1-10525531173,0,0,,
Ignite Health and Home Care Service - Worcester,1-8531329627,SCL,1c Lowesmoor Terrace,,,Worcester,,WR1 2RX,Tel: 01905252718,No ratings yet Rate it yourself - /Services/careproviders/LeaveReview/DefaultView.aspx?id=1-8531329627,0,0,,
Radis Community Care (Meadow Court),1-4279578771,SCL,Meadow Court,Darwin Avenue,,Worcester,,WR5 1AP,Tel: 01905353453,No ratings yet Rate it yourself - /Services/careproviders/LeaveReview/DefaultView.aspx?id=1-4279578771,0,0,,
La Vie En Rose Ltd,1-8088245430,SCL,18 Ashchurch Road,The Canterbury Business Centre,,Tewkesbury,,GL20 8BT,Tel: 01684439564,No ratings yet Rate it yourself - /Services/careproviders/LeaveReview/DefaultView.aspx?id=1-8088245430,0,0,,
Curlew Close,1-119185514,SCL,1 Curlew Close,Northway,,Tewkesbury,Gloucestershire,GL20 8TJ,Tel: 01684275991,No ratings yet Rate it yourself - /Services/careproviders/LeaveReview/DefaultView.aspx?id=1-119185514,0,0,,
Latimer Court,1-592699847,SCL,Darwin Avenue,,,Worcester,Worcestershire,WR5 1SP,Tel: 01905363270,No ratings yet Rate it yourself - /Services/careproviders/LeaveReview/DefaultView.aspx?id=1-592699847,0,0,,
Staffing Plus Ltd,1-2482960110,SCL,58 Cherwell Close,,,Worcester,,WR4 9BN,Tel: 01212968416,No ratings yet Rate it yourself - /Services/careproviders/LeaveReview/DefaultView.aspx?id=1-2482960110,0,0,,
Perry Manor,1-1459306141,SCL,Charles Hastings Way,,,Worcester,Worcestershire,WR5 1ET,Tel: 01905728410,No ratings yet Rate it yourself - /Services/careproviders/LeaveReview/DefaultView.aspx?id=1-1459306141,0,0,,
NSF Health,1-14815195142,SCL,"Office 47, Basepoint Business Centre","Oakfield Close, Tewkesbury Business Park",,Tewkesbury,,GL20 8SD,Tel: 07403316439,No ratings yet Rate it yourself - /Services/careproviders/LeaveReview/DefaultView.aspx?id=1-14815195142,0,0,,
Dignity Care Services Limited Offices,1-17712319922,SCL,Basepoint Business Centre,"58 Oakfield Close, Tewkesbury Business Park",,Tewkesbury,,GL20 8SD,Tel: 01684770215,No ratings yet Rate it yourself - /Services/careproviders/LeaveReview/DefaultView.aspx?id=1-17712319922,0,0,,
Henwick Grange,1-326347049,SCL,68 Hallow Road,St Johns,,Worcester,Worcestershire,WR2 6BY,Tel: 01905424705,No ratings yet Rate it yourself - /Services/careproviders/LeaveReview/DefaultView.aspx?id=1-326347049,0,0,,
Inclusion Care,1-2016920610,SCL,Unit 21 Miller Court Tewkesbury Business Park,Severn Drive,,Tewkesbury,Gloucestershire,GL20 8DN,Tel: 01684778269,1 rating Rate it yourself - /Services/careproviders/LeaveReview/DefaultView.aspx?id=1-2016920610,,,,
Aspects 2 Supported Living Service,1-1135161188,SCL,21 Miller Court,"Severn Drive, Tewkesbury Business Park",,Tewkesbury,Gloucestershire,GL20 8DN,Tel: 01453763600,No ratings yet Rate it yourself - /Services/careproviders/LeaveReview/DefaultView.aspx?id=1-1135161188,0,0,,
Walsingham Support - Keepers Cottage,1-5919607501,SCL,Falcon Lane,,,Ledbury,Herefordshire,HR8 2JN,Tel: 01531671080,No ratings yet Rate it yourself - /Services/careproviders/LeaveReview/DefaultView.aspx?id=1-5919607501,0,0,,
Walsingham Support - Central Supported Living,1-17430164866,SCL,"The Barn, Keepers Cottage",Falcon Lane,,Ledbury,,HR8 2JN,Tel: 01531671080,No ratings yet Rate it yourself - /Services/careproviders/LeaveReview/DefaultView.aspx?id=1-17430164866,0,0,,