Organisation Name,NACS Code,Organisation Type,Address1,Address2,Address3,Address4,Address5,PostCode,Telephone Number,NHS.UK users rating,Value  (NHS.UK users rating),Banding Classification  (NHS.UK users rating),Car parking (Is there car parking at this organisation?),Disabled access (Disabled access)
Nesbit House Care Home,1-7312323608,SCL,Orpington By Pass,Badgers Mount,,Sevenoaks,,TN14 7AG,Tel: 01959581350,No ratings yet Rate it yourself - /Services/careproviders/LeaveReview/DefaultView.aspx?id=1-7312323608,0,0,,
Home Instead Senior Care,1-3882103168,SCL,Polhill Business Centre,Halstead,,Sevenoaks,Kent,TN14 7AA,Tel: 01959546228,No ratings yet Rate it yourself - /Services/careproviders/LeaveReview/DefaultView.aspx?id=1-3882103168,0,0,,
Foxbridge House,1-651388922,SCL,Sevenoaks Road,Pratts Bottom,,Orpington,Kent,BR6 7FB,Tel: 03333210926,No ratings yet Rate it yourself - /Services/careproviders/LeaveReview/DefaultView.aspx?id=1-651388922,0,0,,
Vitality Home Health (Sevenoaks),1-8817429525,SCL,"The Crown, 10 High Street",Otford,,Sevenoaks,,TN14 5PQ,Tel: 01732755582,No ratings yet Rate it yourself - /Services/careproviders/LeaveReview/DefaultView.aspx?id=1-8817429525,0,0,,
73 Repton Road,1-3040078634,SCL,73 Repton Road,,,Orpington,Kent,BR6 9HT,Tel: 01689836661,No ratings yet Rate it yourself - /Services/careproviders/LeaveReview/DefaultView.aspx?id=1-3040078634,0,0,,
Diagrama Supported Living,1-10631728583,SCL,3A Healy Drive,,,Orpington,Kent,BR6 9LB,Tel: 01689891401,No ratings yet Rate it yourself - /Services/careproviders/LeaveReview/DefaultView.aspx?id=1-10631728583,0,0,,
Cabrini House 1 (Diagrama Healthcare),1-1875164088,SCL,1 Healy Drive,,,Orpington,Kent,BR6 9LB,Tel: 01689891401,No ratings yet Rate it yourself - /Services/careproviders/LeaveReview/DefaultView.aspx?id=1-1875164088,0,0,,
Cabrini House 3 (Diagrama Healthcare),1-1875185341,SCL,3 Healy Drive,,,Orpington,Kent,BR6 9LB,Tel: 01689891401,No ratings yet Rate it yourself - /Services/careproviders/LeaveReview/DefaultView.aspx?id=1-1875185341,0,0,,
Cabrini House 2 (Diagrama Healthcare),1-2315394292,SCL,2 Healy Drive,,,Orpington,Kent,BR6 9LB,Tel: 01689891401,No ratings yet Rate it yourself - /Services/careproviders/LeaveReview/DefaultView.aspx?id=1-2315394292,0,0,,
Apex Prime Care - Kent,1-4870256462,SCL,"The Annexe, Chipstead Lake","Chevening Road, Chipstead",,Sevenoaks,,TN13 2SD,Tel: 01732606032,No ratings yet Rate it yourself - /Services/careproviders/LeaveReview/DefaultView.aspx?id=1-4870256462,0,0,,
Chipstead Lake - Care Home Physical Disabilities,1-120084758,SCL,Chevening Road,Chipstead,,Sevenoaks,Kent,TN13 2SD,Tel: 01732459510,No ratings yet Rate it yourself - /Services/careproviders/LeaveReview/DefaultView.aspx?id=1-120084758,0,0,,
Chislehurst Homecare Partnership,1-145353745,SCL,The Mews 3 Church Road,Farnborough Village,,Orpington,,BR6 7DB,Tel: 07484734525,No ratings yet Rate it yourself - /Services/careproviders/LeaveReview/DefaultView.aspx?id=1-145353745,0,0,,
Day to Day Care Limited,1-2890688735,SCL,First Floor Offices,350 High Street,,Orpington,Kent,BR6 0NQ,Tel: 01689897774,2 ratings Rate it yourself - /Services/careproviders/LeaveReview/DefaultView.aspx?id=1-2890688735,,,,
Rivermere Retirement and Care Home,1-3118835738,SCL,64-70 Westerham Road,Bessels Green,,Sevenoaks,Kent,TN13 2PZ,Tel: 01732748400,No ratings yet Rate it yourself - /Services/careproviders/LeaveReview/DefaultView.aspx?id=1-3118835738,0,0,,
Asota Services Limited,1-17429747727,SCL,76 Dyke Drive,,,Orpington,,BR5 4LZ,Tel: 07931684113,No ratings yet Rate it yourself - /Services/careproviders/LeaveReview/DefaultView.aspx?id=1-17429747727,0,0,,
Compassion Home Care Limited,1-883936252,SCL,"1st Floor, East Wing, Priory Buildings","The Priory, Church Hill",,Orpington,,BR6 0HH,Tel: 01689825155,No ratings yet Rate it yourself - /Services/careproviders/LeaveReview/DefaultView.aspx?id=1-883936252,0,0,,
Pentacare (Sevenoaks),1-11984983358,SCL,"Pentacare, 2 The Square",,,Sevenoaks,,TN13 2AA,Tel: 01732905405,No ratings yet Rate it yourself - /Services/careproviders/LeaveReview/DefaultView.aspx?id=1-11984983358,0,0,,
Rivermere Retirement and Care Home,1-126362857,SCL,64-70 Westerham Road,Bessels Green,,Sevenoaks,Kent,TN13 2PZ,Tel: 01732748400,No ratings yet Rate it yourself - /Services/careproviders/LeaveReview/DefaultView.aspx?id=1-126362857,0,0,,
Caremore Companions,1-18445130262,SCL,Sevenoaks Business Hub,Bradbourne Vale Road,,Sevenoaks,,TN13 3QG,Tel: 07721131299,No ratings yet Rate it yourself - /Services/careproviders/LeaveReview/DefaultView.aspx?id=1-18445130262,0,0,,
Creative Support - Apsley Court,1-4126233283,SCL,100 Wellington Road,,,Orpington,Kent,BR5 4AQ,,No ratings yet Rate it yourself - /Services/careproviders/LeaveReview/DefaultView.aspx?id=1-4126233283,0,0,,
Carebridge Staffing Ltd,1-4076395186,SCL,,7b Old Yard Rectory Lane,,Brasted,Kent,TN16 1JP,Tel: 02038791520,1 rating Rate it yourself - /Services/careproviders/LeaveReview/DefaultView.aspx?id=1-4076395186,,,,
Care First 24 Ltd,1-13931454343,SCL,7 The Old Yard,"Rectory Lane, Brasted",,Westerham,,TN16 1JP,Tel: 01732790001,No ratings yet Rate it yourself - /Services/careproviders/LeaveReview/DefaultView.aspx?id=1-13931454343,0,0,,
Caremark (Sevenoaks & Tandridge),1-12247986062,SCL,"8C, The Old Yard, Rectory Lane",Brasted,,Westerham,,TN16 1JR,Tel: 01732446147,No ratings yet Rate it yourself - /Services/careproviders/LeaveReview/DefaultView.aspx?id=1-12247986062,0,0,,
Highlands Care Ltd,1-10153383469,SCL,23 Footbury Hill Road,,,Orpington,Kent,BR6 0HP,Tel: 07931325755,No ratings yet Rate it yourself - /Services/careproviders/LeaveReview/DefaultView.aspx?id=1-10153383469,0,0,,
Bluebird Care Sevenoaks,1-345046401,SCL,,87 St Johns Hill,,Sevenoaks,Kent,TN13 3PE,Tel: 01732471541,44 ratings Rate it yourself - /Services/careproviders/LeaveReview/DefaultView.aspx?id=1-345046401,,,,
Alpine Care Home,1-462802731,SCL,10 Bradbourne Park Road,,,Sevenoaks,Kent,TN13 3LH,Tel: 01732455537,No ratings yet Rate it yourself - /Services/careproviders/LeaveReview/DefaultView.aspx?id=1-462802731,0,0,,
Gracious Care,1-9775304484,SCL,Willow Walk Business Centre,8 - 10 Willow Walk,,Orpington,,BR6 7AA,,No ratings yet Rate it yourself - /Services/careproviders/LeaveReview/DefaultView.aspx?id=1-9775304484,0,0,,
Always Inclusive Outreach,1-12642181724,SCL,T M S House,Cray Avenue,,Orpington,,BR5 3QB,Tel: 01689885040,No ratings yet Rate it yourself - /Services/careproviders/LeaveReview/DefaultView.aspx?id=1-12642181724,0,0,,
"Radfield Home Care Bromley, Orpington & Beckenham",1-14144735535,SCL,"Unit 15, TMS House",Cray Avenue,,Orpington,,BR5 3QB,Tel: 020 8064 2324,No ratings yet Rate it yourself - /Services/careproviders/LeaveReview/DefaultView.aspx?id=1-14144735535,0,0,,
Alina Homecare Bromley,1-6317810733,SCL,"Office 1, First Floor, Access House",Cray Avenue,,Orpington,,BR5 3QB,Tel: 01689283222,No ratings yet Rate it yourself - /Services/careproviders/LeaveReview/DefaultView.aspx?id=1-6317810733,0,0,,
Anjel Direct (Recruitment) Solutions Ltd,1-10728971317,SCL,T M S House,Cray Avenue,,Orpington,,BR5 3QB,Tel: 02088521622,No ratings yet Rate it yourself - /Services/careproviders/LeaveReview/DefaultView.aspx?id=1-10728971317,0,0,,
Caremark (Bromley),1-253641853,SCL,International House,Cray Avenue,,Orpington,Kent,BR5 3RS,Tel: 01689825305,3 ratings Rate it yourself - /Services/careproviders/LeaveReview/DefaultView.aspx?id=1-253641853,,,,
Angels Place Health & Social Care,1-3906886217,SCL,Mentmore House,Cray Avenue,,Orpington,Kent,BR5 3QF,Tel: 02039500466,No ratings yet Rate it yourself - /Services/careproviders/LeaveReview/DefaultView.aspx?id=1-3906886217,0,0,,
Aviela Care Ltd,1-17583561497,SCL,Mentmore House,Cray Avenue,,Orpington,Kent,BR5 3QF,,No ratings yet Rate it yourself - /Services/careproviders/LeaveReview/DefaultView.aspx?id=1-17583561497,0,0,,
Gloucester House,1-2094008883,SCL,Lansdowne Road,,,Sevenoaks,Kent,TN13 3XU,Tel: 01732741488,No ratings yet Rate it yourself - /Services/careproviders/LeaveReview/DefaultView.aspx?id=1-2094008883,0,0,,
Enamoured Care Ltd,1-18977050914,SCL,109 Star Lane,,,Orpington,,BR5 3LN,,No ratings yet Rate it yourself - /Services/careproviders/LeaveReview/DefaultView.aspx?id=1-18977050914,0,0,,
1-3 Emily Jackson Close,1-1309169204,SCL,Eardley Road,,,Sevenoaks,Kent,TN13 1XH,Tel: 07586092462,No ratings yet Rate it yourself - /Services/careproviders/LeaveReview/DefaultView.aspx?id=1-1309169204,0,0,,
Emily Jackson House,1-125855902,SCL,34 Eardley Road,,,Sevenoaks,Kent,TN13 1XH,Tel: 01732743824,1 rating Rate it yourself - /Services/careproviders/LeaveReview/DefaultView.aspx?id=1-125855902,,,,
Lavender Fields,1-5154676354,SCL,High Street,Seal,,Sevenoaks,,TN15 0AE,Tel: 01732755630,No ratings yet Rate it yourself - /Services/careproviders/LeaveReview/DefaultView.aspx?id=1-5154676354,0,0,,
Parisse Care Consulting Limited,1-11718784147,SCL,54 Court Crescent,,,Swanley,,BR8 8NR,Tel: 07877579670,No ratings yet Rate it yourself - /Services/careproviders/LeaveReview/DefaultView.aspx?id=1-11718784147,0,0,,
Cecile Healthcare UK,1-13196984603,SCL,1 Meadow View,,,Orpington,,BR5 3EJ,Tel: 07533476912,No ratings yet Rate it yourself - /Services/careproviders/LeaveReview/DefaultView.aspx?id=1-13196984603,0,0,,
Tanglewood,1-151774304,SCL,66 Leaves Green Road,Keston,,Bromley,Kent,BR2 6DQ,Tel: 01689850642,No ratings yet Rate it yourself - /Services/careproviders/LeaveReview/DefaultView.aspx?id=1-151774304,0,0,,
Lifeways Community Care (South London),1-12100652788,SCL,The Clock Tower 3-4,Blighs Road,,Sevenoaks,,TN13 1DA,Tel: 02072026300,No ratings yet Rate it yourself - /Services/careproviders/LeaveReview/DefaultView.aspx?id=1-12100652788,0,0,,
Future Home Care Ltd Kent,1-11673219616,SCL,"OU1, The Clock House, 3-4",Blighs Road,,Sevenoaks,,TN13 1DA,Tel: 02072026300,No ratings yet Rate it yourself - /Services/careproviders/LeaveReview/DefaultView.aspx?id=1-11673219616,0,0,,
Active Care Group - Children's Complex Care,1-1886216042,SCL,2nd floor,1 Suffolk Way,,Sevenoaks,Kent,TN13 1YL,Tel: 01732779353,No ratings yet Rate it yourself - /Services/careproviders/LeaveReview/DefaultView.aspx?id=1-1886216042,0,0,,
MF Care and Housing,1-13056911845,SCL,Suite 12A Kennedy House,Murray Road,,Orpington,,BR5 3QY,Tel: 07828189646,No ratings yet Rate it yourself - /Services/careproviders/LeaveReview/DefaultView.aspx?id=1-13056911845,0,0,,
Optimum Home Care Services Ltd,1-9550166889,SCL,"Suite 12, Kennedy House",Murray Road,,Orpington,,BR5 3QY,Tel: 07737509890,No ratings yet Rate it yourself - /Services/careproviders/LeaveReview/DefaultView.aspx?id=1-9550166889,0,0,,
Sunnyside Domicilliary Support Services Limited,1-210091055,SCL,7 Dunstonian Court,28a Station Square,,Orpington,,BR5 1NA,Tel: 01689638236,No ratings yet Rate it yourself - /Services/careproviders/LeaveReview/DefaultView.aspx?id=1-210091055,0,0,,
Rockdale House,1-119111676,SCL,Rockdale Lodge,Rockdale Road,,Sevenoaks,Kent,TN13 1JT,Tel: 01732454763,No ratings yet Rate it yourself - /Services/careproviders/LeaveReview/DefaultView.aspx?id=1-119111676,0,0,,
Abacus Homecare (Bromley) Ltd,1-1195626726,SCL,40 Larch Way,,,Bromley,Kent,BR2 8DU,Tel: 07442503520,No ratings yet Rate it yourself - /Services/careproviders/LeaveReview/DefaultView.aspx?id=1-1195626726,0,0,,
Caremax Ltd,1-6388358420,SCL,"Suite 21, The Beechwood Centre",40 Lower Gravel Road,,Bromley,,BR2 8GP,Tel: 03301330577,No ratings yet Rate it yourself - /Services/careproviders/LeaveReview/DefaultView.aspx?id=1-6388358420,0,0,,
Reliable Community Care Services Ltd,1-12771442086,SCL,Unit 20,"The Beechwood Centre, 40 Lower Gravel Road",,Bromley,,BR2 8GP,Tel: 07983860248,No ratings yet Rate it yourself - /Services/careproviders/LeaveReview/DefaultView.aspx?id=1-12771442086,0,0,,
Solving Homes Limited,1-12331943788,SCL,The Beechwood Centre,40 Lower Gravel Road,,Bromley,,BR2 8GP,Tel: 02037709382,No ratings yet Rate it yourself - /Services/careproviders/LeaveReview/DefaultView.aspx?id=1-12331943788,0,0,,
Esteem Supported Living Limited - Main Office,1-15982016374,SCL,1 Leechcroft Avenue,,,Swanley,,BR8 8AP,Tel: 02039621360,No ratings yet Rate it yourself - /Services/careproviders/LeaveReview/DefaultView.aspx?id=1-15982016374,0,0,,
Gravity Care Services Ltd,1-12292063139,SCL,11 Leechcroft Avenue,,,Swanley,,BR8 8AP,,No ratings yet Rate it yourself - /Services/careproviders/LeaveReview/DefaultView.aspx?id=1-12292063139,0,0,,
Weald Heights,1-3284932055,SCL,Bourchier Close,,,Sevenoaks,Kent,TN13 1PD,Tel: 03333218295,No ratings yet Rate it yourself - /Services/careproviders/LeaveReview/DefaultView.aspx?id=1-3284932055,0,0,,
Kippingtons Nursing Home,1-911979811,SCL,Grange Road,Oak Lane,,Sevenoaks,Kent,TN13 2PG,Tel: 01732451829,1 rating Rate it yourself - /Services/careproviders/LeaveReview/DefaultView.aspx?id=1-911979811,,,,
Birchwood Heights Care Home,1-13137147535,SCL,Hilda May Avenue,,,Swanley,,BR8 7BT,Tel: 01322947055,No ratings yet Rate it yourself - /Services/careproviders/LeaveReview/DefaultView.aspx?id=1-13137147535,0,0,,
Smithfield Health & Social Care Limited t/a Verilife,1-303534961,SCL,363 Southborough Lane,,,Bromley,Kent,BR2 8BQ,Tel: 02031419290,No ratings yet Rate it yourself - /Services/careproviders/LeaveReview/DefaultView.aspx?id=1-303534961,0,0,,
Westerham Place Residential Care Home,1-123868604,SCL,Westerham Place,Quebec Square,,Westerham,Kent,TN16 1TD,Tel: 01959565805,No ratings yet Rate it yourself - /Services/careproviders/LeaveReview/DefaultView.aspx?id=1-123868604,0,0,,
Right at Home (Bromley),1-3917553912,SCL,Bromley Business Centre,27 Hastings Road,,London,,BR2 8NA,Tel: 020 8150 6272,1 rating Rate it yourself - /Services/careproviders/LeaveReview/DefaultView.aspx?id=1-3917553912,,,,
SureCare Bromley Limited,1-4465650560,SCL,Bencewell Business Centre,Oakley Road,,Bromley,Kent,BR2 8HG,Tel: 02034091626,No ratings yet Rate it yourself - /Services/careproviders/LeaveReview/DefaultView.aspx?id=1-4465650560,0,0,,
Mackley Homecare Limited,1-117070190,SCL,Bencewell Business Centre,Oakley Road,,Bromley,Kent,BR2 8HG,Tel: 02038928700,No ratings yet Rate it yourself - /Services/careproviders/LeaveReview/DefaultView.aspx?id=1-117070190,0,0,,
Callquest For Care,1-5343520067,SCL,99 Millfield Road,West Kingsdown,,Sevenoaks,,TN15 6BX,Tel: 08002118500,No ratings yet Rate it yourself - /Services/careproviders/LeaveReview/DefaultView.aspx?id=1-5343520067,0,0,,
Baycroft Grays Farm Road,1-17708769692,SCL,Grays Farm Road,,,Orpington,,BR5 3AD,Tel: 01733571951,No ratings yet Rate it yourself - /Services/careproviders/LeaveReview/DefaultView.aspx?id=1-17708769692,0,0,,
Bromley,1-3915276101,SCL,27 Ruskin Walk,,,Bromley,Kent,BR2 8EP,,No ratings yet Rate it yourself - /Services/careproviders/LeaveReview/DefaultView.aspx?id=1-3915276101,0,0,,
Mears Care - Bromley,1-8026511168,SCL,Crown Meadow Court,23 Brosse Way,,Bromley,Kent,BR2 8FE,Tel: 02084621006,No ratings yet Rate it yourself - /Services/careproviders/LeaveReview/DefaultView.aspx?id=1-8026511168,0,0,,
Diversity Healthcare,1-4361682261,SCL,9 Archery Lane,,,Bromley,,BR2 9FQ,Tel: 02084986800,No ratings yet Rate it yourself - /Services/careproviders/LeaveReview/DefaultView.aspx?id=1-4361682261,0,0,,
Ashglade,1-127080331,SCL,178 Southborough Lane,,,Bromley,Kent,BR2 8AL,Tel: 02084670640,No ratings yet Rate it yourself - /Services/careproviders/LeaveReview/DefaultView.aspx?id=1-127080331,0,0,,
Creative Support - Regency Court,1-4116308774,SCL,14 Mackintosh Street,,,Bromley,Kent,BR2 9GL,Tel: 02084603142,No ratings yet Rate it yourself - /Services/careproviders/LeaveReview/DefaultView.aspx?id=1-4116308774,0,0,,
Manordene,1-601582788,SCL,Forge Lane,West Kingsdown,,Sevenoaks,Kent,TN15 6JD,Tel: 01474855519,1 rating Rate it yourself - /Services/careproviders/LeaveReview/DefaultView.aspx?id=1-601582788,,,,
Eglantine Villa Care Home,1-130120335,SCL,Eglantine Lane,Horton Kirby,,Dartford,Kent,DA4 9JL,Tel: 01322863019,No ratings yet Rate it yourself - /Services/careproviders/LeaveReview/DefaultView.aspx?id=1-130120335,0,0,,
Elmwood,1-128976502,SCL,42 Southborough Road,Bickley,,Bromley,Kent,BR1 2EN,Tel: 02082491904,No ratings yet Rate it yourself - /Services/careproviders/LeaveReview/DefaultView.aspx?id=1-128976502,0,0,,
Yourlife (Chislehurst),1-6468086698,SCL,Shepheards House,Manor Park Road,,Chislehurst,Kent,BR7 5FT,Tel: 02082951251,No ratings yet Rate it yourself - /Services/careproviders/LeaveReview/DefaultView.aspx?id=1-6468086698,0,0,,
Emerson Grange,1-5600613464,SCL,Emerson Park,"Rowhill Road, Hextable",,Swanley,Kent,BR8 7FP,Tel: 01233224040,1 rating Rate it yourself - /Services/careproviders/LeaveReview/DefaultView.aspx?id=1-5600613464,,,,
Bluebird Care Bromley,1-2246993108,SCL,,50c Chatterton Road,,Bromley,Kent,BR2 9QE,Tel: 02083150236,64 ratings Rate it yourself - /Services/careproviders/LeaveReview/DefaultView.aspx?id=1-2246993108,,,,
Antokol,1-110197479,SCL,45 Holbrook Lane,,,Chislehurst,Kent,BR7 6PE,Tel: 02084678102,2 ratings Rate it yourself - /Services/careproviders/LeaveReview/DefaultView.aspx?id=1-110197479,,,,
First Option Support Ltd,1-18378799289,SCL,4 Calvert Close,,,Sidcup,,DA14 5JL,,No ratings yet Rate it yourself - /Services/careproviders/LeaveReview/DefaultView.aspx?id=1-18378799289,0,0,,
Homefield,1-128976515,SCL,1 Lime Close,,,Bromley,,BR1 2EF,Tel: 02082897932,No ratings yet Rate it yourself - /Services/careproviders/LeaveReview/DefaultView.aspx?id=1-128976515,0,0,,
Queen Elizabeth House,1-121567230,SCL,38 Southborough Road,Bickley,,Bromley,Kent,BR1 2EE,Tel: 02084673994,No ratings yet Rate it yourself - /Services/careproviders/LeaveReview/DefaultView.aspx?id=1-121567230,0,0,,
Care Carers,1-7486285682,SCL,3 Warbank Crescent,New Addington,,Croydon,,CR0 0AY,Tel: 07956623937,No ratings yet Rate it yourself - /Services/careproviders/LeaveReview/DefaultView.aspx?id=1-7486285682,0,0,,
Avenues London (South),1-132159145,SCL,1 River House,Maidstone Road,,Sidcup,Kent,DA14 5TA,,No ratings yet Rate it yourself - /Services/careproviders/LeaveReview/DefaultView.aspx?id=1-132159145,0,0,,
KYN Bickley,1-14863445898,SCL,Bickley Park Road,,,Bromley,Kent,BR1 2AZ,Tel: 0205309700,No ratings yet Rate it yourself - /Services/careproviders/LeaveReview/DefaultView.aspx?id=1-14863445898,0,0,,
Beechmore Court,1-108969188,SCL,267 Southlands Road,,,Bromley,Kent,BR1 2EG,Tel: 02084687778,No ratings yet Rate it yourself - /Services/careproviders/LeaveReview/DefaultView.aspx?id=1-108969188,0,0,,
Enabled Health Limited,1-6411395638,SCL,"Biz Space, Unit 4, Addington Business Centre","Vulcan Way, New Addington",,Croydon,,CR0 9UG,Tel: 01689846216,No ratings yet Rate it yourself - /Services/careproviders/LeaveReview/DefaultView.aspx?id=1-6411395638,0,0,,
Melburay Ltd,1-8788300774,SCL,"Unit 2.5, Donna Alexandra Mews",Royal Parade,,Chislehurst,,BR7 6NR,Tel: 02037311088,No ratings yet Rate it yourself - /Services/careproviders/LeaveReview/DefaultView.aspx?id=1-8788300774,0,0,,
Prince George Duke of Kent Court,1-2600586559,SCL,Shepherds Green,,,Chislehurst,Kent,BR7 6PA,Tel: 02084670081,No ratings yet Rate it yourself - /Services/careproviders/LeaveReview/DefaultView.aspx?id=1-2600586559,0,0,,
Fairlight,1-9405286125,SCL,Bromley Lane,,,Chislehurst,,BR7 6LL,Tel: 02039171523,No ratings yet Rate it yourself - /Services/careproviders/LeaveReview/DefaultView.aspx?id=1-9405286125,0,0,,
Baugh House Care Centre,1-3618662661,SCL,19 Baugh Road,,,Sidcup,Kent,DA14 5ED,Tel: 02086201007,No ratings yet Rate it yourself - /Services/careproviders/LeaveReview/DefaultView.aspx?id=1-3618662661,0,0,,
Frognal House Care Home,1-15519796391,SCL,Frognal House,Frognal Avenue,,Sidcup,Kent,DA14 6LF,Tel: 02083026200,No ratings yet Rate it yourself - /Services/careproviders/LeaveReview/DefaultView.aspx?id=1-15519796391,0,0,,
Smyth Lodge,1-6024238392,SCL,2 Frognal Avenue,,,Sidcup,,DA14 6LF,Tel: 02080519190,No ratings yet Rate it yourself - /Services/careproviders/LeaveReview/DefaultView.aspx?id=1-6024238392,0,0,,
Frognal House Care Home,1-3876084699,SCL,Frognal House,Frognal Avenue,,Sidcup,Kent,DA14 6LF,Tel: 02083026200,2 ratings Rate it yourself - /Services/careproviders/LeaveReview/DefaultView.aspx?id=1-3876084699,,,,
Home Care & Support Limited,1-865267331,SCL,"First Floor Suite, St Luke's Hall",Raglan Road,,Bromley,,BR2 9NN,Tel: 02045417116,No ratings yet Rate it yourself - /Services/careproviders/LeaveReview/DefaultView.aspx?id=1-865267331,0,0,,
Cherry Blossom Community Care Ltd,1-13227498052,SCL,47 Windham Avenue,New Addington,,Croydon,,CR0 0HZ,Tel: 01689610505,No ratings yet Rate it yourself - /Services/careproviders/LeaveReview/DefaultView.aspx?id=1-13227498052,0,0,,
"Home Instead - Bromley, Chislehurst & Orpington",1-3108169754,SCL,76 Croydon Road,Coney Hall Village,,West Wickham,,BR4 9HY,Tel: 02086582535,No ratings yet Rate it yourself - /Services/careproviders/LeaveReview/DefaultView.aspx?id=1-3108169754,0,0,,
Fallowfield,1-119778726,SCL,Ashfield Lane,,,Chislehurst,Kent,BR7 6LQ,Tel: 02084672781,No ratings yet Rate it yourself - /Services/careproviders/LeaveReview/DefaultView.aspx?id=1-119778726,0,0,,
Toptee Healthcare Services Limited,1-18711632713,SCL,28 Bromley Common,,,Bromley,,BR2 9PD,Tel: 07939343813,No ratings yet Rate it yourself - /Services/careproviders/LeaveReview/DefaultView.aspx?id=1-18711632713,0,0,,
Addington Heights,1-259940364,SCL,1 Milne Park West,New Addington,,Croydon,,CR0 0DN,Tel: 03333218261,No ratings yet Rate it yourself - /Services/careproviders/LeaveReview/DefaultView.aspx?id=1-259940364,0,0,,
St Edwards Close,1-134620892,SCL,6 St Edwards Close,New Addington,,Croydon,Surrey,CR0 0EL,Tel: 01689800960,No ratings yet Rate it yourself - /Services/careproviders/LeaveReview/DefaultView.aspx?id=1-134620892,0,0,,
Queens Court,1-14390315792,SCL,21 Bickley Road,,,Bromley,Kent,BR1 2ND,Tel: 02084687440,No ratings yet Rate it yourself - /Services/careproviders/LeaveReview/DefaultView.aspx?id=1-14390315792,0,0,,
Opal Carers Ltd,1-9791482096,SCL,40 Thorpe Close,New Addington,,Croydon,,CR0 0SG,Tel: 07914020327,No ratings yet Rate it yourself - /Services/careproviders/LeaveReview/DefaultView.aspx?id=1-9791482096,0,0,,
Homesdale Supported Living,1-11296003795,SCL,30 Homesdale Road,,,Bromley,,BR2 9LD,Tel: 02082492902,No ratings yet Rate it yourself - /Services/careproviders/LeaveReview/DefaultView.aspx?id=1-11296003795,0,0,,
Voug Care,1-14808116929,SCL,40,Homesdale Road,,Bromley,,BR2 9LD,Tel: 02084607468,No ratings yet Rate it yourself - /Services/careproviders/LeaveReview/DefaultView.aspx?id=1-14808116929,0,0,,
Coloma Court Care Home,1-112968840,SCL,Layhams Road,,,West Wickham,Kent,BR4 9QJ,Tel: 02087761129,No ratings yet Rate it yourself - /Services/careproviders/LeaveReview/DefaultView.aspx?id=1-112968840,0,0,,
Frylands Court,1-8048221703,SCL,24 Hutchingsons Road,New Addington,,Croydon,,CR0 0BD,Tel: 07436032599,No ratings yet Rate it yourself - /Services/careproviders/LeaveReview/DefaultView.aspx?id=1-8048221703,0,0,,
Willett House,1-128976488,SCL,10 Kemnal Road,,,Chislehurst,Kent,BR7 6LT,Tel: 02084028224,No ratings yet Rate it yourself - /Services/careproviders/LeaveReview/DefaultView.aspx?id=1-128976488,0,0,,
Chislehurst Healthcare Ltd,1-11188426198,SCL,39 High Street,,,Chislehurst,,BR7 5AE,Tel: 08006894171,No ratings yet Rate it yourself - /Services/careproviders/LeaveReview/DefaultView.aspx?id=1-11188426198,0,0,,
The Drive,1-114664194,SCL,17 The Drive,,,Sidcup,Kent,DA14 4ER,Tel: 02083090440,No ratings yet Rate it yourself - /Services/careproviders/LeaveReview/DefaultView.aspx?id=1-114664194,0,0,,
Always Caring Bromley Limited,1-266779859,SCL,14 Letchworth Drive,,,Bromley,Kent,BR2 9BE,Tel: 02084666133,No ratings yet Rate it yourself - /Services/careproviders/LeaveReview/DefaultView.aspx?id=1-266779859,0,0,,