Organisation Name,NACS Code,Organisation Type,Address1,Address2,Address3,Address4,Address5,PostCode,Telephone Number,NHS.UK users rating,Value  (NHS.UK users rating),Banding Classification  (NHS.UK users rating),Car parking (Is there car parking at this organisation?),Disabled access (Disabled access)
Avenues Healthcare Ltd,1-12363025954,SCL,31 Finbracks,,,Stevenage,,SG1 6HB,Tel: 07555775206,No ratings yet Rate it yourself - /Services/careproviders/LeaveReview/DefaultView.aspx?id=1-12363025954,0,0,,
Stevenage,1-11295712832,SCL,27 Brimstone Drive,,,Stevenage,,SG1 4FX,Tel: 07919382837,No ratings yet Rate it yourself - /Services/careproviders/LeaveReview/DefaultView.aspx?id=1-11295712832,0,0,,
GJU Services Limited,1-9828547712,SCL,79 Sefton Road,,,Stevenage,,SG1 5RL,Tel: 02080902741,No ratings yet Rate it yourself - /Services/careproviders/LeaveReview/DefaultView.aspx?id=1-9828547712,0,0,,
Lily Healthcare & Supported Living Limited,1-14567398596,SCL,55 Manchester Close,,,Stevenage,,SG1 4TQ,Tel: 07713912907,No ratings yet Rate it yourself - /Services/careproviders/LeaveReview/DefaultView.aspx?id=1-14567398596,0,0,,
Lannock Manor Mental Health Ltd,1-2432492683,SCL,Lannock Manor,Hitchin Road,,Hitchin,Hertfordshire,SG4 7EE,Tel: 01462 790850,No ratings yet Rate it yourself - /Services/careproviders/LeaveReview/DefaultView.aspx?id=1-2432492683,0,0,,
Martins House,1-3616995796,SCL,Jessop Road,Pin Green,,Stevenage,Hertfordshire,SG1 5LL,Tel: 01438 351056,No ratings yet Rate it yourself - /Services/careproviders/LeaveReview/DefaultView.aspx?id=1-3616995796,0,0,,
Wisden Court,1-131482054,SCL,Wisden Road,,,Stevenage,Hertfordshire,SG1 5JD,Tel: 01438354933,No ratings yet Rate it yourself - /Services/careproviders/LeaveReview/DefaultView.aspx?id=1-131482054,0,0,,
Halcyon Days,1-3616698021,SCL,The Old Rectory,Church Lane,,Hitchin,Hertfordshire,SG4 7LU,Tel: 01438 315588,No ratings yet Rate it yourself - /Services/careproviders/LeaveReview/DefaultView.aspx?id=1-3616698021,0,0,,
Jubilee Court,1-436913248,SCL,Hayward Close,Lonsdale Road,,Stevenage,Hertfordshire,SG1 5BS,Tel: 01438730000,No ratings yet Rate it yourself - /Services/careproviders/LeaveReview/DefaultView.aspx?id=1-436913248,0,0,,
Pinelodge Care Home,1-200144942,SCL,Graveley Road,,,Stevenage,Hertfordshire,SG1 4YS,Tel: 01438721417,3 ratings Rate it yourself - /Services/careproviders/LeaveReview/DefaultView.aspx?id=1-200144942,,,,
Care Fully Limited,1-2276468236,SCL,11 Broadview,,,Stevenage,Hertfordshire,SG1 3TT,Tel: 01438722665,No ratings yet Rate it yourself - /Services/careproviders/LeaveReview/DefaultView.aspx?id=1-2276468236,0,0,,
Eagles Wings24 Care,1-19060267389,SCL,47 Furzedown,,,Stevenage,,SG2 9EL,Tel: 07711810441,No ratings yet Rate it yourself - /Services/careproviders/LeaveReview/DefaultView.aspx?id=1-19060267389,0,0,,
Providence Court,1-118542149,SCL,Providence Way,,,Baldock,Hertfordshire,SG7 6TT,Tel: 01462490870,No ratings yet Rate it yourself - /Services/careproviders/LeaveReview/DefaultView.aspx?id=1-118542149,0,0,,
Woodlands View Care Home,1-3154638209,SCL,Magpie Crescent,,,Stevenage,Hertfordshire,SG2 9RZ,Tel: 01438740230,No ratings yet Rate it yourself - /Services/careproviders/LeaveReview/DefaultView.aspx?id=1-3154638209,0,0,,
Garden City Court,1-2238558165,SCL,Whiteway,,,Letchworth Garden City,Hertfordshire,SG6 2PP,Tel: 01462473100,No ratings yet Rate it yourself - /Services/careproviders/LeaveReview/DefaultView.aspx?id=1-2238558165,0,0,,
Walkern Lodge,1-4053879325,SCL,14A Walkern Road,,,Stevenage,Hertfordshire,SG1 3QX,Tel: 01438749301,No ratings yet Rate it yourself - /Services/careproviders/LeaveReview/DefaultView.aspx?id=1-4053879325,0,0,,
SENSE Jenny Chapman House,1-120444864,SCL,167 Shephall View,,,Stevenage,Hertfordshire,SG1 1RR,Tel: 01438749013,No ratings yet Rate it yourself - /Services/careproviders/LeaveReview/DefaultView.aspx?id=1-120444864,0,0,,
Joy Caring Services Limited,1-2057631160,SCL,"Suite B, Mindenhall Court","R/017 High Street, Old Town",,Stevenage,Hertfordshire,SG1 3BG,Tel: 01438311704,1 rating Rate it yourself - /Services/careproviders/LeaveReview/DefaultView.aspx?id=1-2057631160,,,,
ICRIT Healthcare Limited (Herts),1-15102913711,SCL,"Office 9, Units 11 -12,","Baldock Industrial Estate, London Road",,Baldock,,SG7 6NG,Tel: 07943739379,No ratings yet Rate it yourself - /Services/careproviders/LeaveReview/DefaultView.aspx?id=1-15102913711,0,0,,
Julians House,1-1080115563,SCL,6 Julians Road,,,Stevenage,Hertfordshire,SG1 3ES,Tel: 01438751366,No ratings yet Rate it yourself - /Services/careproviders/LeaveReview/DefaultView.aspx?id=1-1080115563,0,0,,
Baldock - The Rowans,1-10042502639,SCL,2 The Rowans,,,Baldock,,SG7 6HJ,Tel: 01462490634,No ratings yet Rate it yourself - /Services/careproviders/LeaveReview/DefaultView.aspx?id=1-10042502639,0,0,,
Knightingles Healthcare Limited,1-4606227581,SCL,2a,Letchmore Road,,Stevenage,,SG1 3HU,Tel: 07717064436,No ratings yet Rate it yourself - /Services/careproviders/LeaveReview/DefaultView.aspx?id=1-4606227581,0,0,,
Osbourne Court,1-16524203997,SCL,Park Drive,,,Baldock,Hertfordshire,SG7 6EN,Tel: 01462896966,No ratings yet Rate it yourself - /Services/careproviders/LeaveReview/DefaultView.aspx?id=1-16524203997,0,0,,
Agincare UK - Fred Millard Court,1-14576359372,SCL,"Fred Millard Court, Cuttys Lane",,,Stevenage,,SG1 1UQ,Tel: 07458111802,No ratings yet Rate it yourself - /Services/careproviders/LeaveReview/DefaultView.aspx?id=1-14576359372,0,0,,
Three Little Angels Ltd,1-13485732346,SCL,61 Roundmead,,,Stevenage,,SG2 9PQ,Tel: 07497628122,No ratings yet Rate it yourself - /Services/careproviders/LeaveReview/DefaultView.aspx?id=1-13485732346,0,0,,
Vincent Place,1-9140100470,SCL,Flat 42 Vincent Place,42 Townsend Mews,,Stevenage,,SG1 3AT,Tel: 01438729845,No ratings yet Rate it yourself - /Services/careproviders/LeaveReview/DefaultView.aspx?id=1-9140100470,0,0,,
Serve Homecare,1-9182754117,SCL,The Old Bank,162 High Street,,Stevenage,,SG1 3LL,Tel: 01438576789,No ratings yet Rate it yourself - /Services/careproviders/LeaveReview/DefaultView.aspx?id=1-9182754117,0,0,,
Guysfield Residential Home,1-128579475,SCL,Willian Road,Willian,,Letchworth Garden City,Hertfordshire,SG6 2AB,Tel: 080 8223 5509,No ratings yet Rate it yourself - /Services/careproviders/LeaveReview/DefaultView.aspx?id=1-128579475,0,0,,
Home Instead Senior Care (Stevenage & North Herts),1-2371987179,SCL,Venture House,Fifth Avenue,,Letchworth Garden City,Hertfordshire,SG6 2HW,Tel: 01462 600462,No ratings yet Rate it yourself - /Services/careproviders/LeaveReview/DefaultView.aspx?id=1-2371987179,0,0,,
Bluebird Care (Stevenage & North Herts),1-2929389277,SCL,"Venture House, Office 6",Fifth Avenue,,Letchworth Garden City,Hertfordshire,SG6 2HW,Tel: 01462676555,No ratings yet Rate it yourself - /Services/careproviders/LeaveReview/DefaultView.aspx?id=1-2929389277,0,0,,
Wymondley Nursing & Residential Care Home,1-110500111,SCL,Stevenage Road,Little Wymondley,,Hitchin,Hertfordshire,SG4 7HT,Tel: 01438312434,No ratings yet Rate it yourself - /Services/careproviders/LeaveReview/DefaultView.aspx?id=1-110500111,0,0,,
Destiny Support Care,1-4335364871,SCL,Quadrant Lodge,The Quadrant,,Stevenage,Hertfordshire,SG1 1ER,Tel: 01438488110,1 rating Rate it yourself - /Services/careproviders/LeaveReview/DefaultView.aspx?id=1-4335364871,,,,
Burleigh House Residential Home,1-125098165,SCL,Burleigh House,41 Letchworth Road,,Baldock,Hertfordshire,SG7 6AA,Tel: 01462 893216,No ratings yet Rate it yourself - /Services/careproviders/LeaveReview/DefaultView.aspx?id=1-125098165,0,0,,
Look Ahead Domiciliary Care (Hertfordshire),1-294441934,SCL,Oak View,64-66 Hydean Way,,Stevenage,Hertfordshire,SG2 9XL,Tel: 01438740096,No ratings yet Rate it yourself - /Services/careproviders/LeaveReview/DefaultView.aspx?id=1-294441934,0,0,,
The White House Care Home,1-14239622698,SCL,Gillison Close,,,Letchworth Garden City,Hertfordshire,SG6 1QL,Tel: 01462533777,No ratings yet Rate it yourself - /Services/careproviders/LeaveReview/DefaultView.aspx?id=1-14239622698,0,0,,
Scarborough House,1-145991950,SCL,395 Scarborough Avenue,,,Stevenage,Hertfordshire,SG1 2QA,Tel: 01438361196,No ratings yet Rate it yourself - /Services/careproviders/LeaveReview/DefaultView.aspx?id=1-145991950,0,0,,
Exclusive Care Ltd,1-6510507259,SCL,"Suite F, 15 Royston Road",,,Baldock,,SG7 6NW,Tel: 01438310108,No ratings yet Rate it yourself - /Services/careproviders/LeaveReview/DefaultView.aspx?id=1-6510507259,0,0,,
Holistic Healthcare Hertfordshire,1-18949308982,SCL,608 Jubilee Trading Estate,Jubilee Road,,Letchworth Garden City,,SG6 1NE,Tel: 07838702816,No ratings yet Rate it yourself - /Services/careproviders/LeaveReview/DefaultView.aspx?id=1-18949308982,0,0,,
Hales Group Limited - Letchworth,1-1209416896,SCL,608 Jubilee Trading Estate,"Jubilee Road, Letchworth",,Letchworth Garden City,,SG6 1NE,Tel: 01438765715,No ratings yet Rate it yourself - /Services/careproviders/LeaveReview/DefaultView.aspx?id=1-1209416896,0,0,,
DX Caring Services,1-9676435907,SCL,"608 Jubilee Trading Estate, Jubilee Road",,,Letchworth Garden City,,SG6 1NE,Tel: 01462677770,No ratings yet Rate it yourself - /Services/careproviders/LeaveReview/DefaultView.aspx?id=1-9676435907,0,0,,
YourLife (Baldock),1-17974116889,SCL,Norton Place,74 Icknield Way,,Baldock,,SG7 5AN,,No ratings yet Rate it yourself - /Services/careproviders/LeaveReview/DefaultView.aspx?id=1-17974116889,0,0,,
Alina Homecare Stevenage,1-115230109,SCL,6a Meadway Court,Rutherford Close,,Stevenage,Hertfordshire,SG1 2EF,Tel: 01438 904059,No ratings yet Rate it yourself - /Services/careproviders/LeaveReview/DefaultView.aspx?id=1-115230109,0,0,,
Partners in Support,1-455374011,SCL,11 Meadway Court,Rutherford Close,,Stevenage,Hertfordshire,SG1 2EF,Tel: 01438746243,No ratings yet Rate it yourself - /Services/careproviders/LeaveReview/DefaultView.aspx?id=1-455374011,0,0,,
Alina Homecare Specialist Care - Hertfordshire,1-5842997881,SCL,"6a Meadway Court,",Rutherford Close,,Stevenage,,SG1 2EF,Tel: 01707443933,No ratings yet Rate it yourself - /Services/careproviders/LeaveReview/DefaultView.aspx?id=1-5842997881,0,0,,
Subtle Healthcare Limited,1-17584931465,SCL,"Suite 232, Kings Court",London Road,,Stevenage,,SG1 2NG,Tel: 07404705080,No ratings yet Rate it yourself - /Services/careproviders/LeaveReview/DefaultView.aspx?id=1-17584931465,0,0,,
Brimchalk Healthcare Ltd,1-15070453304,SCL,Kings Court,London Road,,Stevenage,,SG1 2NG,Tel: 07834895009,No ratings yet Rate it yourself - /Services/careproviders/LeaveReview/DefaultView.aspx?id=1-15070453304,0,0,,
Taks Healthcare Services,1-10687707953,SCL,Kings Court Business Centre,London Road,,Stevenage,,SG1 2NG,Tel: 01438964439,No ratings yet Rate it yourself - /Services/careproviders/LeaveReview/DefaultView.aspx?id=1-10687707953,0,0,,
Options Health Care Services,1-2047021873,SCL,241 Kings Court,London Road,,Stevenage,,SG1 2NG,Tel: 01438314840,No ratings yet Rate it yourself - /Services/careproviders/LeaveReview/DefaultView.aspx?id=1-2047021873,0,0,,
Stevenage,1-6548524060,SCL,Kings Court,London Road,,Stevenage,,SG1 2NG,Tel: 01438 878 742,No ratings yet Rate it yourself - /Services/careproviders/LeaveReview/DefaultView.aspx?id=1-6548524060,0,0,,
Manor View,1-15659136862,SCL,45 Manor View,,,Stevenage,Hertfordshire,SG2 8PF,Tel: 07988810861,No ratings yet Rate it yourself - /Services/careproviders/LeaveReview/DefaultView.aspx?id=1-15659136862,0,0,,
The Doting Carers Ltd,1-12154814465,SCL,Devonshire Business Centre,Works Road,,Letchworth Garden City,Hertfordshire,SG6 1GJ,Tel: 01462488215,1 rating Rate it yourself - /Services/careproviders/LeaveReview/DefaultView.aspx?id=1-12154814465,,,,
Hand in Hands,1-1724411627,SCL,"Unit 5, Devonshire Business Centre",Works Road,,Letchworth,Hertfordshire,SG6 1GJ,Tel: 01462222400,No ratings yet Rate it yourself - /Services/careproviders/LeaveReview/DefaultView.aspx?id=1-1724411627,0,0,,
Abacus Care & Support,1-8809577412,SCL,"Head Office, Devonshire Business Centre",Works Road,,Letchworth Garden City,,SG6 1GJ,Tel: 02071001680,No ratings yet Rate it yourself - /Services/careproviders/LeaveReview/DefaultView.aspx?id=1-8809577412,0,0,,
Multi-Care Community Services North Hertfordshire Ltd,1-12586250040,SCL,Devonshire Business Centre,Works Road,,Letchworth Garden City,Hertfordshire,SG6 1GJ,Tel: 01462488225,No ratings yet Rate it yourself - /Services/careproviders/LeaveReview/DefaultView.aspx?id=1-12586250040,0,0,,
Compassion PLUS Healthcare,1-5937564351,SCL,Devonshire Business Centre,Works Road,,Letchworth Garden City,Hertfordshire,SG6 1GJ,Tel: 01462416101,No ratings yet Rate it yourself - /Services/careproviders/LeaveReview/DefaultView.aspx?id=1-5937564351,0,0,,
Caremark (North Herts & Stevenage),1-708980096,SCL,A(2) Arden Press House,Arden Press Way,,Letchworth Garden City,Hertfordshire,SG6 1LH,Tel: 01462708714,No ratings yet Rate it yourself - /Services/careproviders/LeaveReview/DefaultView.aspx?id=1-708980096,0,0,,
Greenleaves Homecare Services Limited,1-7880997150,SCL,"Business & Technology Centre, Office G31",Bessemer Drive,,Stevenage,,SG1 2DX,Tel: 01438310068,No ratings yet Rate it yourself - /Services/careproviders/LeaveReview/DefaultView.aspx?id=1-7880997150,0,0,,
SureCare North Herts & Stevenage,1-12719491113,SCL,Business & Technology Centre,Bessemer Drive,,Stevenage,Hertfordshire,SG1 2DX,Tel: 01438587268,No ratings yet Rate it yourself - /Services/careproviders/LeaveReview/DefaultView.aspx?id=1-12719491113,0,0,,
Elixonn Healthcare Ltd,1-17077800815,SCL,Bessemer Drive,,,Stevenage,,SG1 2DX,,No ratings yet Rate it yourself - /Services/careproviders/LeaveReview/DefaultView.aspx?id=1-17077800815,0,0,,
Lead Care Services Limited,1-3727275725,SCL,Business & Technology Centre,Bessemer Drive,,Stevenage,Hertfordshire,SG1 2DX,Tel: 01438419888,No ratings yet Rate it yourself - /Services/careproviders/LeaveReview/DefaultView.aspx?id=1-3727275725,0,0,,
Head office,1-3006365797,SCL,Business And Technology Centre,Bessemer Drive,,Stevenage,Hertfordshire,SG1 2DX,Tel: 01438537444,No ratings yet Rate it yourself - /Services/careproviders/LeaveReview/DefaultView.aspx?id=1-3006365797,0,0,,
New Hope Community Healthcare,1-6715233778,SCL,Business & Technology Centre,Bessemer Drive,,Stevenage,Hertfordshire,SG1 2DX,Tel: 01438310000,No ratings yet Rate it yourself - /Services/careproviders/LeaveReview/DefaultView.aspx?id=1-6715233778,0,0,,
Remiz Care & Recruitment Services Ltd,1-18844588296,SCL,"Unit G49, Business & Technology Centre",Bessemer Drive,,Stevenage,,SG1 2DX,Tel: 07807887351,No ratings yet Rate it yourself - /Services/careproviders/LeaveReview/DefaultView.aspx?id=1-18844588296,0,0,,
Hertfordshire and Bedfordshire Domiciliary Care Services,1-17127798225,SCL,Business & Technology Centre,Bessemer Drive,,Stevenage,Hertfordshire,SG1 2DX,Tel: 07947560421,No ratings yet Rate it yourself - /Services/careproviders/LeaveReview/DefaultView.aspx?id=1-17127798225,0,0,,
Real Care Solutions,1-2718368680,SCL,Business & Technology Centre,Bessemer Drive,,Stevenage,Hertfordshire,SG1 2DX,Tel: 07942930800,No ratings yet Rate it yourself - /Services/careproviders/LeaveReview/DefaultView.aspx?id=1-2718368680,0,0,,
Maiden Care Services Limited,1-2622450479,SCL,Business And Technology Centre,Bessemer Drive,,Stevenage,Hertfordshire,SG1 2DX,Tel: 01438310034,No ratings yet Rate it yourself - /Services/careproviders/LeaveReview/DefaultView.aspx?id=1-2622450479,0,0,,
Heriitage Care Ltd,1-9514312389,SCL,Business & Technology Centre,Bessemer Drive,,Stevenage,Hertfordshire,SG1 2DX,Tel: 01438310186,No ratings yet Rate it yourself - /Services/careproviders/LeaveReview/DefaultView.aspx?id=1-9514312389,0,0,,
Blossom Healthcare Solutions Hertfordshire Limited,1-10565393746,SCL,Business & Technology Centre,Bessemer Drive,,Stevenage,Hertfordshire,SG1 2DX,Tel: 07903206719,No ratings yet Rate it yourself - /Services/careproviders/LeaveReview/DefaultView.aspx?id=1-10565393746,0,0,,
Turning Point Hertfordshire MH Carers Support,1-16056464746,SCL,SO8 Business & Technology Centre,Bessemer Drive,,Stevenage,,SG1 2DX,Tel: 01438211185,No ratings yet Rate it yourself - /Services/careproviders/LeaveReview/DefaultView.aspx?id=1-16056464746,0,0,,
Hertfordshire Domiciliary Care Agency,1-1434679286,SCL,Business & Technology Centre,Bessemer Drive,,Stevenage,Hertfordshire,SG1 2DX,Tel: 01438310083,No ratings yet Rate it yourself - /Services/careproviders/LeaveReview/DefaultView.aspx?id=1-1434679286,0,0,,
"Right at Home Stevenage, Letchworth & Hitchin",1-15273551505,SCL,Business & Technology Centre,Bessemer Drive,,Stevenage,Hertfordshire,SG1 2DX,Tel: 01462559159,No ratings yet Rate it yourself - /Services/careproviders/LeaveReview/DefaultView.aspx?id=1-15273551505,0,0,,
Domiciliary Care Service,1-145992032,SCL,SFAR008 Farnham House,6 Hills Way,,Stevenage,Hertfordshire,SG1 2FQ,Tel: 01438843575,No ratings yet Rate it yourself - /Services/careproviders/LeaveReview/DefaultView.aspx?id=1-145992032,0,0,,
St Catherine's Nursing Home,1-115044576,SCL,Spring Road,,,Letchworth Garden City,Hertfordshire,SG6 3PR,Tel: 01462 678888,No ratings yet Rate it yourself - /Services/careproviders/LeaveReview/DefaultView.aspx?id=1-115044576,0,0,,
London Paramount Care Community Support,1-15162596998,SCL,"Second Floor, 3 and 4 Viewpoint Office Village","Hyatt Trading Estate, Babbage Road",,Stevenage,,SG1 2EQ,Tel: 07988810861,No ratings yet Rate it yourself - /Services/careproviders/LeaveReview/DefaultView.aspx?id=1-15162596998,0,0,,
Fortis Care Hertfordshire,1-5234926702,SCL,"Fortis Care, Caxton Point",Caxton Way,,Stevenage,,SG1 2XU,Tel: 01438487270,3 ratings Rate it yourself - /Services/careproviders/LeaveReview/DefaultView.aspx?id=1-5234926702,,,,
Priority Plus Care Ltd,1-18687969493,SCL,13 Caxton Point Business Centre,Caxton Way,,Stevenage,,SG1 2XU,Tel: 01438553105,No ratings yet Rate it yourself - /Services/careproviders/LeaveReview/DefaultView.aspx?id=1-18687969493,0,0,,
Devoted Home Care Services,1-18721398365,SCL,Unit 22,Caxton Way,,Stevenage,,SG1 2XU,Tel: 07830703176,No ratings yet Rate it yourself - /Services/careproviders/LeaveReview/DefaultView.aspx?id=1-18721398365,0,0,,
Connections Healthcare Ltd,1-11774881590,SCL,4b Caxton Point,Caxton Way,,Stevenage,,SG1 2XU,,No ratings yet Rate it yourself - /Services/careproviders/LeaveReview/DefaultView.aspx?id=1-11774881590,0,0,,
Bridgecare Solutions Ltd,1-12105644620,SCL,Caxton Point Business Centre,Caxton Way,,Stevenage,,SG1 2XU,,No ratings yet Rate it yourself - /Services/careproviders/LeaveReview/DefaultView.aspx?id=1-12105644620,0,0,,
Devoted Supported Living - Main Office,1-12636867005,SCL,"37, Caxton Point",Caxton Way,,Stevenage,,SG1 2XU,Tel: 01438900376,No ratings yet Rate it yourself - /Services/careproviders/LeaveReview/DefaultView.aspx?id=1-12636867005,0,0,,
Sandton Healthcare Limited,1-12637866785,SCL,Unit 41 Caxton Point,Caxton Way,,Stevenage,,SG1 2XU,Tel: 07983615783,No ratings yet Rate it yourself - /Services/careproviders/LeaveReview/DefaultView.aspx?id=1-12637866785,0,0,,
Rainbow Care Solutions (Hertfordshire),1-10563621162,SCL,Suite 30 Caxton Point Business Centre,Caxton Way,,Stevenage,,SG1 2XU,Tel: 01438419490,No ratings yet Rate it yourself - /Services/careproviders/LeaveReview/DefaultView.aspx?id=1-10563621162,0,0,,
Helping Hands Letchworth,1-6903991121,SCL,9,Leys Avenue,,Letchworth Garden City,,SG6 3EA,Tel: 01462530924,No ratings yet Rate it yourself - /Services/careproviders/LeaveReview/DefaultView.aspx?id=1-6903991121,0,0,,
Trembaths,1-117976837,SCL,Talbot Way,,,Letchworth Garden City,Hertfordshire,SG6 1UA,Tel: 01462481694,No ratings yet Rate it yourself - /Services/careproviders/LeaveReview/DefaultView.aspx?id=1-117976837,0,0,,
Living Well Homecare,1-7979304012,SCL,"1st Floor, Unit 8, Arlington Court","Arlington Business Park, Whittle Way",,Stevenage,,SG1 2FS,Tel: 01438300360,No ratings yet Rate it yourself - /Services/careproviders/LeaveReview/DefaultView.aspx?id=1-7979304012,0,0,,
Helpers Homecare Limited,1-497770846,SCL,"Offices 5-8, Lok’n’Store",Whittle Way,,Stevenage,,SG1 2GX,Tel: 01462896853,No ratings yet Rate it yourself - /Services/careproviders/LeaveReview/DefaultView.aspx?id=1-497770846,0,0,,
Roebuck Nursing Home,1-110192736,SCL,London Road,,,Stevenage,Hertfordshire,SG2 8DS,Tel: 01438 740234,1 rating Rate it yourself - /Services/careproviders/LeaveReview/DefaultView.aspx?id=1-110192736,,,,
Winnett Cottage,1-115998344,SCL,111 Hertford Road,,,Stevenage,Hertfordshire,SG2 8SH,Tel: 01438813915,No ratings yet Rate it yourself - /Services/careproviders/LeaveReview/DefaultView.aspx?id=1-115998344,0,0,,
Benslow Nursing Home,1-108391794,SCL,Benslow Rise,,,Hitchin,Hertfordshire,SG4 9QY,Tel: 01462459773,No ratings yet Rate it yourself - /Services/careproviders/LeaveReview/DefaultView.aspx?id=1-108391794,0,0,,
Libury Hall,1-1114048863,SCL,Great Munden,,,Ware,Hertfordshire,SG11 1JD,Tel: 01920438224,No ratings yet Rate it yourself - /Services/careproviders/LeaveReview/DefaultView.aspx?id=1-1114048863,0,0,,
LSR Care Recruitment Ltd,1-15886145809,SCL,"Suite 1, Second Floor, Alexander House",40A Wilbury Way,,Hitchin,,SG4 0AP,Tel: 01462337112,No ratings yet Rate it yourself - /Services/careproviders/LeaveReview/DefaultView.aspx?id=1-15886145809,0,0,,
Buntingford,1-1829473970,SCL,62 Vicarage Road,,,Buntingford,Hertfordshire,SG9 9BA,Tel: 01763273191,No ratings yet Rate it yourself - /Services/careproviders/LeaveReview/DefaultView.aspx?id=1-1829473970,0,0,,
Ashwood Place,1-133436119,SCL,Sunnyside Close,,,Hitchin,Hertfordshire,SG4 9JG,,No ratings yet Rate it yourself - /Services/careproviders/LeaveReview/DefaultView.aspx?id=1-133436119,0,0,,
Highbury Rise,1-108422511,SCL,6 Highbury Road,,,Hitchin,Hertfordshire,SG4 9RW,Tel: 01462437495,No ratings yet Rate it yourself - /Services/careproviders/LeaveReview/DefaultView.aspx?id=1-108422511,0,0,,
Domcare24 Ltd,1-14716040826,SCL,"Suite 7, 34-35  Wilbury Way,",Intech House,,Hitchin,,SG4 0TP,,No ratings yet Rate it yourself - /Services/careproviders/LeaveReview/DefaultView.aspx?id=1-14716040826,0,0,,
Care 4 You Direct Limited,1-11092209660,SCL,"Wicked House, Office 2",56 Wilbury Way,,Hitchin,,SG4 0TP,Tel: 01462539497,No ratings yet Rate it yourself - /Services/careproviders/LeaveReview/DefaultView.aspx?id=1-11092209660,0,0,,
Laniwyn Care Services Ltd (Homecare),1-4389856886,SCL,54 Wilbury Way,,,Hitchin,Hertfordshire,SG4 0TP,Tel: 074 9626 5471,No ratings yet Rate it yourself - /Services/careproviders/LeaveReview/DefaultView.aspx?id=1-4389856886,0,0,,
Crossroads Care Hertfordshire North,1-140103335,SCL,"Suite 5, Intech House",Wilbury Way,,Hitchin,Hertfordshire,SG4 0TW,Tel: 01462 455578,No ratings yet Rate it yourself - /Services/careproviders/LeaveReview/DefaultView.aspx?id=1-140103335,0,0,,
Empress Social Care,1-9293460558,SCL,"Intech House, Suite 3B",Wilbury Way,,Hitchin,,SG4 0TW,Tel: 08000096432,No ratings yet Rate it yourself - /Services/careproviders/LeaveReview/DefaultView.aspx?id=1-9293460558,0,0,,
Sloe Hill Residential Home,1-14224596855,SCL,Mill Lane,St. Ippolyts,,Hitchin,,SG4 7NN,Tel: 01462439040,No ratings yet Rate it yourself - /Services/careproviders/LeaveReview/DefaultView.aspx?id=1-14224596855,0,0,,
17 Walsworth Road,1-129460371,SCL,Hitchin,,,Hitchin,Hertfordshire,SG4 9SP,Tel: 01462420019,No ratings yet Rate it yourself - /Services/careproviders/LeaveReview/DefaultView.aspx?id=1-129460371,0,0,,
YourLife (Knebworth),1-9375977559,SCL,Lowe House,London Raod,,Knebworth,,SG3 6EU,Tel: 01202362305,No ratings yet Rate it yourself - /Services/careproviders/LeaveReview/DefaultView.aspx?id=1-9375977559,0,0,,
Lead Care,1-3878200753,SCL,"10 A, B Knowl Piece Business Centre",Wilbury Way,,Hitchin,,SG4 0TY,Tel: 01462453332,1 rating Rate it yourself - /Services/careproviders/LeaveReview/DefaultView.aspx?id=1-3878200753,,,,