Organisation Name,NACS Code,Organisation Type,Address1,Address2,Address3,Address4,Address5,PostCode,Telephone Number,NHS.UK users rating,Value  (NHS.UK users rating),Banding Classification  (NHS.UK users rating),Car parking (Is there car parking at this organisation?),Disabled access (Disabled access)
Aldam House and Cottage,1-2620326276,SCL,Gordon Street,,,Goole,,DN14 6SQ,Tel: 01405720962,No ratings yet Rate it yourself - /Services/careproviders/LeaveReview/DefaultView.aspx?id=1-2620326276,0,0,,
Bailey House,1-481089446,SCL,6 Jefferson Street,,,Goole,Yorkshire(West Riding),DN14 6SH,Tel: 01405766985,No ratings yet Rate it yourself - /Services/careproviders/LeaveReview/DefaultView.aspx?id=1-481089446,0,0,,
The Wilf Ward Family Trust - Supported Living (Boothferry & the Wolds),1-2222930182,SCL,The Courtyard,Boothferry Road,,Goole,East Yorkshire,DN14 6AE,Tel: 07796135696,No ratings yet Rate it yourself - /Services/careproviders/LeaveReview/DefaultView.aspx?id=1-2222930182,0,0,,
Windsor Court,1-320777792,SCL,Bartholomew Avenue,,,Goole,Humberside,DN14 6YN,Tel: 01405763749,No ratings yet Rate it yourself - /Services/careproviders/LeaveReview/DefaultView.aspx?id=1-320777792,0,0,,
Claremont,1-259254635,SCL,21 Clifton Gardens,,,Goole,Humberside,DN14 6AR,Tel: 01405766985,No ratings yet Rate it yourself - /Services/careproviders/LeaveReview/DefaultView.aspx?id=1-259254635,0,0,,
Beech Tree House,1-17982108282,SCL,240 Boothferry Road,,,Goole,Humberside,DN14 6AJ,Tel: 01405811990,No ratings yet Rate it yourself - /Services/careproviders/LeaveReview/DefaultView.aspx?id=1-17982108282,0,0,,
Goldcrest House,1-111197810,SCL,194-198 Boothferry Road,,,Goole,Humberside,DN14 6AJ,Tel: 01405763607,No ratings yet Rate it yourself - /Services/careproviders/LeaveReview/DefaultView.aspx?id=1-111197810,0,0,,
Abrahamic Care Services Limited,1-16529118735,SCL,Carlisle House,Carlisle Street,,Goole,,DN14 5DX,Tel: 07940666470,No ratings yet Rate it yourself - /Services/careproviders/LeaveReview/DefaultView.aspx?id=1-16529118735,0,0,,
Holland House,1-13820686226,SCL,3 Airmyn Road,,,Goole,,DN14 6XA,Tel: 01405763607,No ratings yet Rate it yourself - /Services/careproviders/LeaveReview/DefaultView.aspx?id=1-13820686226,0,0,,
Victoria Street,1-366412173,SCL,40 Victoria Street,,,Goole,Humberside,DN14 5EX,Tel: 01405764350,No ratings yet Rate it yourself - /Services/careproviders/LeaveReview/DefaultView.aspx?id=1-366412173,0,0,,
Riverside House,1-366411829,SCL,38 North Street,,,Goole,Humberside,DN14 5RA,Tel: 01405764350,No ratings yet Rate it yourself - /Services/careproviders/LeaveReview/DefaultView.aspx?id=1-366411829,0,0,,
Bel-Esprit Social Care Ltd,1-9151831377,SCL,62 Colonels Walk,,,Goole,,DN14 6HJ,Tel: 07581314582,No ratings yet Rate it yourself - /Services/careproviders/LeaveReview/DefaultView.aspx?id=1-9151831377,0,0,,
Shamrock House,1-134397907,SCL,69 Hook Road,,,Goole,Humberside,DN14 5JN,Tel: 01405766217,No ratings yet Rate it yourself - /Services/careproviders/LeaveReview/DefaultView.aspx?id=1-134397907,0,0,,
Prospect House - Care Home,1-127697244,SCL,Woodland Avenue,,,Goole,Humberside,DN14 6RU,Tel: 01405761026,No ratings yet Rate it yourself - /Services/careproviders/LeaveReview/DefaultView.aspx?id=1-127697244,0,0,,
Sandhall Park,1-5627087311,SCL,Sandhall Drive,,,Goole,,DN14 5HY,Tel: 01405765132,1 rating Rate it yourself - /Services/careproviders/LeaveReview/DefaultView.aspx?id=1-5627087311,,,,
Westfield Park Care Home,1-138265998,SCL,Westfield Lane,Hook,,Goole,,DN14 5PW,Tel: 01405761021,No ratings yet Rate it yourself - /Services/careproviders/LeaveReview/DefaultView.aspx?id=1-138265998,0,0,,
The Old Vicarage at Airmyn,1-6547772812,SCL,75 High Street,Airmyn,,Goole,Humberside,DN14 8LD,Tel: 01405763699,No ratings yet Rate it yourself - /Services/careproviders/LeaveReview/DefaultView.aspx?id=1-6547772812,0,0,,
Goole Hall,1-140147233,SCL,Swinefleet Road,Old Goole,,Goole,Humberside,DN14 8AX,Tel: 01405760099,No ratings yet Rate it yourself - /Services/careproviders/LeaveReview/DefaultView.aspx?id=1-140147233,0,0,,
Prospect House Residential Home,1-117650816,SCL,"Prospect House, Low Street",Swinefleet,,Goole,Humberside,DN14 8DF,Tel: 01405704259,No ratings yet Rate it yourself - /Services/careproviders/LeaveReview/DefaultView.aspx?id=1-117650816,0,0,,
Elizabeth Homes,1-12362540805,SCL,67 Hailgate,Howden,,Goole,Humberside,DN14 7ST,Tel: 01430431065,No ratings yet Rate it yourself - /Services/careproviders/LeaveReview/DefaultView.aspx?id=1-12362540805,0,0,,
St Anne's Community Services - Creykes Lodge,1-121773380,SCL,2 Rawcliffe Road,,,Goole,Humberside,DN14 8SE,Tel: 01405839198,No ratings yet Rate it yourself - /Services/careproviders/LeaveReview/DefaultView.aspx?id=1-121773380,0,0,,
Parklands Care Home,1-2837530481,SCL,Station Road,Rawcliffe,,Goole,North Humberside,DN14 8QP,Tel: 01405839226,No ratings yet Rate it yourself - /Services/careproviders/LeaveReview/DefaultView.aspx?id=1-2837530481,0,0,,
Field View,1-134621018,SCL,Station Road,Rawcliffe,,Goole,Humberside,DN14 8QP,Tel: 01405831834,No ratings yet Rate it yourself - /Services/careproviders/LeaveReview/DefaultView.aspx?id=1-134621018,0,0,,
Mansion House,1-119643308,SCL,164 Main Road,Drax,,Selby,North Yorkshire,YO8 8NJ,Tel: 01757618659,No ratings yet Rate it yourself - /Services/careproviders/LeaveReview/DefaultView.aspx?id=1-119643308,0,0,,
The Goddards,1-5994997982,SCL,Goole Road,West Cowick,,Goole,Humberside,DN14 9DJ,Tel: 01405860247,No ratings yet Rate it yourself - /Services/careproviders/LeaveReview/DefaultView.aspx?id=1-5994997982,0,0,,
The Goddards Home From Home Care,1-5994998251,SCL,The Goddards,"Goole Road, West Cowick",,Goole,,DN14 9DJ,Tel: 01405860247,No ratings yet Rate it yourself - /Services/careproviders/LeaveReview/DefaultView.aspx?id=1-5994998251,0,0,,
Matn Limited,1-16531681883,SCL,4 Wembley Road,Moorends,,Doncaster,,DN8 4PR,,No ratings yet Rate it yourself - /Services/careproviders/LeaveReview/DefaultView.aspx?id=1-16531681883,0,0,,
The Lodge,1-947893497,SCL,Landing Lane,Hemingbrough,,Selby,North Yorkshire,YO8 6RA,Tel: 01757841987,No ratings yet Rate it yourself - /Services/careproviders/LeaveReview/DefaultView.aspx?id=1-947893497,0,0,,
Wesley Place,1-8456049609,SCL,George Street,Snaith,,Goole,,DN14 9HZ,Tel: 01405800978,No ratings yet Rate it yourself - /Services/careproviders/LeaveReview/DefaultView.aspx?id=1-8456049609,0,0,,
Snaith Hall Care Home,1-223343221,SCL,Pontefract Road,Snaith,,Goole,Humberside,DN14 9JR,Tel: 01405862191,No ratings yet Rate it yourself - /Services/careproviders/LeaveReview/DefaultView.aspx?id=1-223343221,0,0,,
Gabs Healthcare,1-17716009483,SCL,5 Cambridge Drive,Thorne,,Doncaster,,DN8 4FD,Tel: 01302496010,No ratings yet Rate it yourself - /Services/careproviders/LeaveReview/DefaultView.aspx?id=1-17716009483,0,0,,
Greenacres Care Home,1-115003055,SCL,Fieldside,Crowle,,Scunthorpe,Lincolnshire,DN17 4HL,Tel: 01724711661,No ratings yet Rate it yourself - /Services/careproviders/LeaveReview/DefaultView.aspx?id=1-115003055,0,0,,
Bennfield House,1-342589734,SCL,65 King Edward Road,Thorne,,Doncaster,South Yorkshire,DN8 4DE,Tel: 01405812663,No ratings yet Rate it yourself - /Services/careproviders/LeaveReview/DefaultView.aspx?id=1-342589734,0,0,,
The Old School House and Courtyard Nursing Home,1-135549079,SCL,Main Road,Gilberdyke,,Brough,North Humberside,HU15 2SG,Tel: 01430441803,2 ratings Rate it yourself - /Services/careproviders/LeaveReview/DefaultView.aspx?id=1-135549079,,,,
Autism Plus - Rusholme,1-1889942623,SCL,11 St Nicholas Road,Thorne,,Doncaster,South Yorkshire,DN8 5BS,Tel: 01405812128,No ratings yet Rate it yourself - /Services/careproviders/LeaveReview/DefaultView.aspx?id=1-1889942623,0,0,,
Northfield Care Centre,1-3562136917,SCL,Chace Court,Thorne,,Doncaster,South Yorkshire,DN8 4BW,Tel: 01405816042,2 ratings Rate it yourself - /Services/careproviders/LeaveReview/DefaultView.aspx?id=1-3562136917,,,,
Thorne House,1-1418638061,SCL,St Nicholas Road,Thorne,,Doncaster,South Yorkshire,DN8 5BG,Tel: 01405818171,No ratings yet Rate it yourself - /Services/careproviders/LeaveReview/DefaultView.aspx?id=1-1418638061,0,0,,
Autism Plus,1-1019548217,SCL,Fieldside Court,3 Field Road,,Doncaster,South Yorkshire,DN8 4AG,Tel: 01405812128,No ratings yet Rate it yourself - /Services/careproviders/LeaveReview/DefaultView.aspx?id=1-1019548217,0,0,,
Casson Court,1-9048644857,SCL,Church Street,Thorne,,Doncaster,,DN8 5BB,Tel: 03701924205,No ratings yet Rate it yourself - /Services/careproviders/LeaveReview/DefaultView.aspx?id=1-9048644857,0,0,,
Harry Priestley House,1-4317418850,SCL,30 Fieldside,Thorne,,Doncaster,,DN8 4BQ,Tel: 01405814777,No ratings yet Rate it yourself - /Services/careproviders/LeaveReview/DefaultView.aspx?id=1-4317418850,0,0,,
King Street,1-118871567,SCL,49 King Street,Thorne,,Doncaster,South Yorkshire,DN8 5AU,Tel: 01405818580,No ratings yet Rate it yourself - /Services/careproviders/LeaveReview/DefaultView.aspx?id=1-118871567,0,0,,
Adeline House Care Home,1-3152081284,SCL,Queen Street,Thorne,,Doncaster,South Yorkshire,DN8 5AQ,Tel: 01405815512,No ratings yet Rate it yourself - /Services/careproviders/LeaveReview/DefaultView.aspx?id=1-3152081284,0,0,,
The Parklands Care Home,1-2026179939,SCL,26 Ellison Street,Thorne,,Doncaster,South Yorkshire,DN8 5LD,Tel: 01405812233,1 rating Rate it yourself - /Services/careproviders/LeaveReview/DefaultView.aspx?id=1-2026179939,,,,
Preceptory Lodge,1-121575948,SCL,Temple Hirst,,,Selby,North Yorkshire,YO8 8QN,Tel: 01757270095,No ratings yet Rate it yourself - /Services/careproviders/LeaveReview/DefaultView.aspx?id=1-121575948,0,0,,
Temple Manor,1-5701249118,SCL,Temple Hirst,,,Selby,North Yorkshire,YO8 8QN,Tel: 01757270377,No ratings yet Rate it yourself - /Services/careproviders/LeaveReview/DefaultView.aspx?id=1-5701249118,0,0,,
The Manor House,1-131820311,SCL,Whitton Road,Alkborough,,Scunthorpe,Lincolnshire,DN15 9JG,,No ratings yet Rate it yourself - /Services/careproviders/LeaveReview/DefaultView.aspx?id=1-131820311,0,0,,
Denison House Care Home,1-5399976893,SCL,3 Denison Road,,,Selby,North Yorkshire,YO8 8DA,Tel: 01757703884,1 rating Rate it yourself - /Services/careproviders/LeaveReview/DefaultView.aspx?id=1-5399976893,,,,
Emmaculate Care Services Selby Office,1-2873810247,SCL,"Unit 3/4, Prospect Centre",Prospect Way,,Selby,North Yorkshire,YO8 8BD,Tel: 01757335158,No ratings yet Rate it yourself - /Services/careproviders/LeaveReview/DefaultView.aspx?id=1-2873810247,0,0,,
York - Hartley Care,1-11511730113,SCL,Unit 16a,"Ironworks Business Centre, Ousegate",,Selby,,YO8 4NN,Tel: 03333231717,No ratings yet Rate it yourself - /Services/careproviders/LeaveReview/DefaultView.aspx?id=1-11511730113,0,0,,
Bee Better Care,1-13910095779,SCL,26 Ousegate Mills,Ironworks,,Selby,,YO8 4NN,,No ratings yet Rate it yourself - /Services/careproviders/LeaveReview/DefaultView.aspx?id=1-13910095779,0,0,,
Dr Anderson Lodge,1-6079393536,SCL,East Lane,Stainforth,,Doncaster,South Yorkshire,DN7 5DY,Tel: 01302350003,No ratings yet Rate it yourself - /Services/careproviders/LeaveReview/DefaultView.aspx?id=1-6079393536,0,0,,
CRM Healthcare Solutions Ltd,1-16817787455,SCL,"Unit 21, Ironworks Business Centre",Ousegate Mills,,Selby,,YO8 4NJ,Tel: 07715328803,No ratings yet Rate it yourself - /Services/careproviders/LeaveReview/DefaultView.aspx?id=1-16817787455,0,0,,
Abbey Lea Care Home,1-112073317,SCL,York Road,Barlby,,Selby,North Yorkshire,YO8 5JP,Tel: 01757213811,No ratings yet Rate it yourself - /Services/careproviders/LeaveReview/DefaultView.aspx?id=1-112073317,0,0,,
The Vicarage,1-4232760927,SCL,23 Church Avenue,,,Selby,North Yorkshire,YO8 4PG,Tel: 01757702626,1 rating Rate it yourself - /Services/careproviders/LeaveReview/DefaultView.aspx?id=1-4232760927,,,,
Carentan House,1-130582431,SCL,Brook Street,,,Selby,North Yorkshire,YO8 4AU,Tel: 01757702815,No ratings yet Rate it yourself - /Services/careproviders/LeaveReview/DefaultView.aspx?id=1-130582431,0,0,,
Osborne House,1-1072844601,SCL,Union Lane,,,Selby,North Yorkshire,YO8 4AU,Tel: 01757212217,No ratings yet Rate it yourself - /Services/careproviders/LeaveReview/DefaultView.aspx?id=1-1072844601,0,0,,
Vermuyden Care,1-17716959373,SCL,27a,Finkle Street,,Selby,,YO8 4DT,Tel: 01757290227,No ratings yet Rate it yourself - /Services/careproviders/LeaveReview/DefaultView.aspx?id=1-17716959373,0,0,,
Westwood Care Home,1-112073334,SCL,21 Doncaster Road,,,Selby,North Yorkshire,YO8 9BT,Tel: 01757709901,No ratings yet Rate it yourself - /Services/careproviders/LeaveReview/DefaultView.aspx?id=1-112073334,0,0,,
Heritage Homecare Ltd,1-9817467398,SCL,52a Gowthorpe,,,Selby,,YO8 4ET,Tel: 01757701341,No ratings yet Rate it yourself - /Services/careproviders/LeaveReview/DefaultView.aspx?id=1-9817467398,0,0,,
Tawny Lodge,1-1289924958,SCL,Brook Street,,,Selby,North Yorkshire,YO8 4AL,Tel: 01609534393,No ratings yet Rate it yourself - /Services/careproviders/LeaveReview/DefaultView.aspx?id=1-1289924958,0,0,,
Selby Reablement Service,1-130582680,SCL,75 Brook Street,,,Selby,North Yorkshire,YO8 4AL,Tel: 01609533522,No ratings yet Rate it yourself - /Services/careproviders/LeaveReview/DefaultView.aspx?id=1-130582680,0,0,,
New Concept Care Selby,1-130466994,SCL,7 Brook Street,,,Selby,North Yorkshire,YO8 4AL,Tel: 01757705567,No ratings yet Rate it yourself - /Services/careproviders/LeaveReview/DefaultView.aspx?id=1-130466994,0,0,,
Firth House,1-126240485,SCL,18 Firth Mews,Millgate,,Selby,North Yorkshire,YO8 3FZ,Tel: 01757213546,No ratings yet Rate it yourself - /Services/careproviders/LeaveReview/DefaultView.aspx?id=1-126240485,0,0,,
Oldfield House,1-2110902871,SCL,Oldfield Lane,Stainforth,,Doncaster,South Yorkshire,DN7 5ND,Tel: 01302351410,No ratings yet Rate it yourself - /Services/careproviders/LeaveReview/DefaultView.aspx?id=1-2110902871,0,0,,
Eden Lodge,1-1766176924,SCL,East Avenue,Stainforth,,Doncaster,South Yorkshire,DN7 5HH,Tel: 01302734071,No ratings yet Rate it yourself - /Services/careproviders/LeaveReview/DefaultView.aspx?id=1-1766176924,0,0,,
Selby Office,1-13931403223,SCL,1 Larkfield Road,,,Selby,,YO8 9AS,Tel: 01757247744,No ratings yet Rate it yourself - /Services/careproviders/LeaveReview/DefaultView.aspx?id=1-13931403223,0,0,,
Fernbank Court,1-4590836981,SCL,Moat Way,Brayton,,Selby,North Yorkshire,YO8 9RU,Tel: 01757241145,No ratings yet Rate it yourself - /Services/careproviders/LeaveReview/DefaultView.aspx?id=1-4590836981,0,0,,
Tudor House,1-119643107,SCL,12 Leeds Road,,,Selby,North Yorkshire,YO8 4HX,Tel: 01757701922,No ratings yet Rate it yourself - /Services/careproviders/LeaveReview/DefaultView.aspx?id=1-119643107,0,0,,
The Grange,1-129132538,SCL,28 Leeds Road,,,Selby,North Yorkshire,YO8 4HX,Tel: 01757210221,No ratings yet Rate it yourself - /Services/careproviders/LeaveReview/DefaultView.aspx?id=1-129132538,0,0,,
Norwood House,1-2232395530,SCL,15a Station Road,Gunness,,Scunthorpe,Lincolnshire,DN15 8SU,Tel: 01724 784333,No ratings yet Rate it yourself - /Services/careproviders/LeaveReview/DefaultView.aspx?id=1-2232395530,0,0,,
Hatfield House,1-10758359583,SCL,Crookesbroom Avenue,Hatfield,,Doncaster,South Yorkshire,DN7 6JQ,Tel: 01302844889,No ratings yet Rate it yourself - /Services/careproviders/LeaveReview/DefaultView.aspx?id=1-10758359583,0,0,,
Ponderosa,1-1813508486,SCL,Moss Road,Moss,,Doncaster,South Yorkshire,DN6 0HN,Tel: 01405785235,No ratings yet Rate it yourself - /Services/careproviders/LeaveReview/DefaultView.aspx?id=1-1813508486,0,0,,
Althorpe Residential Home,1-151159112,SCL,3 Main Street,,,Althorpe,Lincolnshire,DN17 3HJ,,No ratings yet Rate it yourself - /Services/careproviders/LeaveReview/DefaultView.aspx?id=1-151159112,0,0,,
Care Plus Care (Isle) Ltd,1-1326791043,SCL,3 Main Street,Althorpe,,Scunthorpe,South Humberside,DN17 3HJ,Tel: 01724784588,No ratings yet Rate it yourself - /Services/careproviders/LeaveReview/DefaultView.aspx?id=1-1326791043,0,0,,
Ever Ready Medical,1-13701095685,SCL,Haven House,"Moss Road, Moss",,Doncaster,,DN6 0HP,Tel: 07919925827,No ratings yet Rate it yourself - /Services/careproviders/LeaveReview/DefaultView.aspx?id=1-13701095685,0,0,,
Holly House Care Home,1-131736099,SCL,124 High Street,Burringham,,Scunthorpe,Lincolnshire,DN17 3LY,,No ratings yet Rate it yourself - /Services/careproviders/LeaveReview/DefaultView.aspx?id=1-131736099,0,0,,
St Mary's,1-10644978940,SCL,St. Marys Court,,,Scunthorpe,,DN15 8UP,Tel: 01724865461,No ratings yet Rate it yourself - /Services/careproviders/LeaveReview/DefaultView.aspx?id=1-10644978940,0,0,,
North Lincolnshire Council-Home First Community Support,1-9737563720,SCL,Billet Lane,,,Scunthorpe,,DN15 9YH,Tel: 01724298190,No ratings yet Rate it yourself - /Services/careproviders/LeaveReview/DefaultView.aspx?id=1-9737563720,0,0,,
Randolph House Care Home,1-9932121789,SCL,Ferry Road West,,,Scunthorpe,Lincolnshire,DN15 8EA,Tel: 01724272500,No ratings yet Rate it yourself - /Services/careproviders/LeaveReview/DefaultView.aspx?id=1-9932121789,0,0,,
Sunnyborough,1-685180098,SCL,Weeland Road,Eggborough,,Goole,North Humberside,DN14 0RX,Tel: 01977661717,No ratings yet Rate it yourself - /Services/careproviders/LeaveReview/DefaultView.aspx?id=1-685180098,0,0,,
Whitley Farm,1-397639440,SCL,Whitley Farm Cottages,Doncaster Road,,Whitley Bridge,North Yorkshire,DN14 0HZ,Tel: 01977663476,No ratings yet Rate it yourself - /Services/careproviders/LeaveReview/DefaultView.aspx?id=1-397639440,0,0,,
Garmsway,1-2027953096,SCL,Garmsway,"Doncaster Road, Whitley",,Goole,North Humberside,DN14 0HY,Tel: 01977663591,No ratings yet Rate it yourself - /Services/careproviders/LeaveReview/DefaultView.aspx?id=1-2027953096,0,0,,
Phoenix Park Care Village,1-240142507,SCL,Phoenix Avenue,off Phoenix Parkway,,Scunthorpe,Lincolnshire,DN15 8NH,Tel: 01724289885,No ratings yet Rate it yourself - /Services/careproviders/LeaveReview/DefaultView.aspx?id=1-240142507,0,0,,
Stoneacre Lodge Residential Home,1-115286537,SCL,High Street,Dunsville,,Doncaster,South Yorkshire,DN7 4BS,,No ratings yet Rate it yourself - /Services/careproviders/LeaveReview/DefaultView.aspx?id=1-115286537,0,0,,
St Margarets Homecare Limited Selby,1-13786546960,SCL,"The Hub, The Regen Centre,","Landing Lane, Riccall",,York,,YO19 6PW,Tel: 01757210841,No ratings yet Rate it yourself - /Services/careproviders/LeaveReview/DefaultView.aspx?id=1-13786546960,0,0,,
Riccall House Care Home,1-111176685,SCL,78 Main Street,Riccall,,York,North Yorkshire,YO19 6QD,,No ratings yet Rate it yourself - /Services/careproviders/LeaveReview/DefaultView.aspx?id=1-111176685,0,0,,
Meadow Lodge Care Home,1-125092245,SCL,Meadow Lodge,"Broach Lane, Kellington",,Goole,North Humberside,DN14 0ND,Tel: 01977662899,No ratings yet Rate it yourself - /Services/careproviders/LeaveReview/DefaultView.aspx?id=1-125092245,0,0,,
Options Thorpe House,1-125064102,SCL,Sawcliffe Hill,Dragonby,,Scunthorpe,Lincolnshire,DN15 0BJ,Tel: 01724847788,No ratings yet Rate it yourself - /Services/careproviders/LeaveReview/DefaultView.aspx?id=1-125064102,0,0,,
Options Roxby House,1-125064084,SCL,Winterton Road,Roxby,,Scunthorpe,Lincolnshire,DN15 0BJ,Tel: 01724733777,No ratings yet Rate it yourself - /Services/careproviders/LeaveReview/DefaultView.aspx?id=1-125064084,0,0,,
The Orchard,1-215754168,SCL,Garman Carr Lane,Wistow,,Selby,North Yorkshire,YO8 3UW,Tel: 01757841988,No ratings yet Rate it yourself - /Services/careproviders/LeaveReview/DefaultView.aspx?id=1-215754168,0,0,,
The Green Residential Care Home,1-232048494,SCL,The Green,Ings lane,,Ellerker,Humberside,HU15 2DP,Tel: 01430422262,No ratings yet Rate it yourself - /Services/careproviders/LeaveReview/DefaultView.aspx?id=1-232048494,0,0,,
North Lincolnshire Council Home First Residential,1-1951783480,SCL,42 De Lacy Way,Winterton,,Scunthorpe,,DN15 9XS,Tel: 01724298444,No ratings yet Rate it yourself - /Services/careproviders/LeaveReview/DefaultView.aspx?id=1-1951783480,0,0,,
Wyndthorpe Hall & Gardens Care Home,1-3719399264,SCL,High Street,Dunsville,,Doncaster,South Yorkshire,DN7 4DB,Tel: 01302884650,No ratings yet Rate it yourself - /Services/careproviders/LeaveReview/DefaultView.aspx?id=1-3719399264,0,0,,
Sandhills Court Care Home,1-4779751729,SCL,Exeter Road,,,Scunthorpe,,DN15 7DE,Tel: 01724333001,1 rating Rate it yourself - /Services/careproviders/LeaveReview/DefaultView.aspx?id=1-4779751729,,,,
Baytree Court,1-9360962505,SCL,Normanby Road,,,Scunthorpe,Lincolnshire,DN15 6AR,Tel: 01724855410,No ratings yet Rate it yourself - /Services/careproviders/LeaveReview/DefaultView.aspx?id=1-9360962505,0,0,,
Gilby House Nursing Home,1-131820147,SCL,9 High Street,,,Winterton,Lincolnshire,DN15 9PU,Tel: 01724734824,No ratings yet Rate it yourself - /Services/careproviders/LeaveReview/DefaultView.aspx?id=1-131820147,0,0,,
WrightChoiceCare,1-965508964,SCL,Station Cottage,"Station Road, Wistow",,Selby,North Yorkshire,YO8 3UZ,Tel: 07723368518,No ratings yet Rate it yourself - /Services/careproviders/LeaveReview/DefaultView.aspx?id=1-965508964,0,0,,
Bridgewater Park Care Home,1-11410246949,SCL,Bridgewater Road,,,Scunthorpe,Lincolnshire,DN17 1SN,Tel: 01724847323,No ratings yet Rate it yourself - /Services/careproviders/LeaveReview/DefaultView.aspx?id=1-11410246949,0,0,,
Lincolnshire House Association,1-113554875,SCL,Brumby Wood Lane,,,Scunthorpe,Lincolnshire,DN17 1AF,,No ratings yet Rate it yourself - /Services/careproviders/LeaveReview/DefaultView.aspx?id=1-113554875,0,0,,
Orchard Court,1-667686044,SCL,Bacchus Lane,South Cave,,Brough,Yorkshire(East Riding),HU15 2ER,Tel: 01430421549,1 rating Rate it yourself - /Services/careproviders/LeaveReview/DefaultView.aspx?id=1-667686044,,,,
Ann Tuplin Care Services Limited,1-120031856,SCL,27 Wells Street,,,Scunthorpe,Lincolnshire,DN15 6HL,Tel: 01724270083,No ratings yet Rate it yourself - /Services/careproviders/LeaveReview/DefaultView.aspx?id=1-120031856,0,0,,
JME Care Ltd - Community Care Services,1-8683927176,SCL,60 Mary Street,,,Scunthorpe,,DN15 6LB,Tel: 01724897374,1 rating Rate it yourself - /Services/careproviders/LeaveReview/DefaultView.aspx?id=1-8683927176,,,,
Phronesis Support Services,1-14921718926,SCL,17 Selby Court,,,Scunthorpe,,DN17 1QQ,,No ratings yet Rate it yourself - /Services/careproviders/LeaveReview/DefaultView.aspx?id=1-14921718926,0,0,,
Hales Group Limited - Scunthorpe,1-2428513405,SCL,84 Oswald Road,,,Scunthorpe,,DN15 7PA,Tel: 01724897266,No ratings yet Rate it yourself - /Services/careproviders/LeaveReview/DefaultView.aspx?id=1-2428513405,0,0,,
Saint Lawrence Residential Care Home,1-119634315,SCL,102-104 Oswald Road,,,Scunthorpe,South Humberside,DN15 7PA,Tel: 01724847082,No ratings yet Rate it yourself - /Services/careproviders/LeaveReview/DefaultView.aspx?id=1-119634315,0,0,,
Ascot House,1-137903977,SCL,88/90 Oswald Road,,,Scunthorpe,Lincolnshire,DN15 7PA,Tel: 01724 867261,No ratings yet Rate it yourself - /Services/careproviders/LeaveReview/DefaultView.aspx?id=1-137903977,0,0,,
Carisbrooke Manor,1-137468305,SCL,Carisbrooke Manor Lane,Old Barn,,Scunthorpe,Lincolnshire,DN17 2AA,Tel: 01724289555,No ratings yet Rate it yourself - /Services/careproviders/LeaveReview/DefaultView.aspx?id=1-137468305,0,0,,
Creative Support - North Lincolnshire Services,1-3599481456,SCL,"Suite 2, Unit 4","Park Square, Laneham Street",,Scunthorpe,South Humberside,DN15 6JH,Tel: 01724845519,No ratings yet Rate it yourself - /Services/careproviders/LeaveReview/DefaultView.aspx?id=1-3599481456,0,0,,
Opieka Limited Office,1-3537624517,SCL,Raby Lodge,26 Cave Road,,Brough,Yorkshire(East Riding),HU15 1HL,Tel: 01964227010,No ratings yet Rate it yourself - /Services/careproviders/LeaveReview/DefaultView.aspx?id=1-3537624517,0,0,,
Brough Manor Care Home,1-153553798,SCL,33 Station Road,,,Brough,North Humberside,HU15 1DX,Tel: 01482668382,No ratings yet Rate it yourself - /Services/careproviders/LeaveReview/DefaultView.aspx?id=1-153553798,0,0,,