Organisation Name,NACS Code,Organisation Type,Address1,Address2,Address3,Address4,Address5,PostCode,Telephone Number,NHS.UK users rating,Value  (NHS.UK users rating),Banding Classification  (NHS.UK users rating),Car parking (Is there car parking at this organisation?),Disabled access (Disabled access)
Hilltop View,1-15979200422,SCL,23 Barncroft Street,,,West Bromwich,,B70 0QJ,,No ratings yet Rate it yourself - /Services/careproviders/LeaveReview/DefaultView.aspx?id=1-15979200422,0,0,,
Housing 21 - Oakley Gardens,1-2249132614,SCL,82 Oakley Gardens,Dial Lane,,West Bromwich,West Midlands,B70 0EH,Tel: 03701924000,No ratings yet Rate it yourself - /Services/careproviders/LeaveReview/DefaultView.aspx?id=1-2249132614,0,0,,
Sevacare - Wednesbury,1-3705249936,SCL,Isis House,Smith Road,,Wednesbury,West Midlands,WS10 0PB,Tel: 01218200076,2 ratings Rate it yourself - /Services/careproviders/LeaveReview/DefaultView.aspx?id=1-3705249936,,,,
Hill Top Lodge,1-125711848,SCL,93-95 Hill Top,,,West Bromwich,West Midlands,B70 0PX,Tel: 01215563322,No ratings yet Rate it yourself - /Services/careproviders/LeaveReview/DefaultView.aspx?id=1-125711848,0,0,,
Awarding Care Ltd,1-2289800479,SCL,59 Bridge Street,,,Wednesbury,West Midlands,WS10 0AH,Tel: 01215056104,1 rating Rate it yourself - /Services/careproviders/LeaveReview/DefaultView.aspx?id=1-2289800479,,,,
Bessie Care Solutions Ltd,1-13679828846,SCL,58 Pembroke Road,,,West Bromwich,,B71 2NN,Tel: 07446077856,No ratings yet Rate it yourself - /Services/careproviders/LeaveReview/DefaultView.aspx?id=1-13679828846,0,0,,
Leabrook House Nursing Home,1-117099890,SCL,180-181 Leabrook Road,Ocker Hill,,Tipton,West Midlands,DY4 0DY,Tel: 0000000000,No ratings yet Rate it yourself - /Services/careproviders/LeaveReview/DefaultView.aspx?id=1-117099890,0,0,,
Meadow Court,1-11639014481,SCL,Meadow Court,Bayleys Lane,,Tipton,,DY4 0HB,Tel: 01384900463,No ratings yet Rate it yourself - /Services/careproviders/LeaveReview/DefaultView.aspx?id=1-11639014481,0,0,,
Blossom Social Care Limited,1-15861333925,SCL,35 Bagnalls Wharf,,,Wednesbury,,WS10 7EL,Tel: 07990685502,No ratings yet Rate it yourself - /Services/careproviders/LeaveReview/DefaultView.aspx?id=1-15861333925,0,0,,
Veronica House Nursing Home,1-1290195436,SCL,1 Leabrook Road,Ocker Hill,,Tipton,West Midlands,DY4 0DX,Tel: 01215051110,No ratings yet Rate it yourself - /Services/careproviders/LeaveReview/DefaultView.aspx?id=1-1290195436,0,0,,
Abberley House,1-318051307,SCL,6 Roland Vernon Way,Tipton,,Dudley,West Midlands,DY4 0PS,Tel: 01215224860,No ratings yet Rate it yourself - /Services/careproviders/LeaveReview/DefaultView.aspx?id=1-318051307,0,0,,
Crestar Healthcare,1-2106265434,SCL,Grenville House,New Swan Lane,,West Bromwich,West Midlands,B70 0NS,Tel: 01215720043,No ratings yet Rate it yourself - /Services/careproviders/LeaveReview/DefaultView.aspx?id=1-2106265434,0,0,,
Bridgewood Mews,1-153949744,SCL,38 Bridge Road,,,Tipton,West Midlands,DY4 0JW,Tel: 0121 522 5780,No ratings yet Rate it yourself - /Services/careproviders/LeaveReview/DefaultView.aspx?id=1-153949744,0,0,,
Lonsdale Midlands Limited - 118-120 Dudley Street,1-131377969,SCL,118-120 Dudley Street,Carters Green,,West Bromwich,West Midlands,B70 9AJ,Tel: 01215802573,No ratings yet Rate it yourself - /Services/careproviders/LeaveReview/DefaultView.aspx?id=1-131377969,0,0,,
Total Love Healthcare Limited,1-18838009865,SCL,11 Scafell Way,,,West Bromwich,,B71 1DN,Tel: 01215171610,No ratings yet Rate it yourself - /Services/careproviders/LeaveReview/DefaultView.aspx?id=1-18838009865,0,0,,
Leofric Villa,1-10918672400,SCL,6 The Beeches,Brunswick Terrace,,Wednesbury,,WS10 9FB,Tel: 01212729007,No ratings yet Rate it yourself - /Services/careproviders/LeaveReview/DefaultView.aspx?id=1-10918672400,0,0,,
Allerton Court,1-123515235,SCL,234 Hydes Road,,,West Bromwich,West Midlands,B71 2ED,Tel: 01215885494,1 rating Rate it yourself - /Services/careproviders/LeaveReview/DefaultView.aspx?id=1-123515235,,,,
Khumalo Care,1-16428715839,SCL,Khumalo Care Ltd - Main Office,"90 Horseley Heath,",,Tipton,,DY4 7AH,Tel: 03303110731,No ratings yet Rate it yourself - /Services/careproviders/LeaveReview/DefaultView.aspx?id=1-16428715839,0,0,,
Bartholamew Lodge Nursing Home Limited,1-116745623,SCL,1 Trouse Lane,,,Wednesbury,West Midlands,WS10 7HR,Tel: 01215021606,No ratings yet Rate it yourself - /Services/careproviders/LeaveReview/DefaultView.aspx?id=1-116745623,0,0,,
66 Dudley Street,1-129459221,SCL,Dudley Street,,,West Bromwich,West Midlands,B70 9LU,Tel: 01215253900,No ratings yet Rate it yourself - /Services/careproviders/LeaveReview/DefaultView.aspx?id=1-129459221,0,0,,
Wellcroft House,1-6615555153,SCL,11 Wellcroft Street,,,Wednesbury,West Midlands,WS10 7HU,,No ratings yet Rate it yourself - /Services/careproviders/LeaveReview/DefaultView.aspx?id=1-6615555153,0,0,,
Dovedale Court,1-319476674,SCL,Holyhead Road,,,Wednesbury,West Midlands,WS10 7PZ,Tel: 01215026444,3 ratings Rate it yourself - /Services/careproviders/LeaveReview/DefaultView.aspx?id=1-319476674,,,,
Talbot Court,1-129453702,SCL,1-3 Jervoise Street,Carters Green,,West Bromwich,West Midlands,B70 9LZ,Tel: 01215253508,No ratings yet Rate it yourself - /Services/careproviders/LeaveReview/DefaultView.aspx?id=1-129453702,0,0,,
Ryland View Care Home,1-4413482662,SCL,Arnhem Way,,,Tipton,West Midlands,DY4 7HR,Tel: 01215201577,No ratings yet Rate it yourself - /Services/careproviders/LeaveReview/DefaultView.aspx?id=1-4413482662,0,0,,
Kelvedon House,1-1290507859,SCL,10 Clarkson Road,,,Wednesbury,West Midlands,WS10 9AY,Tel: 0121 505 7775,No ratings yet Rate it yourself - /Services/careproviders/LeaveReview/DefaultView.aspx?id=1-1290507859,0,0,,
Head Office,1-7186695179,SCL,12 Bank Street,,,West Bromwich,,B71 1HF,Tel: 07306449402,No ratings yet Rate it yourself - /Services/careproviders/LeaveReview/DefaultView.aspx?id=1-7186695179,0,0,,
Whitehall Lodge Care Home,1-106699147,SCL,109 Whitehall Road,,,West Bromwich,West Midlands,B70 0HG,Tel: 01215326003,1 rating Rate it yourself - /Services/careproviders/LeaveReview/DefaultView.aspx?id=1-106699147,,,,
67 Ruskin Street,1-6905534263,SCL,67 Ruskin Street,,,West Bromwich,,B71 1LR,Tel: 01215531465,No ratings yet Rate it yourself - /Services/careproviders/LeaveReview/DefaultView.aspx?id=1-6905534263,0,0,,
Universal Integrated Services,1-14185814553,SCL,"Office 12, Western Gateway Building YMCA",38 Carters Green,,West Bromwich,,B70 9LG,Tel: 07483331523,No ratings yet Rate it yourself - /Services/careproviders/LeaveReview/DefaultView.aspx?id=1-14185814553,0,0,,
Bayside Supported Living Ltd,1-16424208737,SCL,12 Change Road,,,West Bromwich,,B70 9BW,,No ratings yet Rate it yourself - /Services/careproviders/LeaveReview/DefaultView.aspx?id=1-16424208737,0,0,,
Sunnyside Healthcare Services Limited,1-10834154931,SCL,22 Glebefields Road,,,Tipton,,DY4 0NZ,Tel: 07823441285,No ratings yet Rate it yourself - /Services/careproviders/LeaveReview/DefaultView.aspx?id=1-10834154931,0,0,,
Clements Health Care,1-3645349686,SCL,13 Carters Green,,,West Bromwich,West Midlands,B70 9QP,Tel: 01215535303,No ratings yet Rate it yourself - /Services/careproviders/LeaveReview/DefaultView.aspx?id=1-3645349686,0,0,,
Wood Green Nursing Home,1-247711742,SCL,27 Wood Green Road,,,Wednesbury,West Midlands,WS10 9AX,Tel: 01215560381,No ratings yet Rate it yourself - /Services/careproviders/LeaveReview/DefaultView.aspx?id=1-247711742,0,0,,
Hall Green Care Home,1-759019756,SCL,107 Hall Green Road,,,West Bromwich,West Midlands,B71 3JT,Tel: 01215670020,No ratings yet Rate it yourself - /Services/careproviders/LeaveReview/DefaultView.aspx?id=1-759019756,0,0,,
Domiciliary Care Midlands,1-11177201044,SCL,384 High Street,,,West Bromwich,West Midlands,B70 9LB,Tel: 01212725727,No ratings yet Rate it yourself - /Services/careproviders/LeaveReview/DefaultView.aspx?id=1-11177201044,0,0,,
Bespocare Plus,1-17034141815,SCL,54 Lower Church Lane,,,Tipton,,DY4 7PG,Tel: 07495940447,No ratings yet Rate it yourself - /Services/careproviders/LeaveReview/DefaultView.aspx?id=1-17034141815,0,0,,
Cromwell House (West Bromwich),1-255631632,SCL,128 Wood Lane,,,West Bromwich,West Midlands,B70 9PX,Tel: 01215534332,No ratings yet Rate it yourself - /Services/careproviders/LeaveReview/DefaultView.aspx?id=1-255631632,0,0,,
Lyndon Hall Nursing Home,1-320351055,SCL,Malvern Close,off All Saints Way,,West Bromwich,West Midlands,B71 1PP,Tel: 01215005777,No ratings yet Rate it yourself - /Services/careproviders/LeaveReview/DefaultView.aspx?id=1-320351055,0,0,,
Trust In Care Limited,1-15273405070,SCL,339 High Street,,,West Bromwich,,B70 9QG,Tel: 01214391171,No ratings yet Rate it yourself - /Services/careproviders/LeaveReview/DefaultView.aspx?id=1-15273405070,0,0,,
Churchfield Court,1-115795220,SCL,236 All Saints Way,,,West Bromwich,West Midlands,B71 1RR,Tel: 01215885450,No ratings yet Rate it yourself - /Services/careproviders/LeaveReview/DefaultView.aspx?id=1-115795220,0,0,,
Brunswick House,1-428633344,SCL,1 James Watt Drive,,,Wednesbury,West Midlands,WS10 0PQ,Tel: 01215056933,No ratings yet Rate it yourself - /Services/careproviders/LeaveReview/DefaultView.aspx?id=1-428633344,0,0,,
Brunswick Mews,1-1043708006,SCL,70 Brunswick Park Road,,,Wednesbury,,WS10 9QR,Tel: 01214480501,No ratings yet Rate it yourself - /Services/careproviders/LeaveReview/DefaultView.aspx?id=1-1043708006,0,0,,
45 Hall Green Road,1-129459141,SCL,Hall Green,Hall Green Road,,West Bromwich,West Midlands,B71 3JS,Tel: 01215884560,No ratings yet Rate it yourself - /Services/careproviders/LeaveReview/DefaultView.aspx?id=1-129459141,0,0,,
The Shrubbery,1-311720178,SCL,33 Woodgreen Road,,,Wednesbury,West Midlands,WS10 9QL,Tel: 01215568899,1 rating Rate it yourself - /Services/careproviders/LeaveReview/DefaultView.aspx?id=1-311720178,,,,
Housing 21 - Goldfield Court,1-398076998,SCL,Dartmouth Street,Sandwell,,West Bromwich,,B70 8GH,Tel: 03701924000,No ratings yet Rate it yourself - /Services/careproviders/LeaveReview/DefaultView.aspx?id=1-398076998,0,0,,
Westgate,1-526068281,SCL,60 Edward Street,,,West Bromwich,West Midlands,B70 8NU,Tel: 01215800196,No ratings yet Rate it yourself - /Services/careproviders/LeaveReview/DefaultView.aspx?id=1-526068281,0,0,,
The Grange,1-18140709151,SCL,12 Grange Road,,,West Bromwich,,B70 8PD,Tel: 07922506751,No ratings yet Rate it yourself - /Services/careproviders/LeaveReview/DefaultView.aspx?id=1-18140709151,0,0,,
Select Lifestyles Limited,1-13938197009,SCL,"Select House, 335-337",High Street,,West Bromwich,,B70 8LU,Tel: 01215412122,No ratings yet Rate it yourself - /Services/careproviders/LeaveReview/DefaultView.aspx?id=1-13938197009,0,0,,
Daffodil House,1-10291543287,SCL,2 Spring Street,,,Tipton,,DY4 8TF,Tel: 07400166858,No ratings yet Rate it yourself - /Services/careproviders/LeaveReview/DefaultView.aspx?id=1-10291543287,0,0,,
M & MT Healthcare Limited,1-18386013388,SCL,17 Callaghan Drive,Tividale,,Oldbury,,B69 3NG,Tel: 07939219984,No ratings yet Rate it yourself - /Services/careproviders/LeaveReview/DefaultView.aspx?id=1-18386013388,0,0,,
Walker Grange Extra Care Service,1-195717129,SCL,Central Avenue,,,Tipton,West Midlands,DY4 9RY,Tel: 01215694950,No ratings yet Rate it yourself - /Services/careproviders/LeaveReview/DefaultView.aspx?id=1-195717129,0,0,,
Sandwell Shared Lives,1-403742589,SCL,Summer Street,,,West Bromwich,West Midlands,B71 4JA,Tel: 01215694467,No ratings yet Rate it yourself - /Services/careproviders/LeaveReview/DefaultView.aspx?id=1-403742589,0,0,,
Loving Arms Care and Support Ltd,1-10912843876,SCL,30 Wilson Drive,Tividale,,Oldbury,,B69 3NF,Tel: 07534856523,No ratings yet Rate it yourself - /Services/careproviders/LeaveReview/DefaultView.aspx?id=1-10912843876,0,0,,
Great Care Home Health care Services Ltd,1-1202836939,SCL,9 St Michaels Court,Victoria Street,,West Bromwich,West Midlands,B70 8ET,Tel: 01215533830,No ratings yet Rate it yourself - /Services/careproviders/LeaveReview/DefaultView.aspx?id=1-1202836939,0,0,,
Cherish Home Care Ltd - Sandwell,1-428978516,SCL,5 St. Michaels Court,Victoria Street,,West Bromwich,,B70 8ET,Tel: 07841840032,No ratings yet Rate it yourself - /Services/careproviders/LeaveReview/DefaultView.aspx?id=1-428978516,0,0,,
Homecare For You Sandwell,1-15841973282,SCL,7 St. Michaels Court,Victoria Street,,West Bromwich,,B70 8ET,Tel: 01212708554,No ratings yet Rate it yourself - /Services/careproviders/LeaveReview/DefaultView.aspx?id=1-15841973282,0,0,,
The Willows Nursing Home,1-142035610,SCL,Dangerfield Lane,,,Wednesbury,West Midlands,WS10 7RT,Tel: 01215687611,No ratings yet Rate it yourself - /Services/careproviders/LeaveReview/DefaultView.aspx?id=1-142035610,0,0,,
Bloomfield Court,1-10777631440,SCL,27 Central Avenue,,,Tipton,West Midlands,DY4 9RR,Tel: 01215215747,No ratings yet Rate it yourself - /Services/careproviders/LeaveReview/DefaultView.aspx?id=1-10777631440,0,0,,
The Lodge,1-198023491,SCL,Beebee Road,,,Wednesbury,West Midlands,WS10 9RX,Tel: 01215264612,No ratings yet Rate it yourself - /Services/careproviders/LeaveReview/DefaultView.aspx?id=1-198023491,0,0,,
Carters Green Healthcare Services Limited,1-12688847140,SCL,Parkview House,Woodward Street,,West Bromwich,,B71 4AP,Tel: 07708764993,No ratings yet Rate it yourself - /Services/careproviders/LeaveReview/DefaultView.aspx?id=1-12688847140,0,0,,
Lonsdale Midlands Ltd - New Street North,1-131378000,SCL,1-5 New Street North,,,West Bromwich,West Midlands,B71 4AQ,Tel: 01215531755,No ratings yet Rate it yourself - /Services/careproviders/LeaveReview/DefaultView.aspx?id=1-131378000,0,0,,
JW Compassionate Care Services Ltd,1-18625586824,SCL,1 Roberts Close,,,Wednesbury,,WS10 8SS,Tel: 07308979767,No ratings yet Rate it yourself - /Services/careproviders/LeaveReview/DefaultView.aspx?id=1-18625586824,0,0,,
Princess Lodge Limited,1-143246288,SCL,11 High Street,Princes End,,Tipton,West Midlands,DY4 9HU,,No ratings yet Rate it yourself - /Services/careproviders/LeaveReview/DefaultView.aspx?id=1-143246288,0,0,,
Rubery Court,1-2396350652,SCL,55-57 Walsall Road,Darlaston,,Walsall,West Midlands,WS10 9JS,Tel: 01212851171,4 ratings Rate it yourself - /Services/careproviders/LeaveReview/DefaultView.aspx?id=1-2396350652,,,,
Bluebird Care Sandwell,1-5763742798,SCL,Office 13 Flexspace,Roway Lane,,Oldbury,,B69 3ES,Tel: 01213891260,2 ratings Rate it yourself - /Services/careproviders/LeaveReview/DefaultView.aspx?id=1-5763742798,,,,
Sandwell,1-14636504032,SCL,"Unit 16, Flexspace","Direct 2 Industrial Park, Roway Lane",,Oldbury,,B69 3ES,Tel: 01213144274,No ratings yet Rate it yourself - /Services/careproviders/LeaveReview/DefaultView.aspx?id=1-14636504032,0,0,,
Blue Skies Healthcare,1-11768254081,SCL,"Suite F10, Old Bank Innovation Centre","35-37 King Street, Darlaston",,Wednesbury,,WS10 8DE,Tel: 01217961931,1 rating Rate it yourself - /Services/careproviders/LeaveReview/DefaultView.aspx?id=1-11768254081,,,,
SD Home Care Ltd,1-6710182324,SCL,37 King Street,Darlaston,,Wednesbury,,WS10 8DE,Tel: 01922324088,No ratings yet Rate it yourself - /Services/careproviders/LeaveReview/DefaultView.aspx?id=1-6710182324,0,0,,
Orlando Care Homes LTD,1-14380731854,SCL,Old Bank Innovation Centre,"35-37 King Street, Darlaston",,Wednesbury,,WS10 8DE,Tel: 07727124128,No ratings yet Rate it yourself - /Services/careproviders/LeaveReview/DefaultView.aspx?id=1-14380731854,0,0,,
Parkside,1-155072291,SCL,1a Tibbington Terrace,,,Tipton,West Midlands,DY4 9HJ,Tel: 0121 521 5000,1 rating Rate it yourself - /Services/careproviders/LeaveReview/DefaultView.aspx?id=1-155072291,,,,
Jaytee Care Demi House,1-10495633645,SCL,205 Walsall Road,,,Wednesbury,,WS10 9SW,Tel: 01218206400,No ratings yet Rate it yourself - /Services/careproviders/LeaveReview/DefaultView.aspx?id=1-10495633645,0,0,,
A & A Services West Midlands,1-13928160047,SCL,1 Church Street,Darlaston,,Wednesbury,,WS10 8DS,Tel: 01922333019,No ratings yet Rate it yourself - /Services/careproviders/LeaveReview/DefaultView.aspx?id=1-13928160047,0,0,,
Sandwell Community Caring Trust,1-123515298,SCL,"9th Floor, West Plaza",144 High Street,,West Bromwich,West Midlands,B70 6JJ,Tel: 01215532722,1 rating Rate it yourself - /Services/careproviders/LeaveReview/DefaultView.aspx?id=1-123515298,,,,
The Grand Cedars Nursing Home,1-17761912785,SCL,83-89 Bescot Road,,,Walsall,West Midlands,WS2 9DG,Tel: 01922641869,No ratings yet Rate it yourself - /Services/careproviders/LeaveReview/DefaultView.aspx?id=1-17761912785,0,0,,
SENSE - 20-32 Horton Street,1-120445082,SCL,20-32 Horton Street,,,West Bromwich,West Midlands,B70 7SG,Tel: 01215537760,No ratings yet Rate it yourself - /Services/careproviders/LeaveReview/DefaultView.aspx?id=1-120445082,0,0,,
Fallings Heath,1-122285524,SCL,5 Fallings Heath Close,Darlaston,,Walsall,West Midlands,WS10 8BT,Tel: 01215686176,No ratings yet Rate it yourself - /Services/careproviders/LeaveReview/DefaultView.aspx?id=1-122285524,0,0,,
Tipton Home Care Limited,1-6137531726,SCL,5 Venture Business Park,Bloomfield Road,,Tipton,West Midlands,DY4 9ET,Tel: 01213140327,No ratings yet Rate it yourself - /Services/careproviders/LeaveReview/DefaultView.aspx?id=1-6137531726,0,0,,
H-Roce Care,1-13949325898,SCL,Office 21 Brook House,"Brook Street Business Centre, Brook Street",,Tipton,,DY4 9DD,Tel: 08001404643,No ratings yet Rate it yourself - /Services/careproviders/LeaveReview/DefaultView.aspx?id=1-13949325898,0,0,,
Augustus Care,1-9104522733,SCL,Suite 27 Brook House,"Brook Street Business Centre, Brook Street",,Tipton,,DY4 9DD,Tel: 01212894749,No ratings yet Rate it yourself - /Services/careproviders/LeaveReview/DefaultView.aspx?id=1-9104522733,0,0,,
Konastone Healthcare Ltd,1-2950714022,SCL,20 Brook House,Brook Street,,Tipton,West Midlands,DY4 9DD,,No ratings yet Rate it yourself - /Services/careproviders/LeaveReview/DefaultView.aspx?id=1-2950714022,0,0,,
Caring with Dignity Limited,1-13835499927,SCL,"Suite 6, Brook House","Brook Business Centre, Brook Street",,Tipton,,DY4 9DD,Tel: 01214939159,No ratings yet Rate it yourself - /Services/careproviders/LeaveReview/DefaultView.aspx?id=1-13835499927,0,0,,
FACT Healthcare Ltd,1-1984345064,SCL,Office 1 Brook House,"Brook Street Business Centre, Brook Street",,Tipton,,DY4 9DD,Tel: 01217980156,No ratings yet Rate it yourself - /Services/careproviders/LeaveReview/DefaultView.aspx?id=1-1984345064,0,0,,
Imperial Breeze Healthcare Ltd,1-5468513247,SCL,Office 30 Brook House,"Brook Street Business Centre, Brook Street",,Tipton,,DY4 9DD,Tel: 01217942522,No ratings yet Rate it yourself - /Services/careproviders/LeaveReview/DefaultView.aspx?id=1-5468513247,0,0,,
Sandwell Multi-Care,1-120640925,SCL,"15 Brook House, Brook Street Business Centre",Brook Street,,Tipton,West Midlands,DY4 9DD,Tel: 01215204548,No ratings yet Rate it yourself - /Services/careproviders/LeaveReview/DefaultView.aspx?id=1-120640925,0,0,,
Passion Domiciliary Care Ltd,1-7232031040,SCL,19 Brook Street Business Centre,Brook Street,,Tipton,,DY4 9DD,,No ratings yet Rate it yourself - /Services/careproviders/LeaveReview/DefaultView.aspx?id=1-7232031040,0,0,,
Ruchare  Ltd,1-18034311998,SCL,Old Bank Business Centre,"43 - 45 Church Street,",,Wednesbury,,WS10 8DU,Tel: 07403392047,No ratings yet Rate it yourself - /Services/careproviders/LeaveReview/DefaultView.aspx?id=1-18034311998,0,0,,
Resjes Ltd,1-7374590713,SCL,"Suite F3, Old Bank Business Centre","43-45 Church Street, Darlaston",,Wednesbury,,WS10 8DU,Tel: 07479882292,No ratings yet Rate it yourself - /Services/careproviders/LeaveReview/DefaultView.aspx?id=1-7374590713,0,0,,
Saving Care Ltd,1-18786931447,SCL,43-45,"Church Street, Darlaston",,Wednesbury,,WS10 8DU,Tel: 07732957574,No ratings yet Rate it yourself - /Services/careproviders/LeaveReview/DefaultView.aspx?id=1-18786931447,0,0,,
Prudent Health Services Ltd,1-674546917,SCL,Broadwell Road,,,Oldbury,West Midlands,B69 4BY,Tel: 01213141363,No ratings yet Rate it yourself - /Services/careproviders/LeaveReview/DefaultView.aspx?id=1-674546917,0,0,,
Rose of Sharon Care Services,1-2619656930,SCL,"Suite 36, Pure Offices",Broadwell Road,,Oldbury,,B69 4BY,Tel: 01216679991,No ratings yet Rate it yourself - /Services/careproviders/LeaveReview/DefaultView.aspx?id=1-2619656930,0,0,,
Choice Supported Living - West Midlands,1-2935176919,SCL,"Office 4, Pure Offices",Broadwell Road,,Oldbury,,B69 4BY,Tel: 02031950135,No ratings yet Rate it yourself - /Services/careproviders/LeaveReview/DefaultView.aspx?id=1-2935176919,0,0,,
EL MARSH SUPPORTED LIVING,1-5618300857,SCL,PURE OFFICES 21 & 22,Broadwell Road,,Oldbury,,B69 4BY,Tel: 07515162981,2 ratings Rate it yourself - /Services/careproviders/LeaveReview/DefaultView.aspx?id=1-5618300857,,,,
MHC Nursing and Care Services,1-16413487310,SCL,Pure Offices,Broadwell Road,,Oldbury,,B69 4BY,Tel: 03335774808,No ratings yet Rate it yourself - /Services/careproviders/LeaveReview/DefaultView.aspx?id=1-16413487310,0,0,,
Home1st Ltd,1-16120726892,SCL,"Office 46, Pure Offices",Broadwell Road,,Oldbury,,B69 4BY,Tel: 01213893166,No ratings yet Rate it yourself - /Services/careproviders/LeaveReview/DefaultView.aspx?id=1-16120726892,0,0,,
Lime Healthcare Support Limited,1-5266100087,SCL,"First Floor, 100 High Street",,,West Bromwich,,B70 6JW,Tel: 01212013580,1 rating Rate it yourself - /Services/careproviders/LeaveReview/DefaultView.aspx?id=1-5266100087,,,,
Pegasus Care Home,1-331297275,SCL,65-67 Beeches Road,,,West Bromwich,West Midlands,B70 6HQ,Tel: 01215532900,No ratings yet Rate it yourself - /Services/careproviders/LeaveReview/DefaultView.aspx?id=1-331297275,0,0,,
West Bromwich African Caribbean Resource Centre,1-904829526,SCL,Thomas Street,,,West Bromwich,West Midlands,B70 6LY,Tel: 01215255436,No ratings yet Rate it yourself - /Services/careproviders/LeaveReview/DefaultView.aspx?id=1-904829526,0,0,,
Swallowfields,1-7162175801,SCL,Swallow Fields,127-130 High Street,,Tipton,,DY4 8BJ,Tel: 0121554157,No ratings yet Rate it yourself - /Services/careproviders/LeaveReview/DefaultView.aspx?id=1-7162175801,0,0,,
Nicholl Grange,1-111365356,SCL,14-22 Nicholl Street,,,West Bromwich,West Midlands,B70 6HW,Tel: 01215253828,No ratings yet Rate it yourself - /Services/careproviders/LeaveReview/DefaultView.aspx?id=1-111365356,0,0,,
Bescot Lodge Care Home,1-5593212074,SCL,76-78,Bescot Road,,Walsall,,WS2 9AE,Tel: 01922648917,No ratings yet Rate it yourself - /Services/careproviders/LeaveReview/DefaultView.aspx?id=1-5593212074,0,0,,
MCO Healthcare Limited,1-19091168725,SCL,Vulcan House,Oxford Street,,Bilston,,WV14 7LF,Tel: 03301130959,No ratings yet Rate it yourself - /Services/careproviders/LeaveReview/DefaultView.aspx?id=1-19091168725,0,0,,
Greenfield Healthcare Ltd,1-17196647885,SCL,100 Bhullar Way,,,Oldbury,,B69 2GL,Tel: 01212748181,No ratings yet Rate it yourself - /Services/careproviders/LeaveReview/DefaultView.aspx?id=1-17196647885,0,0,,
AMC Healthcare Solutions Ltd,1-18639125791,SCL,"The Office, 30 Poppy Drive",,,Walsall,,WS5 4RB,,No ratings yet Rate it yourself - /Services/careproviders/LeaveReview/DefaultView.aspx?id=1-18639125791,0,0,,
Wolverhampton City Council HARP Team (Home Assisted Reablement Programme),1-2868597503,SCL,Lord Street,Bradley,,Bilston,West Midlands,WV14 8SD,Tel: 01902553452,No ratings yet Rate it yourself - /Services/careproviders/LeaveReview/DefaultView.aspx?id=1-2868597503,0,0,,
Bradley Resource Centre,1-118364080,SCL,Lord Street,Bradley,,Bilston,West Midlands,WV14 8SD,Tel: 01902553543,1 rating Rate it yourself - /Services/careproviders/LeaveReview/DefaultView.aspx?id=1-118364080,,,,
Bush Rest Home,1-429405828,SCL,37-39 Bush Street,,,Wednesbury,West Midlands,WS10 8LE,Tel: 01215265914,No ratings yet Rate it yourself - /Services/careproviders/LeaveReview/DefaultView.aspx?id=1-429405828,0,0,,