Organisation Name,NACS Code,Organisation Type,Address1,Address2,Address3,Address4,Address5,PostCode,Telephone Number,NHS.UK users rating,Value  (NHS.UK users rating),Banding Classification  (NHS.UK users rating),Car parking (Is there car parking at this organisation?),Disabled access (Disabled access)
Somerhill Care Home,1-12830668007,SCL,Little Somerford,,,Chippenham,,SN15 5BH,Tel: 01666822363,No ratings yet Rate it yourself - /Services/careproviders/LeaveReview/DefaultView.aspx?id=1-12830668007,0,0,,
OSJCT Athelstan House,1-122145288,SCL,Priory Way,Burton Hill,,Malmesbury,Wiltshire,SN16 0FB,Tel: 01666848000,No ratings yet Rate it yourself - /Services/careproviders/LeaveReview/DefaultView.aspx?id=1-122145288,0,0,,
Efficiency Health and Homecare Services - Malmesbury,1-18383838346,SCL,43 High Street,,,Malmesbury,,SN16 9AG,Tel: 01172980699,No ratings yet Rate it yourself - /Services/careproviders/LeaveReview/DefaultView.aspx?id=1-18383838346,0,0,,
Stainsbridge House,1-121597759,SCL,101 Gloucester Road,,,Malmesbury,Wiltshire,SN16 0AJ,,No ratings yet Rate it yourself - /Services/careproviders/LeaveReview/DefaultView.aspx?id=1-121597759,0,0,,
The Beeches Homecare Services,1-2860095405,SCL,International House,107 Gloucester Road,,Malmesbury,Wiltshire,SN16 0AJ,Tel: 01666 825496,No ratings yet Rate it yourself - /Services/careproviders/LeaveReview/DefaultView.aspx?id=1-2860095405,0,0,,
The White Lodge,1-125862817,SCL,Braydon,,,Swindon,Wiltshire,SN5 0AD,Tel: 01666860381,No ratings yet Rate it yourself - /Services/careproviders/LeaveReview/DefaultView.aspx?id=1-125862817,0,0,,
Princess Homecare,1-2876428533,SCL,Princess Place,"Trow Lane, Lyneham",,Chippenham,Wiltshire,SN15 4DL,Tel: 01793381000,No ratings yet Rate it yourself - /Services/careproviders/LeaveReview/DefaultView.aspx?id=1-2876428533,0,0,,
Caring Hands (Wiltshire),1-289164876,SCL,Battle Lake Farm,Braydon,,Swindon,Wiltshire,SN5 0AA,Tel: 01793772777,No ratings yet Rate it yourself - /Services/careproviders/LeaveReview/DefaultView.aspx?id=1-289164876,0,0,,
Kingsley House,1-134533409,SCL,Gumstool Hill,,,Tetbury,Gloucestershire,GL8 8DG,Tel: 01666503333,No ratings yet Rate it yourself - /Services/careproviders/LeaveReview/DefaultView.aspx?id=1-134533409,0,0,,
Prestige Nursing Gloucester,1-403808907,SCL,"1st & 2nd Floors, Three Cups House",5c - 5d Church Street,,Tetbury,Gloucestershire,GL8 8JG,Tel: 01666503020,No ratings yet Rate it yourself - /Services/careproviders/LeaveReview/DefaultView.aspx?id=1-403808907,0,0,,
Upton Mill Care Home,1-9267277259,SCL,Mercer Way,Off Quercus Road,,Tetbury,,GL8 8FH,Tel: 01666336600,No ratings yet Rate it yourself - /Services/careproviders/LeaveReview/DefaultView.aspx?id=1-9267277259,0,0,,
Aspire Care (SW) Tetbury,1-16566385226,SCL,Avening G2 Office Office Priory Park,London Road,,Tetbury,,GL8 8HZ,,No ratings yet Rate it yourself - /Services/careproviders/LeaveReview/DefaultView.aspx?id=1-16566385226,0,0,,
Saxon Care Solutions (Royal Wootton Bassett),1-11223839188,SCL,Bowman House Business Centre,"Whitehill Industrial Estate, Whitehill Lane, Royal Wootton Bassett",,Swindon,,SN4 7DB,Tel: 01249705050,No ratings yet Rate it yourself - /Services/careproviders/LeaveReview/DefaultView.aspx?id=1-11223839188,0,0,,
Fresh Springs Care Limited,1-17596360253,SCL,"Fresh Springs Care Limited, Office 83, Bowman Court","Whitehill Industrial Estate, Whitehill Lane, Royal Wootton Bassett",,Swindon,,SN4 7DB,Tel: 07507864955,No ratings yet Rate it yourself - /Services/careproviders/LeaveReview/DefaultView.aspx?id=1-17596360253,0,0,,
Voyage (DCA) Wiltshire,1-3900991399,SCL,Bowman House Business Centre,"Bowman Court, Whitehill Lane, Royal Wootton Bassett",,Swindon,,SN4 7DB,Tel: 01793967290,No ratings yet Rate it yourself - /Services/careproviders/LeaveReview/DefaultView.aspx?id=1-3900991399,0,0,,
Riverside Care Solutions,1-18046653325,SCL,"Unit 33 Bowman House Business Centre, Bowman House","Whitehill Industrial Estate, Whitehill Lane, Royal Wootton Bassett",,Swindon,,SN4 7DB,Tel: 01793967350,No ratings yet Rate it yourself - /Services/careproviders/LeaveReview/DefaultView.aspx?id=1-18046653325,0,0,,
Ballards Ash,1-122255993,SCL,Brinkworth Road,,,Wotton Bassett,Wiltshire,SN4 8DS,Tel: 01793840807,No ratings yet Rate it yourself - /Services/careproviders/LeaveReview/DefaultView.aspx?id=1-122255993,0,0,,
OSJCT Ridgeway House,1-122152429,SCL,The Lawns,,,Wootton Bassett,Wiltshire,SN4 7AN,Tel: 01793852521,No ratings yet Rate it yourself - /Services/careproviders/LeaveReview/DefaultView.aspx?id=1-122152429,0,0,,
Honeysuckle Home Care Limited,1-10842355880,SCL,"Unit 5, Apsley House","50 High Street, Royal Wootton Bassett",,Swindon,,SN4 7AQ,Tel: 07557037492,No ratings yet Rate it yourself - /Services/careproviders/LeaveReview/DefaultView.aspx?id=1-10842355880,0,0,,
Miranda House,1-784319893,SCL,High Street,Royal Wootton Bassett,,Swindon,Wiltshire,SN4 7AH,Tel: 01793854458,2 ratings Rate it yourself - /Services/careproviders/LeaveReview/DefaultView.aspx?id=1-784319893,,,,
Marsh Farm Manor Care Home,1-17712327266,SCL,Coped Hall,Royal Wootton Bassett,,Swindon,,SN4 8ER,Tel: 01793310333,No ratings yet Rate it yourself - /Services/careproviders/LeaveReview/DefaultView.aspx?id=1-17712327266,0,0,,
Housing 21 - Dairy View,1-2418727578,SCL,Management Office,"Dairy View, Royal Wootton Bassett",,Swindon,Wiltshire,SN4 7FU,Tel: 03701924226,No ratings yet Rate it yourself - /Services/careproviders/LeaveReview/DefaultView.aspx?id=1-2418727578,0,0,,
Bassett House,1-193612357,SCL,Cloatley Crescent,off Station Road,,Wootton Bassett,Wiltshire,SN4 7FJ,Tel: 01793855415,No ratings yet Rate it yourself - /Services/careproviders/LeaveReview/DefaultView.aspx?id=1-193612357,0,0,,
OSJCT The Cedars,1-122152508,SCL,High Street,,,Purton,Wiltshire,SN5 4AF,Tel: 01793772036,No ratings yet Rate it yourself - /Services/careproviders/LeaveReview/DefaultView.aspx?id=1-122152508,0,0,,
Head Office,1-9412949366,SCL,JB Haulage C/O Bespoke Guardians,"Unit 1 Braydon Lane Garage, Cricklade",,Swindon,,SN6 6HQ,Tel: 01793987157,No ratings yet Rate it yourself - /Services/careproviders/LeaveReview/DefaultView.aspx?id=1-9412949366,0,0,,
Rainbow Trust Offices at Church Farm,1-2304719659,SCL,Middle Common,Kington Langley,,Chippenham,,SN15 5NN,Tel: 07580510915,No ratings yet Rate it yourself - /Services/careproviders/LeaveReview/DefaultView.aspx?id=1-2304719659,0,0,,
Goatacre Manor Care Centre,1-580097053,SCL,Goatacre Lane,Goatacre,,Calne,Wiltshire,SN11 9HY,Tel: 01249 760464,No ratings yet Rate it yourself - /Services/careproviders/LeaveReview/DefaultView.aspx?id=1-580097053,0,0,,
Ashgrove House Nursing Home,1-117360070,SCL,63 Station Road,Purton,,Swindon,Wiltshire,SN5 4AJ,,No ratings yet Rate it yourself - /Services/careproviders/LeaveReview/DefaultView.aspx?id=1-117360070,0,0,,
The Fairways Retirement Village,1-1300895321,SCL,Malmesbury Road,,,Chippenham,Wiltshire,SN15 5LJ,Tel: 01249705060,No ratings yet Rate it yourself - /Services/careproviders/LeaveReview/DefaultView.aspx?id=1-1300895321,0,0,,
The Fairways,1-597503588,SCL,Malmesbury Road,,,Chippenham,,SN15 5LJ,Tel: 01249461239,No ratings yet Rate it yourself - /Services/careproviders/LeaveReview/DefaultView.aspx?id=1-597503588,0,0,,
The Lakes Care Centre,1-3289591210,SCL,Spine Road East,South Cerney,,Cirencester,Gloucestershire,GL7 5TL,Tel: 01285314141,No ratings yet Rate it yourself - /Services/careproviders/LeaveReview/DefaultView.aspx?id=1-3289591210,0,0,,
Cepen Lodge,1-135769079,SCL,West Cepen Way,,,Chippenham,Wiltshire,SN14 6UZ,Tel: 01249707280,1 rating Rate it yourself - /Services/careproviders/LeaveReview/DefaultView.aspx?id=1-135769079,,,,
Elm Grove Care Home,1-130120350,SCL,Somerford Road,,,Cirencester,Gloucestershire,GL7 1TX,Tel: 01285653057,No ratings yet Rate it yourself - /Services/careproviders/LeaveReview/DefaultView.aspx?id=1-130120350,0,0,,
Pearl's ProCare Ltd,1-15979191088,SCL,Unit 9,"Cirencester Office Park, Tetbury Road",,Cirencester,Gloucestershire,GL7 6JJ,,No ratings yet Rate it yourself - /Services/careproviders/LeaveReview/DefaultView.aspx?id=1-15979191088,0,0,,
Consider Care Limited,1-16377649442,SCL,Unit 9,"Cirencester Office Park, Tetbury Road",,Cirencester,Gloucestershire,GL7 6JJ,Tel: 07454978704,No ratings yet Rate it yourself - /Services/careproviders/LeaveReview/DefaultView.aspx?id=1-16377649442,0,0,,
United Response - 74 Oaklands,1-123018384,SCL,74 Oaklands,,,Chippenham,Wiltshire,SN15 1RQ,Tel: 01249654293,No ratings yet Rate it yourself - /Services/careproviders/LeaveReview/DefaultView.aspx?id=1-123018384,0,0,,
Advent Adds Care Limited,1-16421996626,SCL,Regus House,"Windmill Hill Business Park, Whitehill Way",,Swindon,,SN5 6QR,Tel: 07455930177,No ratings yet Rate it yourself - /Services/careproviders/LeaveReview/DefaultView.aspx?id=1-16421996626,0,0,,
247 Home Care Ltd,1-5958981572,SCL,"Regus House, Windmill Hill Business Park",Whitehill Way,,Swindon,,SN5 6QR,Tel: 01793441808,No ratings yet Rate it yourself - /Services/careproviders/LeaveReview/DefaultView.aspx?id=1-5958981572,0,0,,
Careful Care Limited,1-758994009,SCL,"Suite 3, Security House",82C Chesterton Lane,,Cirencester,,GL7 1YD,Tel: 01285640420,No ratings yet Rate it yourself - /Services/careproviders/LeaveReview/DefaultView.aspx?id=1-758994009,0,0,,
3 Ferrers Drive,1-859143446,SCL,Grange Park,,,Swindon,Wiltshire,SN5 6HJ,Tel: 01793875898,No ratings yet Rate it yourself - /Services/careproviders/LeaveReview/DefaultView.aspx?id=1-859143446,0,0,,
7 Eworth Close,1-859236809,SCL,Grange Park,,,Swindon,Wiltshire,SN5 6JG,Tel: 01793878169,No ratings yet Rate it yourself - /Services/careproviders/LeaveReview/DefaultView.aspx?id=1-859236809,0,0,,
13 Greenway Park,1-1627453213,SCL,13 Greenway Park,,,Chippenham,Wiltshire,SN15 1QG,Tel: 01249443965,No ratings yet Rate it yourself - /Services/careproviders/LeaveReview/DefaultView.aspx?id=1-1627453213,0,0,,
Cotswolds Rise Residential Care Home,1-17710678118,SCL,Upper Mill,Purton,,Swindon,,SN5 4FL,Tel: 01793208090,No ratings yet Rate it yourself - /Services/careproviders/LeaveReview/DefaultView.aspx?id=1-17710678118,0,0,,
Cocklebury Farmhouse,1-1627452830,SCL,Cocklebury Lane,Off Darcy Close,,Chippenham,Wiltshire,SN15 3QW,Tel: 01249658670,No ratings yet Rate it yourself - /Services/careproviders/LeaveReview/DefaultView.aspx?id=1-1627452830,0,0,,
79 Malmesbury Road,1-1627453128,SCL,79 Malmesbury Road,,,Chippenham,Wiltshire,SN15 1PX,Tel: 01249651992,No ratings yet Rate it yourself - /Services/careproviders/LeaveReview/DefaultView.aspx?id=1-1627453128,0,0,,
EL ROI 3 Care Solutions Limited,1-15519363927,SCL,Suite 110 Watermoor Point,Watermoor Road,,Cirencester,,GL7 1LF,,No ratings yet Rate it yourself - /Services/careproviders/LeaveReview/DefaultView.aspx?id=1-15519363927,0,0,,
Celtic Care Services Limited,1-121821046,SCL,76 Curlew Drive,,,Chippenham,Wiltshire,SN14 6YQ,Tel: 01249651908,No ratings yet Rate it yourself - /Services/careproviders/LeaveReview/DefaultView.aspx?id=1-121821046,0,0,,
The Priory Care Home,1-111442196,SCL,Greenway Lane,,,Chippenham,Wiltshire,SN15 1AA,Tel: 01249652153,No ratings yet Rate it yourself - /Services/careproviders/LeaveReview/DefaultView.aspx?id=1-111442196,0,0,,
OSJCT Paternoster House - Gloucestershire,1-122144929,SCL,Watermoor Road,,,Cirencester,Gloucestershire,GL7 1JR,Tel: 01285653699,No ratings yet Rate it yourself - /Services/careproviders/LeaveReview/DefaultView.aspx?id=1-122144929,0,0,,
Watermoor House,1-5286580547,SCL,Watermoor Road,,,Cirencester,,GL7 1JR,Tel: 01285654864,No ratings yet Rate it yourself - /Services/careproviders/LeaveReview/DefaultView.aspx?id=1-5286580547,0,0,,
Ordinary Life Project Association - 18 Boundary Road,1-120666301,SCL,18 Boundary Road,,,Chippenham,Wiltshire,SN15 3NN,Tel: 01249656255,No ratings yet Rate it yourself - /Services/careproviders/LeaveReview/DefaultView.aspx?id=1-120666301,0,0,,
Link Direct Care Limited,1-16523823641,SCL,6 Poseidon Close,,,Swindon,,SN25 2LY,Tel: 07545058937,No ratings yet Rate it yourself - /Services/careproviders/LeaveReview/DefaultView.aspx?id=1-16523823641,0,0,,
Housing 21 - Mulberry Court,1-341216702,SCL,Middle Mead,,,Cirencester,Gloucestershire,GL7 1GG,Tel: 03701924000,No ratings yet Rate it yourself - /Services/careproviders/LeaveReview/DefaultView.aspx?id=1-341216702,0,0,,
Ferfoot Care Home,1-786964474,SCL,"Old and New House,The Folly",Old Hardenhuish Lane,,Chippenham,Wiltshire,SN14 6HH,Tel: 01249658677,No ratings yet Rate it yourself - /Services/careproviders/LeaveReview/DefaultView.aspx?id=1-786964474,0,0,,
Helping Hands Cirencester,1-11730395329,SCL,31 Castle Street,,,Cirencester,,GL7 1QD,Tel: 01285708223,No ratings yet Rate it yourself - /Services/careproviders/LeaveReview/DefaultView.aspx?id=1-11730395329,0,0,,
Wiltshire Council Reablement Service (Chippenham Hub),1-5488949083,SCL,Monkton Park Offices,Monkton Hill,,Chippenham,,SN15 1ER,Tel: 03004560111,No ratings yet Rate it yourself - /Services/careproviders/LeaveReview/DefaultView.aspx?id=1-5488949083,0,0,,
Tabitha Care Group Limited,1-15818446783,SCL,9 Stoneywell,Tadpole Garden Village,,Swindon,,SN25 2RR,Tel: 07723758917,No ratings yet Rate it yourself - /Services/careproviders/LeaveReview/DefaultView.aspx?id=1-15818446783,0,0,,
Wiltshire Base,1-18362177345,SCL,"Room 10, Station Hill House",Station Hill,,Chippenham,,SN15 1EQ,Tel: 02036893318,No ratings yet Rate it yourself - /Services/careproviders/LeaveReview/DefaultView.aspx?id=1-18362177345,0,0,,
Ashgables House,1-126983371,SCL,Oak Lodge Close,,,Chippenham,Wiltshire,SN15 1NG,Tel: 01249658498,No ratings yet Rate it yourself - /Services/careproviders/LeaveReview/DefaultView.aspx?id=1-126983371,0,0,,
Right at Home Swindon,1-1988132466,SCL,Unit 21,"Clearwater Business Park, Frankland Road, Blagrove",,Swindon,,SN5 8YZ,Tel: 01793290029,No ratings yet Rate it yourself - /Services/careproviders/LeaveReview/DefaultView.aspx?id=1-1988132466,0,0,,
Meadow Lodge,1-109951064,SCL,Sadlers Mead,Monkton Park,,Chippenham,Wiltshire,SN15 3PE,Tel: 01249656136,No ratings yet Rate it yourself - /Services/careproviders/LeaveReview/DefaultView.aspx?id=1-109951064,0,0,,
OSJCT Seymour House,1-122152445,SCL,Monkton Park,,,Chippenham,Wiltshire,SN15 3PE,Tel: 01249653564,No ratings yet Rate it yourself - /Services/careproviders/LeaveReview/DefaultView.aspx?id=1-122152445,0,0,,
Middlefields House,1-11356647769,SCL,Middlefields House,Cornfields,,Chippenham,,SN14 6GA,,No ratings yet Rate it yourself - /Services/careproviders/LeaveReview/DefaultView.aspx?id=1-11356647769,0,0,,
Radfield Home Care Chippenham & North Wiltshire,1-13422110208,SCL,"Suite A, First Floor",3-4 New Road,,Chippenham,,SN15 1EJ,Tel: 07544389701,No ratings yet Rate it yourself - /Services/careproviders/LeaveReview/DefaultView.aspx?id=1-13422110208,0,0,,
Moriel Healthcare Ltd,1-18687552412,SCL,15 Gosditch Street,,,Cirencester,,GL7 2AG,,No ratings yet Rate it yourself - /Services/careproviders/LeaveReview/DefaultView.aspx?id=1-18687552412,0,0,,
Expert Care Solutions Swindon,1-17920175050,SCL,16 Basepoint Business Centre,"Rivermead Industrial Estate, Rivermead Drive, Westlea",,Swindon,,SN5 7EX,Tel: 07828916561,No ratings yet Rate it yourself - /Services/careproviders/LeaveReview/DefaultView.aspx?id=1-17920175050,0,0,,
SylvianCare Swindon,1-16408569855,SCL,55 Basepoint Business Centre,"Rivermead Industrial Estate, Rivermead Drive, Westlea",,Swindon,,SN5 7EX,Tel: 01793238894,No ratings yet Rate it yourself - /Services/careproviders/LeaveReview/DefaultView.aspx?id=1-16408569855,0,0,,
Aspire Care Personnel Limited - Main Office,1-18885875389,SCL,Office No.44,"Rivermead Drive, Westlea",,Swindon,,SN5 7EX,Tel: 03333394148,No ratings yet Rate it yourself - /Services/careproviders/LeaveReview/DefaultView.aspx?id=1-18885875389,0,0,,
The Old Vicarage,1-120946460,SCL,54 St Mary Street,,,Chippenham,Wiltshire,SN15 3JW,Tel: 01249 653838,No ratings yet Rate it yourself - /Services/careproviders/LeaveReview/DefaultView.aspx?id=1-120946460,0,0,,
Mabikacare Limited,1-13932100205,SCL,1 River Street,,,Chippenham,,SN15 3ED,Tel: 07577958414,No ratings yet Rate it yourself - /Services/careproviders/LeaveReview/DefaultView.aspx?id=1-13932100205,0,0,,
Agincare Enable Limited (Wiltshire and Swindon),1-13264121131,SCL,"AGINCARE, Absol House",Ivy Road Industrial Estate,,Chippenham,,SN15 1SB,Tel: 07458121880,No ratings yet Rate it yourself - /Services/careproviders/LeaveReview/DefaultView.aspx?id=1-13264121131,0,0,,
Agincare UK Chippenham,1-134638575,SCL,Absol House,Ivy Road Industrial Estate,,Chippenham,Wiltshire,SN15 1SB,Tel: 01249652111,No ratings yet Rate it yourself - /Services/careproviders/LeaveReview/DefaultView.aspx?id=1-134638575,0,0,,
The Firs Home Care Ltd,1-8367272388,SCL,31 Market Place,,,Chippenham,,SN15 3HP,Tel: 01249814246,No ratings yet Rate it yourself - /Services/careproviders/LeaveReview/DefaultView.aspx?id=1-8367272388,0,0,,
Glanmor,1-116752589,SCL,Bath Road,,,Chippenham,Wiltshire,SN15 2AD,Tel: 01249651336,No ratings yet Rate it yourself - /Services/careproviders/LeaveReview/DefaultView.aspx?id=1-116752589,0,0,,
Ashley House Care Home,1-126434033,SCL,118 Trafalgar Road,,,Cirencester,Gloucestershire,GL7 2ED,Tel: 01285650671,No ratings yet Rate it yourself - /Services/careproviders/LeaveReview/DefaultView.aspx?id=1-126434033,0,0,,
Stroud Court Community Trust,1-113600545,SCL,Stroud Court,"Longfords, Minchinhampton",,Stroud,Gloucestershire,GL6 9AN,Tel: 01453834020,No ratings yet Rate it yourself - /Services/careproviders/LeaveReview/DefaultView.aspx?id=1-113600545,0,0,,
Saxon Care (Chippenham),1-196452882,SCL,Saxon Court,21 Gladstone Road,,Chippenham,Wiltshire,SN15 3BW,Tel: 01249 705050,No ratings yet Rate it yourself - /Services/careproviders/LeaveReview/DefaultView.aspx?id=1-196452882,0,0,,
Winners Trophy,1-14774008368,SCL,113 Redhouse Way,,,Swindon,Wiltshire,SN25 2AY,Tel: 07837599993,No ratings yet Rate it yourself - /Services/careproviders/LeaveReview/DefaultView.aspx?id=1-14774008368,0,0,,
Flowers Manor,1-11581963732,SCL,1 Wood Lane,,,Chippenham,,SN15 3DQ,Tel: 01275472069,No ratings yet Rate it yourself - /Services/careproviders/LeaveReview/DefaultView.aspx?id=1-11581963732,0,0,,
YourLife (Chippenham),1-2470597708,SCL,Bowles Court,Westmead Lane,,Chippenham,Wiltshire,SN15 3GU,Tel: 01249654954,No ratings yet Rate it yourself - /Services/careproviders/LeaveReview/DefaultView.aspx?id=1-2470597708,0,0,,
Cera - Wiltshire,1-3909503976,SCL,Carlton Business Centre,"Carlton House, Maundrell Road",,Calne,,SN11 9PU,Tel: 01380825146,No ratings yet Rate it yourself - /Services/careproviders/LeaveReview/DefaultView.aspx?id=1-3909503976,0,0,,
Orchid Care Home,1-2219000486,SCL,Guernsey Lane (Off Torun Way),,,Swindon,,SN25 1UZ,Tel: 01793753336,1 rating Rate it yourself - /Services/careproviders/LeaveReview/DefaultView.aspx?id=1-2219000486,,,,
Charlton Court,1-18444374146,SCL,"Suite 5, Lansdowne Business Centre","Lansdowne Court, Bumpers Way, Bumpers Farm",,Chippenham,,SN14 6RZ,Tel: 07886959876,No ratings yet Rate it yourself - /Services/careproviders/LeaveReview/DefaultView.aspx?id=1-18444374146,0,0,,
Dimensions South West Counties Domiciliary Care Office,1-1643906081,SCL,Unit 7,"Granville House, Bumpers Way, Bumpers Farm",,Chippenham,,SN14 6RZ,Tel: 03003039098,No ratings yet Rate it yourself - /Services/careproviders/LeaveReview/DefaultView.aspx?id=1-1643906081,0,0,,
Blakehill Healthcare,1-9672774911,SCL,"Suite 8-9, Lansdowne Business Centre","Lansdowne Court, Bumpers Way, Bumpers Farm",,Chippenham,,SN14 6RZ,Tel: 07877543889,No ratings yet Rate it yourself - /Services/careproviders/LeaveReview/DefaultView.aspx?id=1-9672774911,0,0,,
Dimensions Oxfordshire & Warwickshire Domiciliary Care Office,1-10859240015,SCL,Unit 7,"Lansdowne Court, Bumpers Way, Bumpers Farm",,Chippenham,,SN14 6RZ,Tel: 07943514289,No ratings yet Rate it yourself - /Services/careproviders/LeaveReview/DefaultView.aspx?id=1-10859240015,0,0,,
Nimble Care,1-9124014249,SCL,"Suite 12, Lansdowne Court, Business Centre",Bumpers Farm,,Chippenham,,SN14 6RZ,Tel: 01249444022,No ratings yet Rate it yourself - /Services/careproviders/LeaveReview/DefaultView.aspx?id=1-9124014249,0,0,,
"Retain Healthcare Ltd, Chippenham",1-6905198385,SCL,Unit 7,"Industry Park, Cricketts Lane",,Chippenham,,SN15 3EQ,Tel: 01249444900,No ratings yet Rate it yourself - /Services/careproviders/LeaveReview/DefaultView.aspx?id=1-6905198385,0,0,,
Ordinary Life Project Association - 15 Mossmead,1-120666281,SCL,15 Mossmead,,,Chippenham,Wiltshire,SN14 0TN,Tel: 01249461587,No ratings yet Rate it yourself - /Services/careproviders/LeaveReview/DefaultView.aspx?id=1-120666281,0,0,,
Cote House,1-129459329,SCL,24 Rowden Hill,,,Chippenham,Wiltshire,SN15 2AG,Tel: 01249653760,No ratings yet Rate it yourself - /Services/careproviders/LeaveReview/DefaultView.aspx?id=1-129459329,0,0,,
The White Horse Care Trust Supported Living and Outreach Service,1-466337314,SCL,D603 Delta Office Park,Welton Road,,Swindon,,SN5 7XF,Tel: 01793846000,No ratings yet Rate it yourself - /Services/careproviders/LeaveReview/DefaultView.aspx?id=1-466337314,0,0,,
Avon Court Care Home,1-3003785287,SCL,St Francis Avenue,,,Chippenham,Wiltshire,SN15 2SE,Tel: 01249660055,No ratings yet Rate it yourself - /Services/careproviders/LeaveReview/DefaultView.aspx?id=1-3003785287,0,0,,
United Response - Wiltshire DCA,1-123018440,SCL,"Unit 1, Sheldon Business Park",Sheldon Corner,,Chippenham,Wiltshire,SN14 0RQ,Tel: 01249765504,No ratings yet Rate it yourself - /Services/careproviders/LeaveReview/DefaultView.aspx?id=1-123018440,0,0,,
Stratton Court,1-17065010624,SCL,Gloucester Road,"Stratton,",,Cirencester,,GL7 2NB,Tel: 01285283132,No ratings yet Rate it yourself - /Services/careproviders/LeaveReview/DefaultView.aspx?id=1-17065010624,0,0,,
Fessey House,1-2929241444,SCL,Brookdene,Haydon Wick,,Swindon,Wiltshire,SN25 1RY,Tel: 01793725844,1 rating Rate it yourself - /Services/careproviders/LeaveReview/DefaultView.aspx?id=1-2929241444,,,,
Cura Homecare,1-3289574866,SCL,"Unit 5 Rowan House, Sheldon Business Park","Sheldon Corner, Sheldon",,Chippenham,,SN14 0SQ,Tel: 01249463880,No ratings yet Rate it yourself - /Services/careproviders/LeaveReview/DefaultView.aspx?id=1-3289574866,0,0,,
Eleos Care Limited,1-9042063915,SCL,11 Elgar Close,,,Swindon,,SN25 2HG,Tel: 07983812200,No ratings yet Rate it yourself - /Services/careproviders/LeaveReview/DefaultView.aspx?id=1-9042063915,0,0,,
Comfcare Main Office,1-9475619335,SCL,Unit 6,"Darby Close, Cheney Manor Industrial Estate",,Swindon,Wiltshire,SN2 2PN,Tel: 01793387220,No ratings yet Rate it yourself - /Services/careproviders/LeaveReview/DefaultView.aspx?id=1-9475619335,0,0,,
Crystal Caring,1-2276794585,SCL,Nexus Business Centre,6 Darby Close,,Swindon,Wiltshire,SN2 2PN,Tel: 01793915261,No ratings yet Rate it yourself - /Services/careproviders/LeaveReview/DefaultView.aspx?id=1-2276794585,0,0,,
Southwest Homecare Solutions Limited,1-4182274310,SCL,Nexus Business Centre,"6 Darby Close, Cheney Manor Industrial Estate",,Swindon,Wiltshire,SN2 2PN,Tel: 03300245864,No ratings yet Rate it yourself - /Services/careproviders/LeaveReview/DefaultView.aspx?id=1-4182274310,0,0,,
First City Nursing Services,1-3850416251,SCL,First City House,114 Darby Close,,Swindon,Wiltshire,SN2 2PN,Tel: 01793612339,No ratings yet Rate it yourself - /Services/careproviders/LeaveReview/DefaultView.aspx?id=1-3850416251,0,0,,
Caring@Home Ltd,1-11506615795,SCL,Nexus Business Centre,6 Darby Close,,Swindon,Wiltshire,SN2 2PN,Tel: 01793915051,No ratings yet Rate it yourself - /Services/careproviders/LeaveReview/DefaultView.aspx?id=1-11506615795,0,0,,
Family Support Care Limited,1-6756369590,SCL,"5 The Meads Business Centre, Ashworth Road",Bridgemead,,Swindon,,SN5 7YJ,Tel: 07944946343,No ratings yet Rate it yourself - /Services/careproviders/LeaveReview/DefaultView.aspx?id=1-6756369590,0,0,,