Organisation Name,NACS Code,Organisation Type,Address1,Address2,Address3,Address4,Address5,PostCode,Telephone Number,NHS.UK users rating,Value  (NHS.UK users rating),Banding Classification  (NHS.UK users rating),Car parking (Is there car parking at this organisation?),Disabled access (Disabled access)
Regency Retirement Home,1-7784184905,SCL,52 Regent Street,,,Stonehouse,Gloucestershire,GL10 2AD,Tel: 01453823139,No ratings yet Rate it yourself - /Services/careproviders/LeaveReview/DefaultView.aspx?id=1-7784184905,0,0,,
Carich Care Limited,1-6398650126,SCL,Coedway,4 Bristol Road,,Stonehouse,,GL10 2BQ,Tel: 07952806180,No ratings yet Rate it yourself - /Services/careproviders/LeaveReview/DefaultView.aspx?id=1-6398650126,0,0,,
Fieldview,1-118835085,SCL,Pearcroft Road,Stonehouse,,Gloucester,Gloucestershire,GL10 2JY,Tel: 01453791320,No ratings yet Rate it yourself - /Services/careproviders/LeaveReview/DefaultView.aspx?id=1-118835085,0,0,,
Moreton Hill Care Centre,1-125861524,SCL,Standish,,,Stonehouse,Gloucestershire,GL10 3BZ,Tel: 01453826000,No ratings yet Rate it yourself - /Services/careproviders/LeaveReview/DefaultView.aspx?id=1-125861524,0,0,,
Learning Together Limited,1-203739848,SCL,The Wheelhouse North 2nd B,Bond's Mill Estate,,Stonehouse,,GL10 3RF,Tel: 01453823400,No ratings yet Rate it yourself - /Services/careproviders/LeaveReview/DefaultView.aspx?id=1-203739848,0,0,,
HF Trust - Stroud DCA,1-4049603495,SCL,Ryeford Court,12 Ebley Road,,Stonehouse,Gloucestershire,GL10 2LQ,Tel: 01453820940,No ratings yet Rate it yourself - /Services/careproviders/LeaveReview/DefaultView.aspx?id=1-4049603495,0,0,,
Ultimate Independence Care Ltd,1-11933139638,SCL,14 Maurice Shill Close,Great Oldbury,,Stonehouse,Gloucestershire,GL10 3FR,Tel: 01453704572,No ratings yet Rate it yourself - /Services/careproviders/LeaveReview/DefaultView.aspx?id=1-11933139638,0,0,,
HF Trust - 330 Westward Road,1-120701939,SCL,330 Westward Road,Ebley,,Stroud,Gloucestershire,GL5 4TU,Tel: 01453823852,No ratings yet Rate it yourself - /Services/careproviders/LeaveReview/DefaultView.aspx?id=1-120701939,0,0,,
Oldbury House Care Home,1-1643534031,SCL,Bristol Road,,,Stonehouse,Gloucestershire,GL10 3RT,Tel: 01453791513,No ratings yet Rate it yourself - /Services/careproviders/LeaveReview/DefaultView.aspx?id=1-1643534031,0,0,,
Willow House,1-15275356499,SCL,Willow House,Chipmans Platt,,Stonehouse,,GL10 3SQ,Tel: 01453824025,No ratings yet Rate it yourself - /Services/careproviders/LeaveReview/DefaultView.aspx?id=1-15275356499,0,0,,
Highborder Lodge,1-2700865515,SCL,Marsh Lane,,,Leonard Stanley,Gloucestershire,GL10 3NJ,Tel: 01453823203,No ratings yet Rate it yourself - /Services/careproviders/LeaveReview/DefaultView.aspx?id=1-2700865515,0,0,,
More Hall Convent,1-118089018,SCL,SR ELSY Poonoly,More Hall Convent Randwick,,Stroud,Gloucestershire,GL6 6EP,Tel: 01453764486,No ratings yet Rate it yourself - /Services/careproviders/LeaveReview/DefaultView.aspx?id=1-118089018,0,0,,
Scarlet House,1-1648817611,SCL,123 Westward Road,Ebley,,Stroud,Gloucestershire,GL5 4SP,Tel: 01453769810,1 rating Rate it yourself - /Services/careproviders/LeaveReview/DefaultView.aspx?id=1-1648817611,,,,
Five Valleys Care LTD,1-10689541544,SCL,"Suite 11, Westend Courtyard","Grove Lane, Westend",,Stonehouse,,GL10 3SL,Tel: 01453368036,No ratings yet Rate it yourself - /Services/careproviders/LeaveReview/DefaultView.aspx?id=1-10689541544,0,0,,
Cotswold House Care Home,1-134086202,SCL,Church Road,Cainscross,,Stroud,Gloucestershire,GL5 4JE,Tel: 01453 752699,1 rating Rate it yourself - /Services/careproviders/LeaveReview/DefaultView.aspx?id=1-134086202,,,,
Longhouse,1-115336951,SCL,"Longhouse, 6 Whitehouse Park",Cainscross,,Stroud,Gloucestershire,GL5 4LD,Tel: 01452583690,No ratings yet Rate it yourself - /Services/careproviders/LeaveReview/DefaultView.aspx?id=1-115336951,0,0,,
Althea Park House,1-468470027,SCL,51 Stratford Road,,,Stroud,Gloucestershire,GL5 4AJ,Tel: 01453767096,No ratings yet Rate it yourself - /Services/careproviders/LeaveReview/DefaultView.aspx?id=1-468470027,0,0,,
Gannicox CIC Domiciliary Care Agency,1-1795793231,SCL,"Flat 8, Whittington House",59 Cainscross Road,,Stroud,Gloucestershire,GL5 4EX,Tel: 07979935359,No ratings yet Rate it yourself - /Services/careproviders/LeaveReview/DefaultView.aspx?id=1-1795793231,0,0,,
A+bility,1-3749875621,SCL,"13 Salmon Springs, Stroud",Gloucestershire,,Stroud,,GL6 6NU,Tel: 01453827978,No ratings yet Rate it yourself - /Services/careproviders/LeaveReview/DefaultView.aspx?id=1-3749875621,0,0,,
St Martin's Centre,1-180229789,SCL,Stratford Lawn,,,Stroud,Gloucestershire,GL5 4AP,Tel: 01453763793,No ratings yet Rate it yourself - /Services/careproviders/LeaveReview/DefaultView.aspx?id=1-180229789,0,0,,
The Gables,1-114375431,SCL,Lovedays Mead,Folly Lane,,Stroud,Gloucestershire,GL5 1SB,,No ratings yet Rate it yourself - /Services/careproviders/LeaveReview/DefaultView.aspx?id=1-114375431,0,0,,
Flexy Care - Main Office,1-14548097371,SCL,17 George Street,,,Stroud,,GL5 3DP,Tel: 01453764922,No ratings yet Rate it yourself - /Services/careproviders/LeaveReview/DefaultView.aspx?id=1-14548097371,0,0,,
Penna Homecare Limited,1-2164206604,SCL,Willow House,Slad Road,,Stroud,Gloucestershire,GL5 1QJ,Tel: 01453756227,No ratings yet Rate it yourself - /Services/careproviders/LeaveReview/DefaultView.aspx?id=1-2164206604,0,0,,
Helping Hands Stroud,1-10496208458,SCL,Unit 11a Cornhill Shopping Centre,13 Union Street,,Stroud,,GL5 2JT,Tel: 07772880205,No ratings yet Rate it yourself - /Services/careproviders/LeaveReview/DefaultView.aspx?id=1-10496208458,0,0,,
Highfield House,1-118124431,SCL,London Road,,,Stroud,Gloucestershire,GL5 2AJ,Tel: 01453791320,No ratings yet Rate it yourself - /Services/careproviders/LeaveReview/DefaultView.aspx?id=1-118124431,0,0,,
Bluebird Care (Stroud and Cirencester),1-950639877,SCL,3b Nelson Street,,,Stroud,Gloucestershire,GL5 2HL,Tel: 01453757937,2 ratings Rate it yourself - /Services/careproviders/LeaveReview/DefaultView.aspx?id=1-950639877,,,,
Northfield House,1-122270923,SCL,Folly Lane,Uplands,,Stroud,Gloucestershire,GL5 1SP,Tel: 01453 488060,No ratings yet Rate it yourself - /Services/careproviders/LeaveReview/DefaultView.aspx?id=1-122270923,0,0,,
Resthaven Nursing Home,1-4000788982,SCL,Pitchcombe,,,Stroud,Gloucestershire,GL6 6LS,Tel: 01452812682,No ratings yet Rate it yourself - /Services/careproviders/LeaveReview/DefaultView.aspx?id=1-4000788982,0,0,,
Bosun Care Ltd,1-3136816188,SCL,"Ground Floor Office, Trixter House",London Road,,Stroud,Gloucestershire,GL5 2AY,Tel: 01453350654,5 ratings Rate it yourself - /Services/careproviders/LeaveReview/DefaultView.aspx?id=1-3136816188,,,,
Nobilis Care Gloucestershire,1-13486837488,SCL,Griffin Mill,"London Road, Thrupp",,Stroud,,GL5 2AZ,Tel: 01242650548,No ratings yet Rate it yourself - /Services/careproviders/LeaveReview/DefaultView.aspx?id=1-13486837488,0,0,,
The Old Vicarage Residential Home,1-128249482,SCL,Church End,,,Frampton-on-Severn,Gloucestershire,GL2 7EE,Tel: 01452740562,2 ratings Rate it yourself - /Services/careproviders/LeaveReview/DefaultView.aspx?id=1-128249482,,,,
Joyleen,1-487286938,SCL,Longlands,"Bristol Road, Cambridge",,Gloucester,Gloucestershire,GL2 7BG,Tel: 07906196634,No ratings yet Rate it yourself - /Services/careproviders/LeaveReview/DefaultView.aspx?id=1-487286938,0,0,,
Farecare Gloucestershire Limited,1-13310817842,SCL,Truthe House,"Bristol Road, Hardwicke",,Gloucester,,GL2 4RH,Tel: 01452442442,No ratings yet Rate it yourself - /Services/careproviders/LeaveReview/DefaultView.aspx?id=1-13310817842,0,0,,
Wisma Mulia,1-109785580,SCL,Bridge Road,Frampton-on-Severn,,Gloucester,Gloucestershire,GL2 7HE,Tel: 01452740432,No ratings yet Rate it yourself - /Services/careproviders/LeaveReview/DefaultView.aspx?id=1-109785580,0,0,,
Richmond Village Painswick,1-148228160,SCL,Stroud Road,Painswick,,Stroud,Gloucestershire,GL6 6UL,Tel: 01452813902,1 rating Rate it yourself - /Services/careproviders/LeaveReview/DefaultView.aspx?id=1-148228160,,,,
Richmond Village Painswick DCA,1-148228226,SCL,Stroud Road,Painswick,,Stroud,Gloucestershire,GL6 6UL,Tel: 01452813902,No ratings yet Rate it yourself - /Services/careproviders/LeaveReview/DefaultView.aspx?id=1-148228226,0,0,,
Head Office,1-2773135988,SCL,"11 The Glenmore Centre, Jessop Court","Waterwells Business Park, Quedgeley",,Gloucester,,GL2 2AP,Tel: 01452883011,No ratings yet Rate it yourself - /Services/careproviders/LeaveReview/DefaultView.aspx?id=1-2773135988,0,0,,
Cherry Tree Close,1-114568555,SCL,3 Cherry Tree Close,Nailsworth,,Stroud,Gloucestershire,GL6 0DX,Tel: 01453835023,No ratings yet Rate it yourself - /Services/careproviders/LeaveReview/DefaultView.aspx?id=1-114568555,0,0,,
CareMate Group Ltd,1-13949659215,SCL,Suite S08c Pure Offices,"Kestrel Court, Waterwells Drive",,Gloucester,,GL2 2AT,Tel: 01452224474,No ratings yet Rate it yourself - /Services/careproviders/LeaveReview/DefaultView.aspx?id=1-13949659215,0,0,,
Brandon Supported Living - Gloucestershire,1-350268228,SCL,"Kestrel Court, Waterwells Drive","Waterwells Business Park, Quedgeley",,Gloucester,Gloucestershire,GL2 2AT,Tel: 01452886307,No ratings yet Rate it yourself - /Services/careproviders/LeaveReview/DefaultView.aspx?id=1-350268228,0,0,,
Mary Rush Care,1-6553310534,SCL,"Unit G07 Kestrel Court, Waterwells Drive","Waterwells Business Park, Quedgeley",,Gloucester,,GL2 2AT,Tel: 01452346327,No ratings yet Rate it yourself - /Services/careproviders/LeaveReview/DefaultView.aspx?id=1-6553310534,0,0,,
Ram Personnel Healthcare,1-12591975171,SCL,"Kestrel Court, Waterwells Drive","Waterwells Business Park, Quedgeley",,Gloucester,Gloucestershire,GL2 2AT,Tel: 07723135133,No ratings yet Rate it yourself - /Services/careproviders/LeaveReview/DefaultView.aspx?id=1-12591975171,0,0,,
Heritage Healthcare Gloucester,1-3177038785,SCL,"Kestrel Court, Waterwells Drive","Waterwells Business Park, Quedgeley",,Gloucester,Gloucestershire,GL2 2AT,Tel: 01452 346 905,No ratings yet Rate it yourself - /Services/careproviders/LeaveReview/DefaultView.aspx?id=1-3177038785,0,0,,
Roselea,1-1584600418,SCL,Church End,,,Slimbridge,Gloucestershire,GL2 7BL,Tel: 01453890444,No ratings yet Rate it yourself - /Services/careproviders/LeaveReview/DefaultView.aspx?id=1-1584600418,0,0,,
Churchill Road,1-114568569,SCL,65 Churchill Road,Forest Green,,Nailsworth,Gloucestershire,GL6 0DE,Tel: 01453835023,No ratings yet Rate it yourself - /Services/careproviders/LeaveReview/DefaultView.aspx?id=1-114568569,0,0,,
Care 1st Homecare - Gloucestershire,1-4133315088,SCL,"Suite B, The Opus, Telford Way","Waterwells Business Park, Quedgeley",,Gloucester,Gloucestershire,GL2 2AB,Tel: 01452642452,No ratings yet Rate it yourself - /Services/careproviders/LeaveReview/DefaultView.aspx?id=1-4133315088,0,0,,
Winslow House,1-121964848,SCL,Springhill,Nailsworth,,Stroud,Gloucestershire,GL6 0LS,Tel: 01453832269,No ratings yet Rate it yourself - /Services/careproviders/LeaveReview/DefaultView.aspx?id=1-121964848,0,0,,
Corinium Care Limited,1-1783218801,SCL,George Street,Nailsworth,,Stroud,Gloucestershire,GL6 0AG,Tel: 01453839290,No ratings yet Rate it yourself - /Services/careproviders/LeaveReview/DefaultView.aspx?id=1-1783218801,0,0,,
The Steppes Residential Care Home,1-118124295,SCL,Cossack Square,Nailsworth,,Stroud,Gloucestershire,GL6 0DB,Tel: 01453832406,No ratings yet Rate it yourself - /Services/careproviders/LeaveReview/DefaultView.aspx?id=1-118124295,0,0,,
Old Dairy,1-114568597,SCL,The Old Dairy,Market Street,,Nailsworth,Gloucestershire,GL6 0BZ,Tel: 01453835023,No ratings yet Rate it yourself - /Services/careproviders/LeaveReview/DefaultView.aspx?id=1-114568597,0,0,,
Minchinhampton Centre for the Elderly - Horsfall House,1-118157088,SCL,Horsfall House,Windmill Road,,Stroud,Gloucestershire,GL6 9EY,,No ratings yet Rate it yourself - /Services/careproviders/LeaveReview/DefaultView.aspx?id=1-118157088,0,0,,
Horsfall House Homecare,1-118157115,SCL,Windmill Road,Minchinhampton,,Stroud,Gloucestershire,GL6 9EY,Tel: 01453886381,No ratings yet Rate it yourself - /Services/careproviders/LeaveReview/DefaultView.aspx?id=1-118157115,0,0,,
Wortley Villa,1-114568583,SCL,Bath Road,,,Nailsworth,Gloucestershire,GL6 0HH,Tel: 01453835023,No ratings yet Rate it yourself - /Services/careproviders/LeaveReview/DefaultView.aspx?id=1-114568583,0,0,,
Greathands Healthcare Ltd,1-15224833468,SCL,12 Sealand Way Kingsway,Quedgeley,,Gloucester,,GL2 2FP,Tel: 07495889995,No ratings yet Rate it yourself - /Services/careproviders/LeaveReview/DefaultView.aspx?id=1-15224833468,0,0,,
Ashleigh,1-114568611,SCL,Box crescent,3 Box Crescent,,Minchinhampton,Gloucestershire,GL6 9DJ,Tel: 01453835023,No ratings yet Rate it yourself - /Services/careproviders/LeaveReview/DefaultView.aspx?id=1-114568611,0,0,,
4 Box Crescent,1-7613377129,SCL,4 Box Crescent,Minchinhampton,,Stroud,,GL6 9DJ,Tel: 01453835023,No ratings yet Rate it yourself - /Services/careproviders/LeaveReview/DefaultView.aspx?id=1-7613377129,0,0,,
Ruskin Mill College,1-9252838046,SCL,The Fisheries,Horsley,,Stroud,,GL6 0PL,Tel: 01453837500,No ratings yet Rate it yourself - /Services/careproviders/LeaveReview/DefaultView.aspx?id=1-9252838046,0,0,,
The Lawns,1-1837539508,SCL,"The Lawns, 346 Bristol Road",Quedgeley,,Gloucester,Gloucestershire,GL2 4QW,Tel: 01452721345,No ratings yet Rate it yourself - /Services/careproviders/LeaveReview/DefaultView.aspx?id=1-1837539508,0,0,,
Longridge Court,1-1475546723,SCL,Bulls Cross,,,Stroud,Gloucestershire,GL6 7HU,Tel: 01452814341,No ratings yet Rate it yourself - /Services/careproviders/LeaveReview/DefaultView.aspx?id=1-1475546723,0,0,,
Paradise House Painswick,1-121465865,SCL,Painswick,,,Painswick,Gloucestershire,GL6 6TN,Tel: 01453837557,No ratings yet Rate it yourself - /Services/careproviders/LeaveReview/DefaultView.aspx?id=1-121465865,0,0,,
Rebe,1-132686642,SCL,41 Holbeach Drive,,,Kingsway,Gloucestershire,GL2 2BF,Tel: 01452722125,No ratings yet Rate it yourself - /Services/careproviders/LeaveReview/DefaultView.aspx?id=1-132686642,0,0,,
OSJCT Chestnut Court,1-122144843,SCL,St James,Quedgeley,,Gloucester,Gloucestershire,GL2 4WD,Tel: 01452720049,1 rating Rate it yourself - /Services/careproviders/LeaveReview/DefaultView.aspx?id=1-122144843,,,,
The Hollies Nursing Home,1-115727385,SCL,Drake Lane,,,Dursley,Gloucestershire,GL11 5HA,,No ratings yet Rate it yourself - /Services/careproviders/LeaveReview/DefaultView.aspx?id=1-115727385,0,0,,
Holly Oak Care Centre,1-10159980101,SCL,Holly Drive,Drake Lane,,Dursley,,GL11 5HA,Tel: 01453541400,No ratings yet Rate it yourself - /Services/careproviders/LeaveReview/DefaultView.aspx?id=1-10159980101,0,0,,
Severn Sunrise Homecare Limited,1-2939371900,SCL,52 Curtis Hayward Drive,Quedgeley,,Gloucester,Gloucestershire,GL2 4WL,Tel: 01452904009,No ratings yet Rate it yourself - /Services/careproviders/LeaveReview/DefaultView.aspx?id=1-2939371900,0,0,,
Community Outreach Consultancy Ltd,1-11653855285,SCL,Ferendells,"Fidges Lane, Eastcombe",,Stroud,,GL6 7DW,Tel: 01452771257,No ratings yet Rate it yourself - /Services/careproviders/LeaveReview/DefaultView.aspx?id=1-11653855285,0,0,,
Acorn to Oak Homecare,1-5075426927,SCL,"Unit 28 SBC, Olympus Park",Quedgeley,,Gloucester,,GL2 4AL,Tel: 01452345134,No ratings yet Rate it yourself - /Services/careproviders/LeaveReview/DefaultView.aspx?id=1-5075426927,0,0,,
Stroud Court Community Trust,1-113600545,SCL,Stroud Court,"Longfords, Minchinhampton",,Stroud,Gloucestershire,GL6 9AN,Tel: 01453834020,No ratings yet Rate it yourself - /Services/careproviders/LeaveReview/DefaultView.aspx?id=1-113600545,0,0,,
The Padova,1-126345691,SCL,88 Bristol Road,Quedgeley,,Gloucester,Gloucestershire,GL2 4NA,Tel: 01452883764,No ratings yet Rate it yourself - /Services/careproviders/LeaveReview/DefaultView.aspx?id=1-126345691,0,0,,
The Retreat,1-463246148,SCL,116 Bristol Road,Quedgeley,,Gloucester,Gloucestershire,GL2 4NA,Tel: 01452728296,3 ratings Rate it yourself - /Services/careproviders/LeaveReview/DefaultView.aspx?id=1-463246148,,,,
Network Healthcare Professionals Limited - Dursley,1-136058544,SCL,14-16 Long Street,,,Dursley,Gloucestershire,GL11 4HY,Tel: 01453519240,No ratings yet Rate it yourself - /Services/careproviders/LeaveReview/DefaultView.aspx?id=1-136058544,0,0,,
Bisley Lodge,1-719339373,SCL,The Old Bisley Road,Stancombe,,Stroud,Gloucestershire,GL6 7NF,Tel: 01452770950,No ratings yet Rate it yourself - /Services/careproviders/LeaveReview/DefaultView.aspx?id=1-719339373,0,0,,
OSJCT Henlow Court,1-122144886,SCL,Henlow Drive,,,Dursley,Gloucestershire,GL11 4BE,Tel: 01453545866,No ratings yet Rate it yourself - /Services/careproviders/LeaveReview/DefaultView.aspx?id=1-122144886,0,0,,
Tomlen,1-132686627,SCL,33 Streamside,,,Tuffley,Gloucestershire,GL4 0TA,Tel: 01452528264,No ratings yet Rate it yourself - /Services/careproviders/LeaveReview/DefaultView.aspx?id=1-132686627,0,0,,
Foxmount,1-10365056249,SCL,29 Bristol Road,Quedgeley,,Gloucester,,GL2 4NE,Tel: 01452767663,No ratings yet Rate it yourself - /Services/careproviders/LeaveReview/DefaultView.aspx?id=1-10365056249,0,0,,
Woodmancote Manor,1-293371524,SCL,54 Woodmancote,Dursley,,Gloucestershire,,GL11 4AQ,Tel: 07967101560,No ratings yet Rate it yourself - /Services/careproviders/LeaveReview/DefaultView.aspx?id=1-293371524,0,0,,
Crossroads Care Gloucestershire - Gloucester Branch,1-1230959765,SCL,10 Sabre Close,Quedgeley,,Gloucester,Gloucestershire,GL2 4NZ,Tel: 01452302542,No ratings yet Rate it yourself - /Services/careproviders/LeaveReview/DefaultView.aspx?id=1-1230959765,0,0,,
Fox Elms Care Limited,1-1400551308,SCL,Goodridge Court,Goodridge Avenue,,Gloucester,,GL2 5EN,Tel: 01452382357,No ratings yet Rate it yourself - /Services/careproviders/LeaveReview/DefaultView.aspx?id=1-1400551308,0,0,,
Head Office,1-3700686190,SCL,Futures House,"Goodridge Business Park, Goodridge Avenue",,Gloucester,,GL2 5EA,Tel: 01452535544,1 rating Rate it yourself - /Services/careproviders/LeaveReview/DefaultView.aspx?id=1-3700686190,,,,
Pine Tree Court Care Home,1-141431400,SCL,Larchwood Drive,Tuffley,,Gloucester,Gloucestershire,GL4 0AH,Tel: 01452385855,No ratings yet Rate it yourself - /Services/careproviders/LeaveReview/DefaultView.aspx?id=1-141431400,0,0,,
The Knoll,1-154385984,SCL,335 Stroud Road,Tuffley,,Gloucester,Gloucestershire,GL4 0BD,Tel: 01452526146,No ratings yet Rate it yourself - /Services/careproviders/LeaveReview/DefaultView.aspx?id=1-154385984,0,0,,
Gatwick House,1-124274265,SCL,Upper Rodley Road,Bollow,,Westbury On Severn,Gloucestershire,GL14 1QU,Tel: 01452760164,No ratings yet Rate it yourself - /Services/careproviders/LeaveReview/DefaultView.aspx?id=1-124274265,0,0,,
Jasper Lodge,1-124541808,SCL,Matson Lane,,,Gloucester,Gloucestershire,GL4 6ED,Tel: 01452302492,No ratings yet Rate it yourself - /Services/careproviders/LeaveReview/DefaultView.aspx?id=1-124541808,0,0,,
Matson House,1-124541825,SCL,Matson Lane,,,Gloucester,Gloucestershire,GL4 6ED,Tel: 01452302458,No ratings yet Rate it yourself - /Services/careproviders/LeaveReview/DefaultView.aspx?id=1-124541825,0,0,,
Edward House,1-124541840,SCL,Matson Lane,,,Gloucester,Gloucestershire,GL4 6ED,Tel: 01452302462,No ratings yet Rate it yourself - /Services/careproviders/LeaveReview/DefaultView.aspx?id=1-124541840,0,0,,
Selborne Care DCA,1-416358021,SCL,Selwyn Care,Matson Lane,,Gloucester,,GL4 6ED,Tel: 01905779548,No ratings yet Rate it yourself - /Services/careproviders/LeaveReview/DefaultView.aspx?id=1-416358021,0,0,,
Yercombe (Gloucestershire) Trust,1-116477604,SCL,Yercombe Lodge,Stinchcombe,,Dursley,Gloucestershire,GL11 6AS,Tel: 01453542513,No ratings yet Rate it yourself - /Services/careproviders/LeaveReview/DefaultView.aspx?id=1-116477604,0,0,,
Stinchcombe Manor,1-5705146030,SCL,Echo Lane,Stinchcombe,,Dursley,Gloucestershire,GL11 6BQ,Tel: 01453549162,No ratings yet Rate it yourself - /Services/careproviders/LeaveReview/DefaultView.aspx?id=1-5705146030,0,0,,
The Pembury,1-123066358,SCL,9 Pembury Road,,,Gloucester,Gloucestershire,GL4 6UE,Tel: 01452521856,No ratings yet Rate it yourself - /Services/careproviders/LeaveReview/DefaultView.aspx?id=1-123066358,0,0,,
Brunswick House Nursing Home,1-118898566,SCL,119 Reservoir Road,,,Gloucester,Gloucestershire,GL4 6SX,Tel: 01452523903,No ratings yet Rate it yourself - /Services/careproviders/LeaveReview/DefaultView.aspx?id=1-118898566,0,0,,
Westbourne Care Home,1-149007745,SCL,190 Reservoir Road,,,Gloucester,Gloucestershire,GL4 6SB,Tel: 01452 506106,No ratings yet Rate it yourself - /Services/careproviders/LeaveReview/DefaultView.aspx?id=1-149007745,0,0,,
Stroud Lodge,1-2847234051,SCL,319 Stroud Road,,,Gloucester,Gloucestershire,GL1 5LG,Tel: 01452312216,No ratings yet Rate it yourself - /Services/careproviders/LeaveReview/DefaultView.aspx?id=1-2847234051,0,0,,
Cavendish Care Home,1-135670824,SCL,301 Stroud Road,,,Gloucester,Gloucestershire,GL1 5LF,Tel: 01452521896,No ratings yet Rate it yourself - /Services/careproviders/LeaveReview/DefaultView.aspx?id=1-135670824,0,0,,
Kings Den,1-10644909116,SCL,101 Reservoir Road,,,Gloucester,,GL4 6SZ,Tel: 01452554120,No ratings yet Rate it yourself - /Services/careproviders/LeaveReview/DefaultView.aspx?id=1-10644909116,0,0,,
Chestnut Care,1-495560778,SCL,20 Podsmead Road,,,Gloucester,Gloucestershire,GL1 5PA,,No ratings yet Rate it yourself - /Services/careproviders/LeaveReview/DefaultView.aspx?id=1-495560778,0,0,,
Chaxhill Hall,1-143327369,SCL,Chaxhill,,,Nr Westbury on Severn,Gloucestershire,GL14 1QW,Tel: 01452760717,No ratings yet Rate it yourself - /Services/careproviders/LeaveReview/DefaultView.aspx?id=1-143327369,0,0,,
Elite Home Care Solutions (UK),1-2000804335,SCL,34 Kaskelot Way,Hempsted,,Gloucester,Gloucestershire,GL2 5DR,Tel: 08448001130,No ratings yet Rate it yourself - /Services/careproviders/LeaveReview/DefaultView.aspx?id=1-2000804335,0,0,,
Ribston House,1-111001480,SCL,210 Stroud Road,,,Gloucester,Gloucestershire,GL1 5LA,Tel: 01452310916,No ratings yet Rate it yourself - /Services/careproviders/LeaveReview/DefaultView.aspx?id=1-111001480,0,0,,
Springfield House,1-2847248469,SCL,255D Stroud Road,,,Gloucester,Gloucestershire,GL1 5JZ,Tel: 01452312383,No ratings yet Rate it yourself - /Services/careproviders/LeaveReview/DefaultView.aspx?id=1-2847248469,0,0,,
Shy Lowen Care Limited,1-1031162250,SCL,163 Bristol Road,,,Gloucester,Gloucestershire,GL1 5TG,Tel: 01452539200,No ratings yet Rate it yourself - /Services/careproviders/LeaveReview/DefaultView.aspx?id=1-1031162250,0,0,,
Saintbridge House Nursing and Residential Home,1-470456880,SCL,189 Painswick Road,Abbeydale,,Gloucester,Gloucestershire,GL4 4QQ,Tel: 01452300307,No ratings yet Rate it yourself - /Services/careproviders/LeaveReview/DefaultView.aspx?id=1-470456880,0,0,,
Orchard End,1-2853603971,SCL,Church Lane,Minsterworth,,Gloucester,,GL2 8JJ,Tel: 01452750587,No ratings yet Rate it yourself - /Services/careproviders/LeaveReview/DefaultView.aspx?id=1-2853603971,0,0,,
Care at Home Gloucester,1-9741576810,SCL,Mill Place 1,"Unit 1, 90 Bristol Road",,Gloucester,,GL1 5SQ,Tel: 01452300025,No ratings yet Rate it yourself - /Services/careproviders/LeaveReview/DefaultView.aspx?id=1-9741576810,0,0,,
St Paul's Residential Home,1-124116713,SCL,127 Stroud Road,,,Gloucester,Gloucestershire,GL1 5JL,Tel: 01452505485,No ratings yet Rate it yourself - /Services/careproviders/LeaveReview/DefaultView.aspx?id=1-124116713,0,0,,
Bramble House,1-121887670,SCL,Bramble House,96a-98 Stroud Road,,Gloucester,Gloucestershire,GL1 5AJ,Tel: 01452521018,No ratings yet Rate it yourself - /Services/careproviders/LeaveReview/DefaultView.aspx?id=1-121887670,0,0,,
Naswell Care LTD,1-912115696,SCL,"Unit 2, Office 8","Morelands Trading Estate, Bristol Road",,Gloucester,Gloucestershire,GL1 5RZ,Tel: 01452722791,1 rating Rate it yourself - /Services/careproviders/LeaveReview/DefaultView.aspx?id=1-912115696,,,,