Organisation Name,NACS Code,Organisation Type,Address1,Address2,Address3,Address4,Address5,PostCode,Telephone Number,NHS.UK users rating,Value  (NHS.UK users rating),Banding Classification  (NHS.UK users rating),Car parking (Is there car parking at this organisation?),Disabled access (Disabled access)
Northleach Court Care Home with Nursing,1-6184261342,SCL,High Street,Northleach,,Cheltenham,,GL54 3PQ,Tel: 01451861447,No ratings yet Rate it yourself - /Services/careproviders/LeaveReview/DefaultView.aspx?id=1-6184261342,0,0,,
Principles Recruitment Care Agency Limited,1-5384149213,SCL,The Warren,"Sherborne Street, Bourton-on-the-water",,Cheltenham,,GL54 2BY,Tel: 07475470044,No ratings yet Rate it yourself - /Services/careproviders/LeaveReview/DefaultView.aspx?id=1-5384149213,0,0,,
Jubilee Lodge,1-448741065,SCL,Meadow Way,Bourton-on-the-Water,,Cheltenham,Gloucestershire,GL54 2GN,Tel: 01451823100,No ratings yet Rate it yourself - /Services/careproviders/LeaveReview/DefaultView.aspx?id=1-448741065,0,0,,
Cotswold Carers Ltd,1-3060386638,SCL,Cotswold Business Centre,"Ellis Road, Upper Rissington",,Cheltenham,,GL54 2QB,Tel: 08006343471,No ratings yet Rate it yourself - /Services/careproviders/LeaveReview/DefaultView.aspx?id=1-3060386638,0,0,,
Newlands Nursing Care Centre,1-139185447,SCL,Evesham Road,,,Stow on the Wold,Gloucestershire,GL54 1EJ,,No ratings yet Rate it yourself - /Services/careproviders/LeaveReview/DefaultView.aspx?id=1-139185447,0,0,,
Edwardstow Court Care Centre,1-4878132852,SCL,Edwardstow Court,"Fosseway, Stow On The Wold",,Cheltenham,,GL54 1FG,Tel: 01451799100,No ratings yet Rate it yourself - /Services/careproviders/LeaveReview/DefaultView.aspx?id=1-4878132852,0,0,,
YourLife (Stow on the Wold),1-8924252190,SCL,Hawkesbury Place,"Fosseway, Stow On The Wold",,Cheltenham,,GL54 1FF,Tel: 01451830134,No ratings yet Rate it yourself - /Services/careproviders/LeaveReview/DefaultView.aspx?id=1-8924252190,0,0,,
The Cotswold,1-119255460,SCL,Woodside Drive,Bradwell Village,,Burford,Oxfordshire,OX18 4XA,Tel: 01993824225,No ratings yet Rate it yourself - /Services/careproviders/LeaveReview/DefaultView.aspx?id=1-119255460,0,0,,
Radis Community Care (The Paddocks),1-15274174066,SCL,The Paddocks,"Shipton Road, Milton-under-wychwood",,Chipping Norton,,OX7 6GF,Tel: 01865410733,No ratings yet Rate it yourself - /Services/careproviders/LeaveReview/DefaultView.aspx?id=1-15274174066,0,0,,
Burford Nursing Home,1-801086458,SCL,White Hill,,,Burford,Oxfordshire,OX18 4EX,Tel: 01993822088,No ratings yet Rate it yourself - /Services/careproviders/LeaveReview/DefaultView.aspx?id=1-801086458,0,0,,
Tall Trees,1-790692457,SCL,Burford Road,Shipton Under Wychwood,,Chipping Norton,Oxfordshire,OX7 6DB,Tel: 01993833833,No ratings yet Rate it yourself - /Services/careproviders/LeaveReview/DefaultView.aspx?id=1-790692457,0,0,,
The Langston,1-5768843328,SCL,Station Road,Kingham,,Chipping Norton,Oxfordshire,OX7 6UP,Tel: 01608658233,No ratings yet Rate it yourself - /Services/careproviders/LeaveReview/DefaultView.aspx?id=1-5768843328,0,0,,
Home Instead Senior Care Cheltenham ,1-334314651,SCL,Penhill Offices,Colesbourne,,Cheltenham,,GL53 9NS,Tel: 01242 513203,1 rating Rate it yourself - /Services/careproviders/LeaveReview/DefaultView.aspx?id=1-334314651,,,,
Hyperion House,1-118262771,SCL,London Street,,,Fairford,Gloucestershire,GL7 4AH,Tel: 01285 712349,No ratings yet Rate it yourself - /Services/careproviders/LeaveReview/DefaultView.aspx?id=1-118262771,0,0,,
The Old Prebendal House,1-7174048586,SCL,Station Road,Shipton-under-Wychwood,,Chipping Norton,Oxfordshire,OX7 6BQ,Tel: 01993831888,No ratings yet Rate it yourself - /Services/careproviders/LeaveReview/DefaultView.aspx?id=1-7174048586,0,0,,
Hunters Care Centre,1-125856200,SCL,Cherry Tree Lane,,,Cirencester,Gloucestershire,GL7 5DT,Tel: 01285653707,No ratings yet Rate it yourself - /Services/careproviders/LeaveReview/DefaultView.aspx?id=1-125856200,0,0,,
The Homestead,1-117977288,SCL,24 Flax Crescent,,,Carterton,Oxfordshire,OX18 1NA,Tel: 01993845754,No ratings yet Rate it yourself - /Services/careproviders/LeaveReview/DefaultView.aspx?id=1-117977288,0,0,,
Care Quality Services West Oxfordshire,1-8525224653,SCL,4&5 Ramilles House,Black Bourton Road,,Carterton,,OX18 3DW,Tel: 01865370707,No ratings yet Rate it yourself - /Services/careproviders/LeaveReview/DefaultView.aspx?id=1-8525224653,0,0,,
Stratton Court,1-17065010624,SCL,Gloucester Road,"Stratton,",,Cirencester,,GL7 2NB,Tel: 01285283132,No ratings yet Rate it yourself - /Services/careproviders/LeaveReview/DefaultView.aspx?id=1-17065010624,0,0,,
Ashley House Care Home,1-126434033,SCL,118 Trafalgar Road,,,Cirencester,Gloucestershire,GL7 2ED,Tel: 01285650671,No ratings yet Rate it yourself - /Services/careproviders/LeaveReview/DefaultView.aspx?id=1-126434033,0,0,,
Housing 21 - Mulberry Court,1-341216702,SCL,Middle Mead,,,Cirencester,Gloucestershire,GL7 1GG,Tel: 03701924000,No ratings yet Rate it yourself - /Services/careproviders/LeaveReview/DefaultView.aspx?id=1-341216702,0,0,,
Moriel Healthcare Ltd,1-18687552412,SCL,15 Gosditch Street,,,Cirencester,,GL7 2AG,,No ratings yet Rate it yourself - /Services/careproviders/LeaveReview/DefaultView.aspx?id=1-18687552412,0,0,,
Protective Care Group Limited,1-12591503486,SCL,Unit 4 Damson Barn,"Elkstone Studios, Elkstone",,Cheltenham,,GL53 9PQ,Tel: 01242472444,No ratings yet Rate it yourself - /Services/careproviders/LeaveReview/DefaultView.aspx?id=1-12591503486,0,0,,
Brize Meadow Lodge,1-15199248538,SCL,Miles Drive,Brize Norton,,Carterton,,OX18 1NZ,,No ratings yet Rate it yourself - /Services/careproviders/LeaveReview/DefaultView.aspx?id=1-15199248538,0,0,,
OSJCT Grevill House,1-122144872,SCL,279 London Road,Charlton Kings,,Cheltenham,Gloucestershire,GL52 6YL,Tel: 01242512964,No ratings yet Rate it yourself - /Services/careproviders/LeaveReview/DefaultView.aspx?id=1-122144872,0,0,,
Helping Hands Cirencester,1-11730395329,SCL,31 Castle Street,,,Cirencester,,GL7 1QD,Tel: 01285708223,No ratings yet Rate it yourself - /Services/careproviders/LeaveReview/DefaultView.aspx?id=1-11730395329,0,0,,
Nazareth House - Cheltenham,1-403200219,SCL,London Road,Charlton Kings,,Cheltenham,Gloucestershire,GL52 6YJ,Tel: 01242516361,No ratings yet Rate it yourself - /Services/careproviders/LeaveReview/DefaultView.aspx?id=1-403200219,0,0,,
Friends in the Community Home Nursing,1-12584249253,SCL,Lloyds Bank House,High Street,,Lechlade,,GL7 3AE,Tel: 07938244335,No ratings yet Rate it yourself - /Services/careproviders/LeaveReview/DefaultView.aspx?id=1-12584249253,0,0,,
Watermoor House,1-5286580547,SCL,Watermoor Road,,,Cirencester,,GL7 1JR,Tel: 01285654864,No ratings yet Rate it yourself - /Services/careproviders/LeaveReview/DefaultView.aspx?id=1-5286580547,0,0,,
OSJCT Paternoster House - Gloucestershire,1-122144929,SCL,Watermoor Road,,,Cirencester,Gloucestershire,GL7 1JR,Tel: 01285653699,No ratings yet Rate it yourself - /Services/careproviders/LeaveReview/DefaultView.aspx?id=1-122144929,0,0,,
The Care Net,1-3775666183,SCL,5 High Street,,,Lechlade,,GL7 3AD,Tel: 01367705081,No ratings yet Rate it yourself - /Services/careproviders/LeaveReview/DefaultView.aspx?id=1-3775666183,0,0,,
EL ROI 3 Care Solutions Limited,1-15519363927,SCL,Suite 110 Watermoor Point,Watermoor Road,,Cirencester,,GL7 1LF,,No ratings yet Rate it yourself - /Services/careproviders/LeaveReview/DefaultView.aspx?id=1-15519363927,0,0,,
Esmere Gardens,1-18829865911,SCL,Stow Road,,,Moreton-in-marsh,,GL56 0DS,Tel: 01608692222,No ratings yet Rate it yourself - /Services/careproviders/LeaveReview/DefaultView.aspx?id=1-18829865911,0,0,,
Bafford House,1-11601666215,SCL,Bafford House,"Newcourt Road, Charlton Kings",,Cheltenham,,GL53 8DQ,Tel: 01242523562,No ratings yet Rate it yourself - /Services/careproviders/LeaveReview/DefaultView.aspx?id=1-11601666215,0,0,,
Careful Care Limited,1-758994009,SCL,"Suite 3, Security House",82C Chesterton Lane,,Cirencester,,GL7 1YD,Tel: 01285640420,No ratings yet Rate it yourself - /Services/careproviders/LeaveReview/DefaultView.aspx?id=1-758994009,0,0,,
Charlton Kings Care Home,1-2897246286,SCL,Moorend Road,Charlton Kings,,Cheltenham,Gloucestershire,GL53 9AX,Tel: 01242 521812,No ratings yet Rate it yourself - /Services/careproviders/LeaveReview/DefaultView.aspx?id=1-2897246286,0,0,,
Aroma Care - Cotswold,1-4053389834,SCL,Room 44 Council Offices,High Street,,Moreton In Marsh,Gloucestershire,GL56 0LW,Tel: 01452643031,No ratings yet Rate it yourself - /Services/careproviders/LeaveReview/DefaultView.aspx?id=1-4053389834,0,0,,
Elm Grove Care Home,1-130120350,SCL,Somerford Road,,,Cirencester,Gloucestershire,GL7 1TX,Tel: 01285653057,No ratings yet Rate it yourself - /Services/careproviders/LeaveReview/DefaultView.aspx?id=1-130120350,0,0,,
Bay Tree Court Care Centre,1-14316247051,SCL,High Street,Prestbury,,Cheltenham,Gloucestershire,GL52 3AU,Tel: 01242236000,No ratings yet Rate it yourself - /Services/careproviders/LeaveReview/DefaultView.aspx?id=1-14316247051,0,0,,
Oak Tree Mews,1-13487299462,SCL,Hospital Road West,Waterlooville,,Moreton-in-marsh,,GL56 0BL,Tel: 01608650797,No ratings yet Rate it yourself - /Services/careproviders/LeaveReview/DefaultView.aspx?id=1-13487299462,0,0,,
DIVERSE PRIME HOLDINGS LIMITED,1-17932888527,SCL,2 Bouncers Lane,Prestbury,,Cheltenham,,GL52 5JF,Tel: 01452447034,No ratings yet Rate it yourself - /Services/careproviders/LeaveReview/DefaultView.aspx?id=1-17932888527,0,0,,
Oakhaven Residential Care Home,1-123788035,SCL,136-140 Hales Road,,,Cheltenham,Gloucestershire,GL52 6TB,Tel: 01242528377,No ratings yet Rate it yourself - /Services/careproviders/LeaveReview/DefaultView.aspx?id=1-123788035,0,0,,
Pearl's ProCare Ltd,1-15979191088,SCL,Unit 9,"Cirencester Office Park, Tetbury Road",,Cirencester,Gloucestershire,GL7 6JJ,,No ratings yet Rate it yourself - /Services/careproviders/LeaveReview/DefaultView.aspx?id=1-15979191088,0,0,,
Consider Care Limited,1-16377649442,SCL,Unit 9,"Cirencester Office Park, Tetbury Road",,Cirencester,Gloucestershire,GL7 6JJ,Tel: 07454978704,No ratings yet Rate it yourself - /Services/careproviders/LeaveReview/DefaultView.aspx?id=1-16377649442,0,0,,
Hawthorns,1-3671063289,SCL,2 Bushey Ground,Minster Lovell,,Witney,Oxfordshire,OX29 0SW,Tel: 01993776336,No ratings yet Rate it yourself - /Services/careproviders/LeaveReview/DefaultView.aspx?id=1-3671063289,0,0,,
Malvern View Care Home,1-6719455901,SCL,Cleeve Hill,,,Cheltenham,Gloucestershire,GL52 3PW,Tel: 01242672022,No ratings yet Rate it yourself - /Services/careproviders/LeaveReview/DefaultView.aspx?id=1-6719455901,0,0,,
Lilleybrook Care Home,1-983777097,SCL,Pilley Lane,,,Cheltenham,Gloucestershire,GL53 9ER,Tel: 01242225790,No ratings yet Rate it yourself - /Services/careproviders/LeaveReview/DefaultView.aspx?id=1-983777097,0,0,,
Gloucestershire House - Care Home with Nursing Physical Disabilities,1-120087914,SCL,Charlton Lane,Leckhampton,,Cheltenham,Gloucestershire,GL53 9HD,Tel: 01242512569,No ratings yet Rate it yourself - /Services/careproviders/LeaveReview/DefaultView.aspx?id=1-120087914,0,0,,
Cheltenham Supported Living,1-4961855782,SCL,Charlton Lane,,,Cheltenham,,GL53 9HD,Tel: 01242512569,No ratings yet Rate it yourself - /Services/careproviders/LeaveReview/DefaultView.aspx?id=1-4961855782,0,0,,
Thirlestaine Park Care Home,1-1919525815,SCL,Humphris Place,Off Sandford Road,,Cheltenham,Gloucestershire,GL53 7GA,Tel: 01242505560,No ratings yet Rate it yourself - /Services/careproviders/LeaveReview/DefaultView.aspx?id=1-1919525815,0,0,,
Radis Community Care (Middleton House),1-15499696756,SCL,Pilley Lane,Leckhampton,,Cheltenham,,GL53 9GA,,No ratings yet Rate it yourself - /Services/careproviders/LeaveReview/DefaultView.aspx?id=1-15499696756,0,0,,
The Lakes Care Centre,1-3289591210,SCL,Spine Road East,South Cerney,,Cirencester,Gloucestershire,GL7 5TL,Tel: 01285314141,No ratings yet Rate it yourself - /Services/careproviders/LeaveReview/DefaultView.aspx?id=1-3289591210,0,0,,
National Star College - Ullenwood,1-139161062,SCL,National Star College,Ullenwood,,Cheltenham,Gloucestershire,GL53 9QU,Tel: 01242527631,No ratings yet Rate it yourself - /Services/careproviders/LeaveReview/DefaultView.aspx?id=1-139161062,0,0,,
Windsor Street Care Centre,1-723347537,SCL,35-37 Windsor Street,,,Cheltenham,Gloucestershire,GL52 2DG,Tel: 01242545150,No ratings yet Rate it yourself - /Services/careproviders/LeaveReview/DefaultView.aspx?id=1-723347537,0,0,,
Hampton House Care Home,1-108741211,SCL,94 Leckhampton Road,,,Cheltenham,Gloucestershire,GL53 0BN,Tel: 01242 520527,No ratings yet Rate it yourself - /Services/careproviders/LeaveReview/DefaultView.aspx?id=1-108741211,0,0,,
SW Domiciliary Care,1-6720068087,SCL,Harley House,29 Cambray Place,,Cheltenham,,GL50 1JN,Tel: 01242352554,No ratings yet Rate it yourself - /Services/careproviders/LeaveReview/DefaultView.aspx?id=1-6720068087,0,0,,
Person Centred care,1-1031394829,SCL,Montpellier House,Montpellier Drive,,Cheltenham,Gloucestershire,GL50 1TY,,No ratings yet Rate it yourself - /Services/careproviders/LeaveReview/DefaultView.aspx?id=1-1031394829,0,0,,
Saracen Care Services Ltd,1-1260730033,SCL,53-57 Rodney Road,,,Cheltenham,Gloucestershire,GL50 1HX,Tel: 01242515162,2 ratings Rate it yourself - /Services/careproviders/LeaveReview/DefaultView.aspx?id=1-1260730033,,,,
Farecare Gloucestershire Limited,1-2177215241,SCL,47 Rodney Road,,,Cheltenham,Gloucestershire,GL50 1HX,Tel: 01242232296,No ratings yet Rate it yourself - /Services/careproviders/LeaveReview/DefaultView.aspx?id=1-2177215241,0,0,,
Bradbury Gardens,1-2148821492,SCL,West Drive,Pittville,,Cheltenham,Gloucestershire,GL50 4LB,Tel: 01242527631,No ratings yet Rate it yourself - /Services/careproviders/LeaveReview/DefaultView.aspx?id=1-2148821492,0,0,,
Emma Le Grand Case Management,1-14964435082,SCL,The Mill,"Stockwell Lane, Woodmancote",,Cheltenham,,GL52 9QG,Tel: 01243769081,No ratings yet Rate it yourself - /Services/careproviders/LeaveReview/DefaultView.aspx?id=1-14964435082,0,0,,
Retain Healthcare Limited - Cheltenham,1-6906880424,SCL,"8 Ormond Terrace,",Regent Street,,Cheltenham,,GL50 1HR,Tel: 01242262700,No ratings yet Rate it yourself - /Services/careproviders/LeaveReview/DefaultView.aspx?id=1-6906880424,0,0,,
A Caring Hand Ltd,1-9188405334,SCL,Unit 7,"Bromag  Estate, Downs Road",,Witney,,OX29 0SR,Tel: 01993708703,1 rating Rate it yourself - /Services/careproviders/LeaveReview/DefaultView.aspx?id=1-9188405334,,,,
Care@home Oxfordshire,1-13226250015,SCL,Unit 11b,"Bromag Industrial Estate, Minster Lovell",,Witney,,OX29 0SR,Tel: 01993647012,No ratings yet Rate it yourself - /Services/careproviders/LeaveReview/DefaultView.aspx?id=1-13226250015,0,0,,
Faithfull House,1-130490622,SCL,Suffolk Square,,,Cheltenham,Gloucestershire,GL50 2DT,Tel: 01242514319,1 rating Rate it yourself - /Services/careproviders/LeaveReview/DefaultView.aspx?id=1-130490622,,,,
Southerndown,1-125862009,SCL,Worcester Road,,,Chipping Norton,Oxfordshire,OX7 5YF,Tel: 01608644129,No ratings yet Rate it yourself - /Services/careproviders/LeaveReview/DefaultView.aspx?id=1-125862009,0,0,,
Cott's Care Solutions,1-4301900009,SCL,3 Royal Crescent,,,Cheltenham,,GL50 3DA,Tel: 01242371048,No ratings yet Rate it yourself - /Services/careproviders/LeaveReview/DefaultView.aspx?id=1-4301900009,0,0,,
Raynsford Domiciliary Care,1-2594943954,SCL,Head Office,24 Suffolk Square,,Cheltenham,,GL50 2EA,Tel: 01242243483,No ratings yet Rate it yourself - /Services/careproviders/LeaveReview/DefaultView.aspx?id=1-2594943954,0,0,,
Alexander House Care Home - Cheltenham,1-112309865,SCL,Alexander House,16 Tivoli Road,,Cheltenham,Gloucestershire,GL50 2TG,Tel: 01242513525,No ratings yet Rate it yourself - /Services/careproviders/LeaveReview/DefaultView.aspx?id=1-112309865,0,0,,
Windrush Care,1-2158325162,SCL,Normandy House,305-309 High Street,,Cheltenham,Gloucestershire,GL50 3HW,Tel: 01242226020,No ratings yet Rate it yourself - /Services/careproviders/LeaveReview/DefaultView.aspx?id=1-2158325162,0,0,,
Helping Hands Cheltenham,1-10926288707,SCL,Festival House,Jessop Avenue,,Cheltenham,,GL50 3SH,Tel: 01242384637,No ratings yet Rate it yourself - /Services/careproviders/LeaveReview/DefaultView.aspx?id=1-10926288707,0,0,,
Golden Atara Healthcare,1-15225886908,SCL,"Unit S6, Witney Business & Innovation Centre","Windrush House, Windrush Park Road",,Witney,,OX29 7DX,Tel: 01865416825,No ratings yet Rate it yourself - /Services/careproviders/LeaveReview/DefaultView.aspx?id=1-15225886908,0,0,,
Cherry Care Services Oxfordshire Ltd,1-2584412931,SCL,"Witney Business and Innovation Centre, Windrush House","Windrush Industrial Park, Burford Road",,Witney,,OX29 7DX,Tel: 01993402200,No ratings yet Rate it yourself - /Services/careproviders/LeaveReview/DefaultView.aspx?id=1-2584412931,0,0,,
Angel Care Group Limited,1-10559087555,SCL,Witney Business And Innovation Centre,"Windrush House, Windrush Industrial Park",,Witney,,OX29 7DX,Tel: 07496817762,1 rating Rate it yourself - /Services/careproviders/LeaveReview/DefaultView.aspx?id=1-10559087555,,,,
The Vicarage,1-115336828,SCL,59 Andover Road,Tivoli,,Cheltenham,Gloucestershire,GL50 2TS,Tel: 01242521918,1 rating Rate it yourself - /Services/careproviders/LeaveReview/DefaultView.aspx?id=1-115336828,,,,
Ravenswood House,1-414375677,SCL,Ravenswood House,Westall green,,Cheltenham,Gloucestershire,GL50 2JA,Tel: 01242 514264,No ratings yet Rate it yourself - /Services/careproviders/LeaveReview/DefaultView.aspx?id=1-414375677,0,0,,
Astell,1-130490605,SCL,Overton Park Road,,,Cheltenham,Gloucestershire,GL50 3BT,Tel: 01242529012,No ratings yet Rate it yourself - /Services/careproviders/LeaveReview/DefaultView.aspx?id=1-130490605,0,0,,
Aim Up,1-745680492,SCL,Well Close House,Lansdown Parade,,Cheltenham,Gloucestershire,GL50 2LH,Tel: 01242515035,No ratings yet Rate it yourself - /Services/careproviders/LeaveReview/DefaultView.aspx?id=1-745680492,0,0,,
Honeybourne Gate,1-2252521215,SCL,2 Gloucester Road,,,Cheltenham,Gloucestershire,GL51 8DW,Tel: 01242233694,No ratings yet Rate it yourself - /Services/careproviders/LeaveReview/DefaultView.aspx?id=1-2252521215,0,0,,
Your Life (Cheltenham),1-858874500,SCL,Jenner Court,St Georges Road,,Cheltenham,,GL50 3ER,Tel: 01242571704,No ratings yet Rate it yourself - /Services/careproviders/LeaveReview/DefaultView.aspx?id=1-858874500,0,0,,
St Faith's Nursing Home,1-130490637,SCL,Malvern Road,,,Cheltenham,Gloucestershire,GL50 2NR,Tel: 01242240240,No ratings yet Rate it yourself - /Services/careproviders/LeaveReview/DefaultView.aspx?id=1-130490637,0,0,,
Alpha Care Services,1-3054899130,SCL,71 Pecked Lane,Bishops Cleeve,,Cheltenham,Gloucestershire,GL52 8JS,Tel: 01242702708,No ratings yet Rate it yourself - /Services/careproviders/LeaveReview/DefaultView.aspx?id=1-3054899130,0,0,,
Sandfields,1-1207038123,SCL,St Georges Road,,,Cheltenham,Gloucestershire,GL50 3EL,Tel: 03333210921,No ratings yet Rate it yourself - /Services/careproviders/LeaveReview/DefaultView.aspx?id=1-1207038123,0,0,,
Chargrove Lawn,1-122110079,SCL,Shurdington Road,,,Cheltenham,Gloucestershire,GL51 4XA,Tel: 01242862686,No ratings yet Rate it yourself - /Services/careproviders/LeaveReview/DefaultView.aspx?id=1-122110079,0,0,,
Beech Haven,1-110973774,SCL,Beech Haven Care Home,77 Burford Road,,Chipping Norton,Oxfordshire,OX7 5EE,,No ratings yet Rate it yourself - /Services/careproviders/LeaveReview/DefaultView.aspx?id=1-110973774,0,0,,
Penhurst Gardens Care Home,1-3127272263,SCL,Penhurst Gardens,New Street,,Chipping Norton,Oxfordshire,OX7 5ED,Tel: 01608 698100,No ratings yet Rate it yourself - /Services/careproviders/LeaveReview/DefaultView.aspx?id=1-3127272263,0,0,,
Queensbridge House,1-121047648,SCL,63 Queens Road,,,Cheltenham,Gloucestershire,GL50 2NF,,No ratings yet Rate it yourself - /Services/careproviders/LeaveReview/DefaultView.aspx?id=1-121047648,0,0,,
Ambleside,1-137768877,SCL,69 Hatherley Road,,,Cheltenham,Gloucestershire,GL51 6EG,Tel: 01242522937,1 rating Rate it yourself - /Services/careproviders/LeaveReview/DefaultView.aspx?id=1-137768877,,,,
Goldsmith Personnel Limited (Oxfordshire),1-2331678749,SCL,6A Market Place,,,Chipping Norton,Oxfordshire,OX7 5NA,Tel: 01608642064,No ratings yet Rate it yourself - /Services/careproviders/LeaveReview/DefaultView.aspx?id=1-2331678749,0,0,,
Merit Care Ltd,1-5072914995,SCL,"1st Floor, Unit 15","Alstone Trading Estate, Alstone Lane",,Cheltenham,,GL51 8HF,Tel: 01242300380,No ratings yet Rate it yourself - /Services/careproviders/LeaveReview/DefaultView.aspx?id=1-5072914995,0,0,,
Honeybee care at home limited,1-18444136704,SCL,41 Apley Way,,,Witney,,OX28 5BL,Tel: 07735393097,No ratings yet Rate it yourself - /Services/careproviders/LeaveReview/DefaultView.aspx?id=1-18444136704,0,0,,
RIchmond Village Witney DCA,1-3134163388,SCL,"Village Centre, Coral Springs Way",Richmond Village,,Witney,Oxfordshire,OX28 5DG,Tel: 01993894000,No ratings yet Rate it yourself - /Services/careproviders/LeaveReview/DefaultView.aspx?id=1-3134163388,0,0,,
Richmond Village Witney,1-3240438128,SCL,"Village Centre, Coral Springs Way",Richmond Village,,Witney,Oxfordshire,OX28 5DG,Tel: 01993894000,No ratings yet Rate it yourself - /Services/careproviders/LeaveReview/DefaultView.aspx?id=1-3240438128,0,0,,
Accolade Support and Care Ltd,1-2931398918,SCL,Maxet House,"Lansdown Industrial Estate, Gloucester Road",,Cheltenham,,GL51 8PL,Tel: 01242374044,No ratings yet Rate it yourself - /Services/careproviders/LeaveReview/DefaultView.aspx?id=1-2931398918,0,0,,
Expeditions Living,1-624705176,SCL,"22 Maxet House, Lansdown Industrial Estate",Gloucester Road,,Cheltenham,Gloucestershire,GL51 8PL,Tel: 01242308510,1 rating Rate it yourself - /Services/careproviders/LeaveReview/DefaultView.aspx?id=1-624705176,,,,
Millers Grange,1-6792346909,SCL,Curbridge Road,,,Witney,,OX28 5HR,Tel: 01993223260,No ratings yet Rate it yourself - /Services/careproviders/LeaveReview/DefaultView.aspx?id=1-6792346909,0,0,,
My-Care Healthcare Ltd,1-14772474276,SCL,28 Washpool Road,Bishops Cleeve,,Cheltenham,,GL52 8EU,,No ratings yet Rate it yourself - /Services/careproviders/LeaveReview/DefaultView.aspx?id=1-14772474276,0,0,,
Dalkeith,1-840613286,SCL,285 Gloucester Road,,,Cheltenham,Gloucestershire,GL51 7AD,Tel: 01242522209,No ratings yet Rate it yourself - /Services/careproviders/LeaveReview/DefaultView.aspx?id=1-840613286,0,0,,
Beechcroft - Cheltenham,1-2847288176,SCL,295 Gloucester Road,,,Cheltenham,Gloucestershire,GL51 7AD,Tel: 01242244678,No ratings yet Rate it yourself - /Services/careproviders/LeaveReview/DefaultView.aspx?id=1-2847288176,0,0,,
Bredon View,1-122110107,SCL,24-26 Libertus Road,,,Cheltenham,Gloucestershire,GL51 7EL,Tel: 01242525087,No ratings yet Rate it yourself - /Services/careproviders/LeaveReview/DefaultView.aspx?id=1-122110107,0,0,,
The Granleys,1-138901716,SCL,21 Griffiths Avenue,,,Cheltenham,Gloucestershire,GL51 7BE,Tel: 01242521721,No ratings yet Rate it yourself - /Services/careproviders/LeaveReview/DefaultView.aspx?id=1-138901716,0,0,,
The Knole,1-442981675,SCL,23 Griffiths Avenue,,,Cheltenham,Gloucestershire,GL51 7BE,Tel: 01242526978,No ratings yet Rate it yourself - /Services/careproviders/LeaveReview/DefaultView.aspx?id=1-442981675,0,0,,
Rosebank Care Home,1-109125104,SCL,High Street,,,Bampton,Oxfordshire,OX18 2JR,Tel: 01993850308,No ratings yet Rate it yourself - /Services/careproviders/LeaveReview/DefaultView.aspx?id=1-109125104,0,0,,
Yourlife (Chipping Norton),1-8924252141,SCL,Watson Place,Trinity Road,,Chipping Norton,,OX7 5AJ,Tel: 01608645854,No ratings yet Rate it yourself - /Services/careproviders/LeaveReview/DefaultView.aspx?id=1-8924252141,0,0,,
Middletown Grange,1-125861492,SCL,Middletown,Hailey,,Witney,Oxfordshire,OX29 9UB,Tel: 01993700396,No ratings yet Rate it yourself - /Services/careproviders/LeaveReview/DefaultView.aspx?id=1-125861492,0,0,,