Organisation Name,NACS Code,Organisation Type,Address1,Address2,Address3,Address4,Address5,PostCode,Telephone Number,NHS.UK users rating,Value  (NHS.UK users rating),Banding Classification  (NHS.UK users rating),Car parking (Is there car parking at this organisation?),Disabled access (Disabled access)
Birchams Grange,1-118868224,SCL,Clenchers Lane,Eastnor,,Ledbury,Herefordshire,HR8 1RW,Tel: 01531632925,No ratings yet Rate it yourself - /Services/careproviders/LeaveReview/DefaultView.aspx?id=1-118868224,0,0,,
1st Class Care Services2 Ltd,1-2210769079,SCL,3 The Southend,,,Ledbury,,HR8 2EY,Tel: 01531635107,No ratings yet Rate it yourself - /Services/careproviders/LeaveReview/DefaultView.aspx?id=1-2210769079,0,0,,
Ledbury ABI Unit Market Lodge,1-128335150,SCL,Market Street,,,Ledbury,Herefordshire,HR8 2AQ,Tel: 01531 637618,No ratings yet Rate it yourself - /Services/careproviders/LeaveReview/DefaultView.aspx?id=1-128335150,0,0,,
Ledbury Intermediate Care Unit,1-128364442,SCL,Market Street,,,Ledbury,Herefordshire,HR8 2AQ,Tel: 0800 902 0092,No ratings yet Rate it yourself - /Services/careproviders/LeaveReview/DefaultView.aspx?id=1-128364442,0,0,,
Ledbury Nursing Home,1-128364428,SCL,Market Street,,,Ledbury,Herefordshire,HR8 2AQ,Tel: 0800 902 0092,No ratings yet Rate it yourself - /Services/careproviders/LeaveReview/DefaultView.aspx?id=1-128364428,0,0,,
Deer Park Care Home,1-12470851149,SCL,Martins Way,Off Leadon Way,,Ledbury,,HR8 2XW,Tel: 08081786565,No ratings yet Rate it yourself - /Services/careproviders/LeaveReview/DefaultView.aspx?id=1-12470851149,0,0,,
Shaw Community Services Limited (DCA) -  Herefordshire Branch,1-126399191,SCL,Leadon Bank,Orchard Lane,,Ledbury,Herefordshire,HR8 1BY,Tel: 01531638138,No ratings yet Rate it yourself - /Services/careproviders/LeaveReview/DefaultView.aspx?id=1-126399191,0,0,,
Orchard Place,1-134889389,SCL,Leadon Bank,Orchard Lane,,Ledbury,Herefordshire,HR8 1BY,Tel: 0800 902 0092,No ratings yet Rate it yourself - /Services/careproviders/LeaveReview/DefaultView.aspx?id=1-134889389,0,0,,
Leadon Vale Care Ltd,1-7171778066,SCL,Ledbury Business Centre,136 Bridge Street,,Ledbury,,HR8 2AS,Tel: 01531248060,No ratings yet Rate it yourself - /Services/careproviders/LeaveReview/DefaultView.aspx?id=1-7171778066,0,0,,
Walsingham Support - Central Supported Living,1-17430164866,SCL,"The Barn, Keepers Cottage",Falcon Lane,,Ledbury,,HR8 2JN,Tel: 01531671080,No ratings yet Rate it yourself - /Services/careproviders/LeaveReview/DefaultView.aspx?id=1-17430164866,0,0,,
Walsingham Support - Keepers Cottage,1-5919607501,SCL,Falcon Lane,,,Ledbury,Herefordshire,HR8 2JN,Tel: 01531671080,No ratings yet Rate it yourself - /Services/careproviders/LeaveReview/DefaultView.aspx?id=1-5919607501,0,0,,
Evendine House,1-144581960,SCL,Evendine House,Evendine Lane,,Malvern,Worcestershire,WR13 6DT,Tel: 033 0097 7373,No ratings yet Rate it yourself - /Services/careproviders/LeaveReview/DefaultView.aspx?id=1-144581960,0,0,,
Stepping Stones Red Marley,1-138359449,SCL,Bromsberrow Road,Redmarley,,Gloucester,Gloucestershire,GL19 3JU,Tel: 01531650880,No ratings yet Rate it yourself - /Services/careproviders/LeaveReview/DefaultView.aspx?id=1-138359449,0,0,,
Hill Ash House Care Centre,1-6538674073,SCL,Ledbury Road,,,Dymock,,GL18 2DB,Tel: 01531892980,No ratings yet Rate it yourself - /Services/careproviders/LeaveReview/DefaultView.aspx?id=1-6538674073,0,0,,
The Chace Rest Home,1-115173007,SCL,Chase Road,Upper Welland,,Malvern,Worcestershire,WR14 4JY,Tel: 01684561813,No ratings yet Rate it yourself - /Services/careproviders/LeaveReview/DefaultView.aspx?id=1-115173007,0,0,,
Welland House Care Centre,1-147134659,SCL,Lime Grove,Welland,,Malvern,Worcestershire,WR13 6LY,Tel: 01684310840,2 ratings Rate it yourself - /Services/careproviders/LeaveReview/DefaultView.aspx?id=1-147134659,,,,
Bowley Court,1-686916505,SCL,Stanley House,Bosbury,,Ledbury,Herefordshire,HR8 1HB,Tel: 01531640840,No ratings yet Rate it yourself - /Services/careproviders/LeaveReview/DefaultView.aspx?id=1-686916505,0,0,,
Stanley House,1-117558045,SCL,Stanley House,Bosbury,,Ledbury,Herefordshire,HR8 1HB,Tel: 01531 640840,No ratings yet Rate it yourself - /Services/careproviders/LeaveReview/DefaultView.aspx?id=1-117558045,0,0,,
Elgar Court Care Home,1-16539671822,SCL,35 St. Andrews Road,,,Malvern,,WR14 3PT,Tel: 01684211720,No ratings yet Rate it yourself - /Services/careproviders/LeaveReview/DefaultView.aspx?id=1-16539671822,0,0,,
Audley Care Ellerslie,1-4076170590,SCL,Audley Ellerslie Abbey Road,,,Malvern,Worcestershire,WR14 3HL,Tel: 01684 437104,No ratings yet Rate it yourself - /Services/careproviders/LeaveReview/DefaultView.aspx?id=1-4076170590,0,0,,
Merrivale Farm,1-116498185,SCL,Eastwood,,,Ledbury,Herefordshire,HR8 2RN,Tel: 01531670220,No ratings yet Rate it yourself - /Services/careproviders/LeaveReview/DefaultView.aspx?id=1-116498185,0,0,,
Shining Star Home Care Limited,1-11058533433,SCL,40 Malvern Oaks Close,Cradley,,Malvern,,WR13 5NE,Tel: 07958591470,No ratings yet Rate it yourself - /Services/careproviders/LeaveReview/DefaultView.aspx?id=1-11058533433,0,0,,
SENSE Tanglewood,1-120446158,SCL,72 Albert Road South,,,Malvern,Worcestershire,WR14 3AH,Tel: 01684576327,No ratings yet Rate it yourself - /Services/careproviders/LeaveReview/DefaultView.aspx?id=1-120446158,0,0,,
Blossom House,1-465217737,SCL,5 Avenue Road,,,Malvern,Worcestershire,WR14 3AL,Tel: 01684 574000,No ratings yet Rate it yourself - /Services/careproviders/LeaveReview/DefaultView.aspx?id=1-465217737,0,0,,
Court House Care Home,1-11985267647,SCL,3-5 Court Road,,,Malvern,Worcestershire,WR14 3BU,Tel: 01684572271,No ratings yet Rate it yourself - /Services/careproviders/LeaveReview/DefaultView.aspx?id=1-11985267647,0,0,,
Your Life (Malvern),1-965110947,SCL,Cartwright Court,Victoria Road,,Malvern,Worcestershire,WR14 2GE,Tel: 01684892076,No ratings yet Rate it yourself - /Services/careproviders/LeaveReview/DefaultView.aspx?id=1-965110947,0,0,,
Wishmoor,1-128543581,SCL,21 Avenue Road,,,Malvern,Worcestershire,WR14 3AY,Tel: 01684 569162,No ratings yet Rate it yourself - /Services/careproviders/LeaveReview/DefaultView.aspx?id=1-128543581,0,0,,
The Avenue Care Home,1-115277863,SCL,23 Avenue Road,,,Malvern,Worcestershire,WR14 3AY,Tel: 01684575922,No ratings yet Rate it yourself - /Services/careproviders/LeaveReview/DefaultView.aspx?id=1-115277863,0,0,,
Hastings Residential Care Home,1-124396149,SCL,130 Barnards Green Road,,,Malvern,Worcestershire,WR14 3NA,Tel: 01684585000,No ratings yet Rate it yourself - /Services/careproviders/LeaveReview/DefaultView.aspx?id=1-124396149,0,0,,
Windsor Court Care Home,1-11264924028,SCL,Lansdowne Crescent,,,Malvern,Worcestershire,WR14 2AW,Tel: 01684882399,No ratings yet Rate it yourself - /Services/careproviders/LeaveReview/DefaultView.aspx?id=1-11264924028,0,0,,
Mowbray Nursing Home,1-123533751,SCL,Victoria Road,,,Malvern,Worcestershire,WR14 2TF,Tel: 01684572946,No ratings yet Rate it yourself - /Services/careproviders/LeaveReview/DefaultView.aspx?id=1-123533751,0,0,,
The Boynes Care Centre,1-140140646,SCL,Upper Hook Road,Upton-upon-Severn,,Worcester,Worcestershire,WR8 0SB,Tel: 01684594001,3 ratings Rate it yourself - /Services/careproviders/LeaveReview/DefaultView.aspx?id=1-140140646,,,,
Albion Lodge Retirement Home,1-1693301436,SCL,Hanley Swan,Robert End,,Worcester,Worcestershire,WR8 0DN,Tel: 01684310626,No ratings yet Rate it yourself - /Services/careproviders/LeaveReview/DefaultView.aspx?id=1-1693301436,0,0,,
Acer Care and Care 4 Me,1-10324127390,SCL,Homestead,"Roberts End, Hanley Swan",,Worcester,Worcestershire,WR8 0DN,Tel: 01684491607,No ratings yet Rate it yourself - /Services/careproviders/LeaveReview/DefaultView.aspx?id=1-10324127390,0,0,,
Millfields Care Ltd,1-12353191854,SCL,40 Cockshot Road,,,Malvern,,WR14 2TT,Tel: 07515541158,1 rating Rate it yourself - /Services/careproviders/LeaveReview/DefaultView.aspx?id=1-12353191854,,,,
Friends of the Elderly Malvern,1-117309799,SCL,148 Graham Road,,,Malvern,Worcestershire,WR14 2HY,Tel: 01684574385,No ratings yet Rate it yourself - /Services/careproviders/LeaveReview/DefaultView.aspx?id=1-117309799,0,0,,
Cleeve House,1-135441632,SCL,49 Hornyold Road,,,Malvern,Worcestershire,WR14 1QH,Tel: 01684564454,No ratings yet Rate it yourself - /Services/careproviders/LeaveReview/DefaultView.aspx?id=1-135441632,0,0,,
Easy Living Solutions,1-2711584339,SCL,10 Broad Street,,,Newent,Gloucestershire,GL18 1AH,Tel: 01531820556,No ratings yet Rate it yourself - /Services/careproviders/LeaveReview/DefaultView.aspx?id=1-2711584339,0,0,,
The Oaks,1-113493371,SCL,165 Worcester Road,,,Malvern,Worcestershire,WR14 1ET,Tel: 01684572079,No ratings yet Rate it yourself - /Services/careproviders/LeaveReview/DefaultView.aspx?id=1-113493371,0,0,,
Howbury House Resource Centre,1-147763036,SCL,Pickersleigh Grove,,,Malvern,Worcestershire,WR14 2LU,Tel: 01684571750,No ratings yet Rate it yourself - /Services/careproviders/LeaveReview/DefaultView.aspx?id=1-147763036,0,0,,
The Lawns,1-7799732558,SCL,The Lawns,"Link End Road, Corse Lawn",,Gloucester,,GL19 4NN,Tel: 01452780353,No ratings yet Rate it yourself - /Services/careproviders/LeaveReview/DefaultView.aspx?id=1-7799732558,0,0,,
Highfields Residential/Dementia Care Home,1-13940784670,SCL,Culver Street,,,Newent,,GL18 1JA,Tel: 07977776457,No ratings yet Rate it yourself - /Services/careproviders/LeaveReview/DefaultView.aspx?id=1-13940784670,0,0,,
Walsingham Support - Pound Farm,1-5919607536,SCL,Pound Farm,Gorsley,,Ross-on-wye,,HR9 7SL,Tel: 01989720546,No ratings yet Rate it yourself - /Services/careproviders/LeaveReview/DefaultView.aspx?id=1-5919607536,0,0,,
Ashwell Home Care Services Limited,1-7499411096,SCL,Troyte House,Sandys Road,,Malvern,,WR14 1JJ,Tel: 01684778750,No ratings yet Rate it yourself - /Services/careproviders/LeaveReview/DefaultView.aspx?id=1-7499411096,0,0,,
The Springs Care Home,1-130120870,SCL,Spring Lane,,,Malvern,Worcestershire,WR14 1AL,Tel: 01684571300,No ratings yet Rate it yourself - /Services/careproviders/LeaveReview/DefaultView.aspx?id=1-130120870,0,0,,
Newlife Care Providers,1-2922803038,SCL,"HDAnywhere, The Haysfield",Spring Lane North,,Malvern,,WR14 1GF,Tel: 07414260226,No ratings yet Rate it yourself - /Services/careproviders/LeaveReview/DefaultView.aspx?id=1-2922803038,0,0,,
Matrixcare,1-3229146212,SCL,369 Worcester Road,,,Malvern,Worcestershire,WR14 1AR,Tel: 01684568097,No ratings yet Rate it yourself - /Services/careproviders/LeaveReview/DefaultView.aspx?id=1-3229146212,0,0,,
Springfield House,1-2061660719,SCL,3-5 Ranelagh Road,,,Malvern,Worcestershire,WR14 1BQ,Tel: 01684574248,No ratings yet Rate it yourself - /Services/careproviders/LeaveReview/DefaultView.aspx?id=1-2061660719,0,0,,
Radis Community Care (Clarence Park Village),1-4279579084,SCL,Clarence Park Village,415 Worcester Road,,Malvern,Worcestershire,WR14 1PP,Tel: 01684583010,No ratings yet Rate it yourself - /Services/careproviders/LeaveReview/DefaultView.aspx?id=1-4279579084,0,0,,
Dalvington/The Oaks,1-120634754,SCL,Dalvington,146 Lower Howsell Road,,Malvern,Worcestershire,WR14 1DL,Tel: 01886833424,No ratings yet Rate it yourself - /Services/careproviders/LeaveReview/DefaultView.aspx?id=1-120634754,0,0,,
Options Malvern View,1-119276146,SCL,The Rhydd,,,Hanley Castle,Worcestershire,WR8 0AD,Tel: 01684312610,No ratings yet Rate it yourself - /Services/careproviders/LeaveReview/DefaultView.aspx?id=1-119276146,0,0,,
Beechwood Residential Care Home,1-124396235,SCL,The Beeches,Holly Green,,Upton-upon-Severn,Worcestershire,WR8 0RR,Tel: 01684595959,No ratings yet Rate it yourself - /Services/careproviders/LeaveReview/DefaultView.aspx?id=1-124396235,0,0,,
Brockhampton Court Nursing Home Ltd,1-15756457316,SCL,Brockhampton Court Care Home,Brockhampton,,Hereford,,HR1 4TQ,Tel: 01989740239,No ratings yet Rate it yourself - /Services/careproviders/LeaveReview/DefaultView.aspx?id=1-15756457316,0,0,,
Hamilton House,1-376104650,SCL,Leigh Sinton,,,Malvern,Worcestershire,WR13 5DZ,Tel: 01886832456,No ratings yet Rate it yourself - /Services/careproviders/LeaveReview/DefaultView.aspx?id=1-376104650,0,0,,
Tewkesbury Fields,1-12957650694,SCL,The Oxhey,Bushley,,Tewkesbury,Gloucestershire,GL20 6HP,Tel: 01684850311,No ratings yet Rate it yourself - /Services/careproviders/LeaveReview/DefaultView.aspx?id=1-12957650694,0,0,,
Waterside Care Centre,1-123533948,SCL,Leigh Sinton,,,Malvern,Worcestershire,WR13 5EQ,Tel: 01886833706,No ratings yet Rate it yourself - /Services/careproviders/LeaveReview/DefaultView.aspx?id=1-123533948,0,0,,
Alison House,1-10931352436,SCL,Barbers Bridge,Rudford,,Gloucester,,GL2 8DX,Tel: 01452790612,No ratings yet Rate it yourself - /Services/careproviders/LeaveReview/DefaultView.aspx?id=1-10931352436,0,0,,
Ablegrange Severn Heights Limited,1-125587087,SCL,Old Hills,Callow End,,Worcester,Worcestershire,WR2 4TQ,Tel: 01905831199,No ratings yet Rate it yourself - /Services/careproviders/LeaveReview/DefaultView.aspx?id=1-125587087,0,0,,
Options Bredon House,1-476877271,SCL,Hospital Lane,Powick,,Worcester,,WR2 4SQ,Tel: 01905830234,1 rating Rate it yourself - /Services/careproviders/LeaveReview/DefaultView.aspx?id=1-476877271,,,,
Whitestone Care Limited Worcester,1-18211661535,SCL,Strensham M5 Northbound Service Area,"Strensham, Hillcroome, Upton-upon-severn",,Worcester,,WR8 0BZ,Tel: 08000851254,No ratings yet Rate it yourself - /Services/careproviders/LeaveReview/DefaultView.aspx?id=1-18211661535,0,0,,
The Lawns,1-115758642,SCL,Main Road,Kempsey,,Worcester,Worcestershire,WR5 3NF,Tel: 01905 821388,No ratings yet Rate it yourself - /Services/careproviders/LeaveReview/DefaultView.aspx?id=1-115758642,0,0,,
Apperley House,1-17595436735,SCL,97 Gloucester Road,,,Tewkesbury,Gloucestershire,GL20 5SU,Tel: 01684292658,No ratings yet Rate it yourself - /Services/careproviders/LeaveReview/DefaultView.aspx?id=1-17595436735,0,0,,
Theoc House,1-1441009182,SCL,Margaret Road,Priors Park,,Tewkesbury,Gloucestershire,GL20 5HX,Tel: 01684297358,No ratings yet Rate it yourself - /Services/careproviders/LeaveReview/DefaultView.aspx?id=1-1441009182,0,0,,
Ross Court Care Home,1-1040494951,SCL,Overross Close,,,Ross On Wye,Herefordshire,HR9 7BQ,Tel: 01989764349,No ratings yet Rate it yourself - /Services/careproviders/LeaveReview/DefaultView.aspx?id=1-1040494951,0,0,,
Flexicare Home Services UK Ltd,1-8490886083,SCL,Unit 14,"The Steadings Business Centre, Maisemore",,Gloucester,,GL2 8EY,Tel: 01452306296,1 rating Rate it yourself - /Services/careproviders/LeaveReview/DefaultView.aspx?id=1-8490886083,,,,
Flexicare Newent and Ledbury Ltd,1-17590405935,SCL,Unit 14b,"The Steadings Business Centre, Maisemore",,Gloucester,,GL2 8EY,Tel: 01531888084,No ratings yet Rate it yourself - /Services/careproviders/LeaveReview/DefaultView.aspx?id=1-17590405935,0,0,,
Radis Community Care (Gloucester),1-5024539714,SCL,Unit 22 The Steadings Business Centre,Maisemore,,Gloucester,,GL2 8EY,Tel: 01452305628,No ratings yet Rate it yourself - /Services/careproviders/LeaveReview/DefaultView.aspx?id=1-5024539714,0,0,,
Flexicare Stroud Ltd,1-8451740865,SCL,Unit 14a,"The Steadings Business Centre, Maisemore",,Gloucester,,GL2 8EY,Tel: 01453824958,No ratings yet Rate it yourself - /Services/careproviders/LeaveReview/DefaultView.aspx?id=1-8451740865,0,0,,
Gloucestershire Community Support Services,1-10512282376,SCL,Church Road,Maisemore,,Gloucester,Gloucestershire,GL2 8HB,Tel: 07876831102,No ratings yet Rate it yourself - /Services/careproviders/LeaveReview/DefaultView.aspx?id=1-10512282376,0,0,,
Coppice House,1-2846051322,SCL,Main Road,Huntley,,Gloucester,Gloucestershire,GL19 3DZ,Tel: 01452831896,No ratings yet Rate it yourself - /Services/careproviders/LeaveReview/DefaultView.aspx?id=1-2846051322,0,0,,
Longhope Manor,1-113063398,SCL,Church Road,,,Longhope,Gloucestershire,GL17 0LL,Tel: 01452830291,1 rating Rate it yourself - /Services/careproviders/LeaveReview/DefaultView.aspx?id=1-113063398,,,,
The Laurels,1-2488910175,SCL,Main Road,Huntley,,Gloucester,Gloucestershire,GL19 3EA,Tel: 01452901243,No ratings yet Rate it yourself - /Services/careproviders/LeaveReview/DefaultView.aspx?id=1-2488910175,0,0,,
Pirton Grange Specialist Services,1-142667700,SCL,Worcester Road,Pirton,,Worcester,Worcestershire,WR8 9EF,,No ratings yet Rate it yourself - /Services/careproviders/LeaveReview/DefaultView.aspx?id=1-142667700,0,0,,
La Vie En Rose Ltd,1-8088245430,SCL,18 Ashchurch Road,The Canterbury Business Centre,,Tewkesbury,,GL20 8BT,Tel: 01684439564,No ratings yet Rate it yourself - /Services/careproviders/LeaveReview/DefaultView.aspx?id=1-8088245430,0,0,,
Choice Supported Living - West,1-2847313986,SCL,"Unit 6, Highnam Business Centre","Newent Road, Highnam",,Gloucester,Gloucestershire,GL2 8DN,Tel: 01452768758,No ratings yet Rate it yourself - /Services/careproviders/LeaveReview/DefaultView.aspx?id=1-2847313986,0,0,,
Agincare Gloucester,1-11743774428,SCL,Unit 19.5 Highnam Business Centre,"Newent Road, Highnam",,Gloucester,,GL2 8DN,,No ratings yet Rate it yourself - /Services/careproviders/LeaveReview/DefaultView.aspx?id=1-11743774428,0,0,,
BLACK & WHITE GROUP limited,1-7644360837,SCL,Unit 5 Highnam Business Centre,"Newent Road, Highnam",,Gloucester,,GL2 8DN,Tel: 01452226136,No ratings yet Rate it yourself - /Services/careproviders/LeaveReview/DefaultView.aspx?id=1-7644360837,0,0,,
Sunnyside House,1-2847247762,SCL,"Main Road, Birdwood",,,Gloucester,Gloucestershire,GL19 3EH,Tel: 01452750152,No ratings yet Rate it yourself - /Services/careproviders/LeaveReview/DefaultView.aspx?id=1-2847247762,0,0,,
Hands Care Agency,1-865520121,SCL,Unit D Platform 88,Ashburton Industrial Estate,,Ross On Wye,Herefordshire,HR9 7BW,Tel: 01989566186,No ratings yet Rate it yourself - /Services/careproviders/LeaveReview/DefaultView.aspx?id=1-865520121,0,0,,
Orchard House,1-134889418,SCL,The Walk,Withington,,Hereford,Herefordshire,HR1 3PR,Tel: 0800 902 0092,No ratings yet Rate it yourself - /Services/careproviders/LeaveReview/DefaultView.aspx?id=1-134889418,0,0,,
The Old Rectory,1-118868146,SCL,School Lane,Church Road,,Longhope,Gloucestershire,GL17 0LJ,Tel: 01452831135,1 rating Rate it yourself - /Services/careproviders/LeaveReview/DefaultView.aspx?id=1-118868146,,,,
Total Living Care,1-1520389628,SCL,"Haigh Main Building, Haigh Engineering Co Ltd","Alton Road, Ross-on-wye",,Ross-on-wye,,HR9 5NG,Tel: 01989562000,1 rating Rate it yourself - /Services/careproviders/LeaveReview/DefaultView.aspx?id=1-1520389628,,,,
Ashfield Care Ltd,1-582310149,SCL,Ashfield Care,Chase Industrial Estate,,Ross-on-Wye,Herefordshire,HR9 5WA,Tel: 01989565309,No ratings yet Rate it yourself - /Services/careproviders/LeaveReview/DefaultView.aspx?id=1-582310149,0,0,,
Forest Court Care Home,1-6534200936,SCL,Bradley Court Road,,,Mitcheldean,Gloucestershire,GL17 0DR,Tel: 01989750775,No ratings yet Rate it yourself - /Services/careproviders/LeaveReview/DefaultView.aspx?id=1-6534200936,0,0,,
BBcare10,1-10410348422,SCL,Bradley Court Road,,,Mitcheldean,,GL17 0DR,Tel: 07932105542,No ratings yet Rate it yourself - /Services/careproviders/LeaveReview/DefaultView.aspx?id=1-10410348422,0,0,,
Dignity Care Services Limited Offices,1-17712319922,SCL,Basepoint Business Centre,"58 Oakfield Close, Tewkesbury Business Park",,Tewkesbury,,GL20 8SD,Tel: 01684770215,No ratings yet Rate it yourself - /Services/careproviders/LeaveReview/DefaultView.aspx?id=1-17712319922,0,0,,
NSF Health,1-14815195142,SCL,"Office 47, Basepoint Business Centre","Oakfield Close, Tewkesbury Business Park",,Tewkesbury,,GL20 8SD,Tel: 07403316439,No ratings yet Rate it yourself - /Services/careproviders/LeaveReview/DefaultView.aspx?id=1-14815195142,0,0,,
Aspire Living - 1-2 Markyes Close,1-121620583,SCL,1-2 Markyes Close,,,Ross on Wye,Herefordshire,HR9 7BZ,Tel: 01989769035,No ratings yet Rate it yourself - /Services/careproviders/LeaveReview/DefaultView.aspx?id=1-121620583,0,0,,
Lammas Lodge,1-350355992,SCL,Lugwardine,,,Hereford,Herefordshire,HR1 4DS,Tel: 01432853185,No ratings yet Rate it yourself - /Services/careproviders/LeaveReview/DefaultView.aspx?id=1-350355992,0,0,,
Aspects 2 Supported Living Service,1-1135161188,SCL,21 Miller Court,"Severn Drive, Tewkesbury Business Park",,Tewkesbury,Gloucestershire,GL20 8DN,Tel: 01453763600,No ratings yet Rate it yourself - /Services/careproviders/LeaveReview/DefaultView.aspx?id=1-1135161188,0,0,,
Inclusion Care,1-2016920610,SCL,Unit 21 Miller Court Tewkesbury Business Park,Severn Drive,,Tewkesbury,Gloucestershire,GL20 8DN,Tel: 01684778269,1 rating Rate it yourself - /Services/careproviders/LeaveReview/DefaultView.aspx?id=1-2016920610,,,,
Chepstow House,1-111393260,SCL,Old Maids Walk,,,Ross On Wye,Herefordshire,HR9 5HB,Tel: 01989566027,No ratings yet Rate it yourself - /Services/careproviders/LeaveReview/DefaultView.aspx?id=1-111393260,0,0,,
Old Court Barn Residential Care Home,1-114140620,SCL,Old Court Barn,Lumber Lane,,Lugwardine,Herefordshire,HR1 4AQ,Tel: 01432851260,No ratings yet Rate it yourself - /Services/careproviders/LeaveReview/DefaultView.aspx?id=1-114140620,0,0,,
Brook Lodge,1-1440848763,SCL,Latchen,,,Longhope,,GL17 0QA,Tel: 01452830614,No ratings yet Rate it yourself - /Services/careproviders/LeaveReview/DefaultView.aspx?id=1-1440848763,0,0,,
Curlew Close,1-119185514,SCL,1 Curlew Close,Northway,,Tewkesbury,Gloucestershire,GL20 8TJ,Tel: 01684275991,No ratings yet Rate it yourself - /Services/careproviders/LeaveReview/DefaultView.aspx?id=1-119185514,0,0,,
Teme Court Residential Care Home,1-113398333,SCL,Old Road,Lower Wick,,Worcester,Worcestershire,WR2 4BU,Tel: 01905972023,No ratings yet Rate it yourself - /Services/careproviders/LeaveReview/DefaultView.aspx?id=1-113398333,0,0,,
Stanfield Nursing Home Limited,1-114409532,SCL,Upper Wick Lane,Rushwick,,Worcester,Worcestershire,WR2 5SU,,No ratings yet Rate it yourself - /Services/careproviders/LeaveReview/DefaultView.aspx?id=1-114409532,0,0,,
Bedwardine House Residential Care Home,1-115230808,SCL,Upper Wick Lane,Rushwick,,Worcester,Worcestershire,WR2 5SU,Tel: 01905425101,No ratings yet Rate it yourself - /Services/careproviders/LeaveReview/DefaultView.aspx?id=1-115230808,0,0,,
Knightsbridge Lodge,1-1026224214,SCL,Knightsbridge Green,Knightsbridge,,Cheltenham,Gloucestershire,GL51 9TA,Tel: 01242680168,2 ratings Rate it yourself - /Services/careproviders/LeaveReview/DefaultView.aspx?id=1-1026224214,,,,
Dependable Home Care Services Limited,1-4207242680,SCL,61 Canada Way,,,Worcester,,WR2 4XA,Tel: 07594683830,No ratings yet Rate it yourself - /Services/careproviders/LeaveReview/DefaultView.aspx?id=1-4207242680,0,0,,
Rosedale Retirement Home,1-405532018,SCL,Ashfield Crescent,,,Ross On Wye,Herefordshire,HR9 5PH,Tel: 01989218082,No ratings yet Rate it yourself - /Services/careproviders/LeaveReview/DefaultView.aspx?id=1-405532018,0,0,,
Field Farm House Residential Home,1-119287799,SCL,Hampton Bishop,,,Hereford,Herefordshire,HR1 4JP,,1 rating Rate it yourself - /Services/careproviders/LeaveReview/DefaultView.aspx?id=1-119287799,,,,
West Bank Residential Home,1-486739010,SCL,Walford Road,,,Ross-on-Wye,Herefordshire,HR9 5PQ,Tel: 01989562741,1 rating Rate it yourself - /Services/careproviders/LeaveReview/DefaultView.aspx?id=1-486739010,,,,
Highwell House Care Home with Nursing,1-121568260,SCL,32 Highwell Lane,,,Bromyard,Herefordshire,HR7 4DG,Tel: 01885488282,No ratings yet Rate it yourself - /Services/careproviders/LeaveReview/DefaultView.aspx?id=1-121568260,0,0,,
Froome Bank,1-134889315,SCL,Tower Hill,,,Bromyard,Herefordshire,HR7 4DF,Tel: 080 0902 0092,No ratings yet Rate it yourself - /Services/careproviders/LeaveReview/DefaultView.aspx?id=1-134889315,0,0,,
BBcare10 LTD,1-15268486355,SCL,Office 45,Vantage Point Business Village,,Mitcheldean,,GL17 0DD,Tel: 01594806110,No ratings yet Rate it yourself - /Services/careproviders/LeaveReview/DefaultView.aspx?id=1-15268486355,0,0,,