Organisation Name,NACS Code,Organisation Type,Address1,Address2,Address3,Address4,Address5,PostCode,Telephone Number,NHS.UK users rating,Value  (NHS.UK users rating),Banding Classification  (NHS.UK users rating),Car parking (Is there car parking at this organisation?),Disabled access (Disabled access)
Beatitude Care Ltd,1-14326932405,SCL,"The Centre, Jubilee Priesthood Centre",New Road,,Feltham,,TW14 8HR,Tel: 07931520456,No ratings yet Rate it yourself - /Services/careproviders/LeaveReview/DefaultView.aspx?id=1-14326932405,0,0,,
Amber Home Carers,1-5013604773,SCL,397 Staines Road,,,Feltham,,TW14 9HA,Tel: 02088902566,No ratings yet Rate it yourself - /Services/careproviders/LeaveReview/DefaultView.aspx?id=1-5013604773,0,0,,
HOLISTIC CARE AND TRAINING C.I.C,1-13625289562,SCL,Waterfields Residents Association Centre,Watermead,,Feltham,,TW14 8BA,Tel: 07388921311,No ratings yet Rate it yourself - /Services/careproviders/LeaveReview/DefaultView.aspx?id=1-13625289562,0,0,,
Sandbanks Resource Centre,1-427602743,SCL,Beattie Close,,,Feltham,Middlesex,TW14 9RR,Tel: 02085835050,1 rating Rate it yourself - /Services/careproviders/LeaveReview/DefaultView.aspx?id=1-427602743,,,,
London Care (Bristol Court),1-7187144955,SCL,Bristol Court,United Drive,,Feltham,,TW14 9AG,Tel: 02085889921,1 rating Rate it yourself - /Services/careproviders/LeaveReview/DefaultView.aspx?id=1-7187144955,,,,
The White House,1-133299302,SCL,39a Shaftesbury Avenue,,,Feltham,Middlesex,TW14 9LN,Tel: 02088903020,No ratings yet Rate it yourself - /Services/careproviders/LeaveReview/DefaultView.aspx?id=1-133299302,0,0,,
Derwent Lodge Care Centre,1-4122337093,SCL,Fern Grove,off Hounslow Road,,London,,TW14 9AY,Tel: 020 8844 2975,No ratings yet Rate it yourself - /Services/careproviders/LeaveReview/DefaultView.aspx?id=1-4122337093,0,0,,
Fern Gardens Care Home,1-4122337037,SCL,Fern Grove,Off Hounslow Road,,London,,TW14 9AY,Tel: 020 8844 4860,1 rating Rate it yourself - /Services/careproviders/LeaveReview/DefaultView.aspx?id=1-4122337037,,,,
Ashford House,1-125862197,SCL,Long Lane,,,Stanwell,Middlesex,TW19 7AZ,Tel: 01784425810,No ratings yet Rate it yourself - /Services/careproviders/LeaveReview/DefaultView.aspx?id=1-125862197,0,0,,
Dimensions 7 Huntley Close,1-352113929,SCL,7 Huntley Close,Stanwell,,Staines,Middlesex,TW19 7DD,Tel: 01784254322,No ratings yet Rate it yourself - /Services/careproviders/LeaveReview/DefaultView.aspx?id=1-352113929,0,0,,
Mitus Care,1-12539911993,SCL,2 River Gardens,,,Feltham,,TW14 0RE,Tel: 07506877982,No ratings yet Rate it yourself - /Services/careproviders/LeaveReview/DefaultView.aspx?id=1-12539911993,0,0,,
Chestnut Court & Beechwood Court (Care Outlook),1-18991808282,SCL,23 Mulberry Avenue,,,Staines-upon-thames,,TW19 7SF,Tel: 02086959075,No ratings yet Rate it yourself - /Services/careproviders/LeaveReview/DefaultView.aspx?id=1-18991808282,0,0,,
Church View,1-14879086072,SCL,Falcon Drive,Stanwell,,Staines-upon-thames,,TW19 7EU,Tel: 01784248610,No ratings yet Rate it yourself - /Services/careproviders/LeaveReview/DefaultView.aspx?id=1-14879086072,0,0,,
Echelforde,1-139851726,SCL,College Way,,,Ashford,Middlesex,TW15 2XG,Tel: 01784255225,No ratings yet Rate it yourself - /Services/careproviders/LeaveReview/DefaultView.aspx?id=1-139851726,0,0,,
Quality Caring Limited,1-293468430,SCL,"Unit 7, Maple Grove",Lawrence Road,,Hounslow,Middlesex,TW4 6DR,Tel: 02088143000,No ratings yet Rate it yourself - /Services/careproviders/LeaveReview/DefaultView.aspx?id=1-293468430,0,0,,
Allium Homecare,1-4914582641,SCL,87 Church Road,,,Ashford,Surrey,TW15 2PE,Tel: 01784 682560,No ratings yet Rate it yourself - /Services/careproviders/LeaveReview/DefaultView.aspx?id=1-4914582641,0,0,,
Boyce Care,1-1891763984,SCL,172 Feltham Hill Road,,,Ashford,Middlesex,TW15 1LF,Tel: 07590111121,No ratings yet Rate it yourself - /Services/careproviders/LeaveReview/DefaultView.aspx?id=1-1891763984,0,0,,
The Cedars Care Home,1-163196989,SCL,16 Fordbridge Road,,,Ashford,Middlesex,TW15 2SG,,No ratings yet Rate it yourself - /Services/careproviders/LeaveReview/DefaultView.aspx?id=1-163196989,0,0,,
"Kheyr Healthcare Ltd - The Vista Centre, Suite A3:08B, 3rd Floor, 50 Salisbury Road",1-18444455609,SCL,"The Vista Centre, Suite A3:08B, 3rd Floor",50 Salisbury Road,,Hounslow,,TW4 6JQ,Tel: 03330508929,No ratings yet Rate it yourself - /Services/careproviders/LeaveReview/DefaultView.aspx?id=1-18444455609,0,0,,
Schreiber Care UK - London,1-13579832179,SCL,Vista Business Centre,50 Salisbury Road,,Hounslow,Middlesex,TW4 6JQ,Tel: 02071014143,No ratings yet Rate it yourself - /Services/careproviders/LeaveReview/DefaultView.aspx?id=1-13579832179,0,0,,
Care Plus More,1-4576665555,SCL,Care Plus More LTD,"HEAD OFFICE, A1 42, The Vista Centre",,Hounslow,Middlesex,TW4 6JQ,Tel: 07956054109,No ratings yet Rate it yourself - /Services/careproviders/LeaveReview/DefaultView.aspx?id=1-4576665555,0,0,,
Visiting Angels - South Middlesex,1-10803041642,SCL,"Vista Centre,Suite 2A, Floor 6, Block B",50 Salisbury Road,,Hounslow,,TW4 6JQ,Tel: 02031435056,No ratings yet Rate it yourself - /Services/careproviders/LeaveReview/DefaultView.aspx?id=1-10803041642,0,0,,
Eleada Care Services,1-14484222050,SCL,"A1:41, Vista Business Centre",50 Salisbury Road,,Hounslow,,TW4 6JQ,Tel: 02085380100,No ratings yet Rate it yourself - /Services/careproviders/LeaveReview/DefaultView.aspx?id=1-14484222050,0,0,,
Angelic Health Ltd,1-14589226000,SCL,Vista Centre,50 Salisbury Road,,Hounslow,,TW4 6JQ,,No ratings yet Rate it yourself - /Services/careproviders/LeaveReview/DefaultView.aspx?id=1-14589226000,0,0,,
Immaculate Care Limited,1-9861340170,SCL,50 Salisbury Road,,,Hounslow,Middlesex,TW4 6JQ,Tel: 07856857807,1 rating Rate it yourself - /Services/careproviders/LeaveReview/DefaultView.aspx?id=1-9861340170,,,,
Firex Domiciliary Care Limited,1-14634271723,SCL,Vista Business Centre,50 Salisbury Road,,Hounslow,Middlesex,TW4 6JQ,Tel: 07555649019,No ratings yet Rate it yourself - /Services/careproviders/LeaveReview/DefaultView.aspx?id=1-14634271723,0,0,,
Vector Care Supported Living,1-15776512461,SCL,Vista Office Centre,50 Salisbury Road,,Hounslow,Middlesex,TW4 6JQ,Tel: 07460840032,No ratings yet Rate it yourself - /Services/careproviders/LeaveReview/DefaultView.aspx?id=1-15776512461,0,0,,
Procare Team Ltd,1-14185571909,SCL,Vista Business Centre,50 Salisbury Road,,Hounslow,Middlesex,TW4 6JQ,Tel: 02038839058,No ratings yet Rate it yourself - /Services/careproviders/LeaveReview/DefaultView.aspx?id=1-14185571909,0,0,,
Avant Homecare - Hounslow,1-2528221468,SCL,Vista Business Centre,"6th Floor, Block B",,London,,TW4 6JQ,Tel: 020 3805 0610,6 ratings Rate it yourself - /Services/careproviders/LeaveReview/DefaultView.aspx?id=1-2528221468,,,,
"Medinova Healthcare Ltd,",1-12568187321,SCL,B2-14 Vista Centre,50 Salisbury Road,,Hounslow,,TW4 6JQ,Tel: 02035398638,No ratings yet Rate it yourself - /Services/careproviders/LeaveReview/DefaultView.aspx?id=1-12568187321,0,0,,
Passion Recruitment Agency,1-5613933002,SCL,Vista Business Centre,50 Salisbury Road,,Hounslow,Middlesex,TW4 6JQ,Tel: 03330115817,No ratings yet Rate it yourself - /Services/careproviders/LeaveReview/DefaultView.aspx?id=1-5613933002,0,0,,
Avant Homecare - Hillingdon,1-2936868235,SCL,Vista Centre,6th Floor,,London,,TW4 6JQ,Tel: 020 3805 0610,6 ratings Rate it yourself - /Services/careproviders/LeaveReview/DefaultView.aspx?id=1-2936868235,,,,
Goodluck Care Limited - Hounslow,1-2703145341,SCL,Vista Business Centre,50 Salisbury Road,,Hounslow,Middlesex,TW4 6JQ,Tel: 020 3011 2119,No ratings yet Rate it yourself - /Services/careproviders/LeaveReview/DefaultView.aspx?id=1-2703145341,0,0,,
Jeremys Carebuddies Limited,1-3698739561,SCL,Vista Office Centre,50 Salisbury Road,,Hounslow,Middlesex,TW4 6JQ,Tel: 02085380127,No ratings yet Rate it yourself - /Services/careproviders/LeaveReview/DefaultView.aspx?id=1-3698739561,0,0,,
Vista Business Centre,1-2778133165,SCL,50 Salisbury Road,,,Hounslow,Middlesex,TW4 6JQ,Tel: 02071835355,No ratings yet Rate it yourself - /Services/careproviders/LeaveReview/DefaultView.aspx?id=1-2778133165,0,0,,
Silverdale Care Limited,1-6447271635,SCL,"Suite 2A, 10 Vista Office Centre",50 Salisbury Road,,Hounslow,,TW4 6JQ,Tel: 07951999553,No ratings yet Rate it yourself - /Services/careproviders/LeaveReview/DefaultView.aspx?id=1-6447271635,0,0,,
4 Firs Drive,1-14306064460,SCL,4 Firs Drive,,,Hounslow,,TW5 9TD,Tel: 07730010324,No ratings yet Rate it yourself - /Services/careproviders/LeaveReview/DefaultView.aspx?id=1-14306064460,0,0,,
Morecare Services(UK)Ltd,1-477624268,SCL,51 Ferndale Road,,,Ashford,Surrey,TW15 3PP,Tel: 01784247782,4 ratings Rate it yourself - /Services/careproviders/LeaveReview/DefaultView.aspx?id=1-477624268,,,,
Martindale Road,1-10970925165,SCL,329 Martindale Road,,,Hounslow,Middlesex,TW4 7HG,Tel: 01992443189,No ratings yet Rate it yourself - /Services/careproviders/LeaveReview/DefaultView.aspx?id=1-10970925165,0,0,,
United Response - 16 Curtis Road,1-123018055,SCL,16 Curtis Road,,,Whitton,Middlesex,TW4 5PT,Tel: 02088986026,No ratings yet Rate it yourself - /Services/careproviders/LeaveReview/DefaultView.aspx?id=1-123018055,0,0,,
Ashton Lodge Nursing Home,1-134768372,SCL,Spelthorne Grove,,,Sunbury On Thames,Middlesex,TW16 7DA,Tel: 01932761761,No ratings yet Rate it yourself - /Services/careproviders/LeaveReview/DefaultView.aspx?id=1-134768372,0,0,,
Ashgrove Care Home - London,1-319142817,SCL,"Fir Tree Road, off Martindale Road",Hounslow,,London,,TW4 7HH,Tel: 02085776226,No ratings yet Rate it yourself - /Services/careproviders/LeaveReview/DefaultView.aspx?id=1-319142817,0,0,,
Crown Senior Care,1-5199699637,SCL,Suite 204 Legacy Centre,"Hanworth Trading Estate, Hampton Road West",,Feltham,,TW13 6DH,Tel: 02087970399,1 rating Rate it yourself - /Services/careproviders/LeaveReview/DefaultView.aspx?id=1-5199699637,,,,
Green Care Services,1-5099791301,SCL,"Legacy Centre, Suite 219","Hanworth Trade Park, Hampton Road West",,Feltham,,TW13 6DH,Tel: 01784391214,No ratings yet Rate it yourself - /Services/careproviders/LeaveReview/DefaultView.aspx?id=1-5099791301,0,0,,
Democare Services Limited,1-8694085844,SCL,Suit No 104 Legacy Centre,"Hanworth Trading Estate, Hampton Road West",,Feltham,,TW13 6DH,Tel: 02087555844,No ratings yet Rate it yourself - /Services/careproviders/LeaveReview/DefaultView.aspx?id=1-8694085844,0,0,,
Muzaana Care Services Ltd,1-4997224499,SCL,"Suite 210, Legacy Centre",Hanworth Trading Estate,,London,,TW13 6DH,Tel: 020 8755 5837,No ratings yet Rate it yourself - /Services/careproviders/LeaveReview/DefaultView.aspx?id=1-4997224499,0,0,,
OFH Care,1-11287415769,SCL,"Suite 202, The Legacy Centre","Hanworth Trading Estate, Hampton Road West",,Feltham,,TW13 6DH,Tel: 03339398032,No ratings yet Rate it yourself - /Services/careproviders/LeaveReview/DefaultView.aspx?id=1-11287415769,0,0,,
82 Bear Road,1-390922730,SCL,82 Bear Road,,,Feltham,Middlesex,TW13 6RG,Tel: 02087445211,No ratings yet Rate it yourself - /Services/careproviders/LeaveReview/DefaultView.aspx?id=1-390922730,0,0,,
SureCare Ealing and Hounslow,1-12673216236,SCL,"Unit 2, Links Industrial Estate","Popham Close, Hanworth",,Feltham,,TW13 6JE,,No ratings yet Rate it yourself - /Services/careproviders/LeaveReview/DefaultView.aspx?id=1-12673216236,0,0,,
Bluebird Care Hounslow & Chiswick,1-15837253829,SCL,"Unit 2, Links Industrial Estate","Popham Close, Hanworth",,Feltham,,TW13 6JE,Tel: 02088982349,No ratings yet Rate it yourself - /Services/careproviders/LeaveReview/DefaultView.aspx?id=1-15837253829,0,0,,
United Response - 198 Powder Mill Lane,1-123018083,SCL,198 Powder Mill Lane,,,Whitton,Middlesex,TW2 6EJ,Tel: 02088987445,No ratings yet Rate it yourself - /Services/careproviders/LeaveReview/DefaultView.aspx?id=1-123018083,0,0,,
Apex Prime Care - North West Surrey,1-10771295299,SCL,Mitchison Court,Downside,,Sunbury-on-Thames,,TW16 6RX,Tel: 01932765696,No ratings yet Rate it yourself - /Services/careproviders/LeaveReview/DefaultView.aspx?id=1-10771295299,0,0,,
Acacia Homecare Limited,1-2112646035,SCL,Pod Business Centre,Harris Way,,Sunbury-on-thames,,TW16 7EL,Tel: 02034119011,No ratings yet Rate it yourself - /Services/careproviders/LeaveReview/DefaultView.aspx?id=1-2112646035,0,0,,
Charlotte's Compassionate Care Services Ltd,1-11762194078,SCL,33 Hanworth Road,,,Sunbury-on-thames,,TW16 5AD,Tel: 02034420067,No ratings yet Rate it yourself - /Services/careproviders/LeaveReview/DefaultView.aspx?id=1-11762194078,0,0,,
United Response - 36 Harvey Road,1-5089633116,SCL,36 Harvey Road,Whitton,,Hounslow,Middlesex,TW4 5LU,Tel: 02036681557,No ratings yet Rate it yourself - /Services/careproviders/LeaveReview/DefaultView.aspx?id=1-5089633116,0,0,,
Amazed Care Services,1-3304554472,SCL,24 Edinburgh Drive,,,Staines Upon Thames,Middlesex,TW18 1PH,Tel: 01784255849,No ratings yet Rate it yourself - /Services/careproviders/LeaveReview/DefaultView.aspx?id=1-3304554472,0,0,,
Elysium Care Partnerships Limited - 187 Nursery Road,1-3997000739,SCL,187 Nursery Road,,,Sunbury-on-thames,,TW16 6LX,Tel: 01932481848,No ratings yet Rate it yourself - /Services/careproviders/LeaveReview/DefaultView.aspx?id=1-3997000739,0,0,,
Grosvenor House,1-291161849,SCL,29 Grosvenor Road,,,London,,TW3 3ER,Tel: 020 8569 5147,No ratings yet Rate it yourself - /Services/careproviders/LeaveReview/DefaultView.aspx?id=1-291161849,0,0,,
Keko Personnel Limited,1-15918284720,SCL,37 Petersfield Road,,,Staines-upon-thames,,TW18 1DF,,No ratings yet Rate it yourself - /Services/careproviders/LeaveReview/DefaultView.aspx?id=1-15918284720,0,0,,
89 Hampton Road East,1-336286137,SCL,89 Hampton Road East,,,Feltham,Middlesex,TW13 6JB,,No ratings yet Rate it yourself - /Services/careproviders/LeaveReview/DefaultView.aspx?id=1-336286137,0,0,,
89a Hampton Road East,1-337515524,SCL,89a Hampton Road East,,,Feltham,Middlesex,TW13 6JB,Tel: 02087830044,No ratings yet Rate it yourself - /Services/careproviders/LeaveReview/DefaultView.aspx?id=1-337515524,0,0,,
The Mayfair,1-7413157450,SCL,139 Vicarage Farm Road,,,Hounslow,Middlesex,TW5 0AA,,No ratings yet Rate it yourself - /Services/careproviders/LeaveReview/DefaultView.aspx?id=1-7413157450,0,0,,
Vicarage Farm Nursing Home,1-495374249,SCL,139 Vicarage Farm Road,,,Hounslow,Middlesex,TW5 0AA,Tel: 02085774000,No ratings yet Rate it yourself - /Services/careproviders/LeaveReview/DefaultView.aspx?id=1-495374249,0,0,,
Ivy&Sage Homecare Office,1-10821356131,SCL,Office 2.53 Regus - Heathrow,450 Bath Road,,West Drayton,,UB7 0EB,,No ratings yet Rate it yourself - /Services/careproviders/LeaveReview/DefaultView.aspx?id=1-10821356131,0,0,,
Maya Supported Living Limited,1-5972807572,SCL,Abbey House,450 Bath Road,,West Drayton,Middlesex,UB7 0EB,Tel: 07727181808,No ratings yet Rate it yourself - /Services/careproviders/LeaveReview/DefaultView.aspx?id=1-5972807572,0,0,,
Octavia Housing - Park Lodge House,1-2129291436,SCL,31 Sutton Lane,,,Hounslow,London,TW3 3BB,Tel: 02085775688,No ratings yet Rate it yourself - /Services/careproviders/LeaveReview/DefaultView.aspx?id=1-2129291436,0,0,,
Citywide Care Agency Ltd,1-11199984694,SCL,"Suite 204, 2nd Floor, Holdsworth House",65-73 Staines Road,,Hounslow,,TW3 3JB,Tel: 02086160740,No ratings yet Rate it yourself - /Services/careproviders/LeaveReview/DefaultView.aspx?id=1-11199984694,0,0,,
Hithermoor House,1-12161216851,SCL,265 Hithermoor Road,,,Staines-upon-thames,,TW19 6AZ,Tel: 01753776319,No ratings yet Rate it yourself - /Services/careproviders/LeaveReview/DefaultView.aspx?id=1-12161216851,0,0,,
Priory Supported Living London & Home Counties,1-3746259064,SCL,"GHL Aviation House Ltd, The Lodge & Annex","Harmondsworth Lane, Harmondsworth",,West Drayton,,UB7 0LQ,Tel: 07885881040,No ratings yet Rate it yourself - /Services/careproviders/LeaveReview/DefaultView.aspx?id=1-3746259064,0,0,,
London Borough of Hounslow Home Care,1-2200669237,SCL,Heart of Hounslow Centre for Health,"92 Bath Road, Room 3E, Third Floor",,Hounslow,Middlesex,TW3 3EL,Tel: 02037716210,No ratings yet Rate it yourself - /Services/careproviders/LeaveReview/DefaultView.aspx?id=1-2200669237,0,0,,
Splendour Care Ltd,1-18386960396,SCL,101 Centurion House,London Road,,Staines-upon-thames,,TW18 4AX,Tel: 07459939533,No ratings yet Rate it yourself - /Services/careproviders/LeaveReview/DefaultView.aspx?id=1-18386960396,0,0,,
Senacare Services LTD,1-7746905488,SCL,"Office 201, Centurion House",London Road,,Staines-upon-thames,Surrey,TW18 4AX,Tel: 01784 530 321,1 rating Rate it yourself - /Services/careproviders/LeaveReview/DefaultView.aspx?id=1-7746905488,,,,
Connect Care Ltd,1-9140968761,SCL,Centurion House,London Road,,Staines-upon-thames,,TW18 4AX,Tel: 07903397499,No ratings yet Rate it yourself - /Services/careproviders/LeaveReview/DefaultView.aspx?id=1-9140968761,0,0,,
Motion Care Ltd,1-12262310202,SCL,"Regus, Centurion House",London Road,,Staines-upon-thames,,TW18 4AX,Tel: 01784410045,No ratings yet Rate it yourself - /Services/careproviders/LeaveReview/DefaultView.aspx?id=1-12262310202,0,0,,
Dimensions The Mulberries,1-353888265,SCL,The Mulberries,68 Bath Road,,Hounslow,Middlesex,TW3 3EQ,Tel: 02085701793,No ratings yet Rate it yourself - /Services/careproviders/LeaveReview/DefaultView.aspx?id=1-353888265,0,0,,
Cloisters Care Home,1-189826618,SCL,70 Bath Road,,,London,,TW3 3EQ,Tel: 020 8538 0410,No ratings yet Rate it yourself - /Services/careproviders/LeaveReview/DefaultView.aspx?id=1-189826618,0,0,,
United Response - 8 -10 Woodlawn Crescent,1-5089633283,SCL,8-10 Woodlawn Crescent,,,Twickenham,,TW2 6BE,Tel: 02036681557,No ratings yet Rate it yourself - /Services/careproviders/LeaveReview/DefaultView.aspx?id=1-5089633283,0,0,,
Grasmere Avenue,1-4314965384,SCL,13 Grasmere Avenue,Whitton,,Hounslow,Middlesex,TW3 2JG,,No ratings yet Rate it yourself - /Services/careproviders/LeaveReview/DefaultView.aspx?id=1-4314965384,0,0,,
49 Bath Road,1-15525372399,SCL,49 Bath Road,,,Hounslow,,TW3 3BN,Tel: 07828486827,No ratings yet Rate it yourself - /Services/careproviders/LeaveReview/DefaultView.aspx?id=1-15525372399,0,0,,
Fawaz Homecare,1-10332077498,SCL,Holdsworth House,65-73 Staines Road,,Hounslow,London,TW3 3HW,Tel: 07429205250,No ratings yet Rate it yourself - /Services/careproviders/LeaveReview/DefaultView.aspx?id=1-10332077498,0,0,,
Pharma Homecare LTD,1-11064537248,SCL,Holdsworth House 65-73,Staines Road,,Hounslow,,TW3 3HW,Tel: 02088472462,No ratings yet Rate it yourself - /Services/careproviders/LeaveReview/DefaultView.aspx?id=1-11064537248,0,0,,
Dean Road Extra Care Scheme,1-13466332902,SCL,19 Dean Road,,,Hampton,,TW12 1BF,Tel: 02089419800,No ratings yet Rate it yourself - /Services/careproviders/LeaveReview/DefaultView.aspx?id=1-13466332902,0,0,,
Great West Lodge,1-3675415189,SCL,320 Great West Road,,,Hounslow,Middlesex,TW5 0BA,Tel: 02085819313,No ratings yet Rate it yourself - /Services/careproviders/LeaveReview/DefaultView.aspx?id=1-3675415189,0,0,,
Dimensions London North/West Domiciliary Care Office,1-18843044425,SCL,"2nd floor, Hounslow House",7 Bath Road,,Hounslow,,TW3 3EB,Tel: 03003039010,No ratings yet Rate it yourself - /Services/careproviders/LeaveReview/DefaultView.aspx?id=1-18843044425,0,0,,
United Response - The Swallows 183 -189 Hanworth Road,1-5089632910,SCL,183 -189 Hanworth Road,,,Hampton,,TW12 3ED,Tel: 02087831503,No ratings yet Rate it yourself - /Services/careproviders/LeaveReview/DefaultView.aspx?id=1-5089632910,0,0,,
Staffing Connect,1-2726389544,SCL,Suite 9,"Neals Corner, 2 Bath Road",,Hounslow,Middlesex,TW3 3HJ,Tel: 02038416440,No ratings yet Rate it yourself - /Services/careproviders/LeaveReview/DefaultView.aspx?id=1-2726389544,0,0,,
The Peaches Healthcare Limited,1-4897944586,SCL,339 Vicarage Farm Road,,,Hounslow,,TW5 0DZ,Tel: 02079987950,No ratings yet Rate it yourself - /Services/careproviders/LeaveReview/DefaultView.aspx?id=1-4897944586,0,0,,
TC Care - Premier House,1-140978488,SCL,Premier House,50-52 Cross Lances Road,,Hounslow,Middlesex,TW3 2AA,Tel: 02085700086,1 rating Rate it yourself - /Services/careproviders/LeaveReview/DefaultView.aspx?id=1-140978488,,,,
Hounslow and Ealing,1-13227722854,SCL,279-287 High Street,Second Floor Suite 5,,Hounslow,,TW3 1EF,Tel: 02081542715,No ratings yet Rate it yourself - /Services/careproviders/LeaveReview/DefaultView.aspx?id=1-13227722854,0,0,,
Allfor Care Alpha Care Recruitment West and Home Care Service Limited,1-115898258,SCL,15 Maswell Park Road,,,Hounslow,Middlesex,TW3 2DL,Tel: 02088982867,No ratings yet Rate it yourself - /Services/careproviders/LeaveReview/DefaultView.aspx?id=1-115898258,0,0,,
Elysium Care Partnerships Limited - School House,1-1568682810,SCL,School Walk,,,Sunbury On Thames,Middlesex,TW16 6RB,Tel: 01932780181,No ratings yet Rate it yourself - /Services/careproviders/LeaveReview/DefaultView.aspx?id=1-1568682810,0,0,,
Right at Home (Twickenham to Weybridge),1-13050880987,SCL,95 Green Street,,,Sunbury-on-thames,,TW16 6RD,Tel: 02033763535,No ratings yet Rate it yourself - /Services/careproviders/LeaveReview/DefaultView.aspx?id=1-13050880987,0,0,,
United Response - 29 Mayfair Avenue,1-5088905448,SCL,29 Mayfair Avenue,,,Twickenham,,TW2 7JG,Tel: 02088942053,No ratings yet Rate it yourself - /Services/careproviders/LeaveReview/DefaultView.aspx?id=1-5088905448,0,0,,
Humble Healthcare Limited,1-1765755534,SCL,"Unit 9, Red Lion Court",Alexandra Road,,Hounslow,Middlesex,TW3 1JS,Tel: 02085706279,1 rating Rate it yourself - /Services/careproviders/LeaveReview/DefaultView.aspx?id=1-1765755534,,,,
Excelcare Agency Ltd,1-12955907456,SCL,"2nd Floor, Unit 5","Red Lion Court, Alexandra Road",,Hounslow,,TW3 1JS,Tel: 07887883211,No ratings yet Rate it yourself - /Services/careproviders/LeaveReview/DefaultView.aspx?id=1-12955907456,0,0,,
Goldcrest Healthcare Service (London),1-3895383690,SCL,Unit 1,"Red Lion Court, Alexandra Road",,Hounslow,Middlesex,TW3 1JS,Tel: 02085714402,No ratings yet Rate it yourself - /Services/careproviders/LeaveReview/DefaultView.aspx?id=1-3895383690,0,0,,
Unit 5 Red Lion,1-4499553487,SCL,Unit 5,"Red Lion Court, Alexandra Road",,Hounslow,Middlesex,TW3 1JS,Tel: 0203 477 8090,No ratings yet Rate it yourself - /Services/careproviders/LeaveReview/DefaultView.aspx?id=1-4499553487,0,0,,
Whitefarm Lodge,1-139859302,SCL,Vicarage Road,Whitton,,Twickenham,Middlesex,TW2 7BY,Tel: 02087555740,No ratings yet Rate it yourself - /Services/careproviders/LeaveReview/DefaultView.aspx?id=1-139859302,0,0,,
5th Floor Hyde Park,1-7745608755,SCL,11 Millington Road,,,Hayes,Middlesex,UB3 4AZ,Tel: 02089823540,No ratings yet Rate it yourself - /Services/careproviders/LeaveReview/DefaultView.aspx?id=1-7745608755,0,0,,
LOYALTY HEALTHCARE LIMITED,1-18274205400,SCL,35 Glamis Crescent,,,Hayes,,UB3 1QA,Tel: 07930910934,No ratings yet Rate it yourself - /Services/careproviders/LeaveReview/DefaultView.aspx?id=1-18274205400,0,0,,
Elysium Care Partnerships Limited - 1 Lichfield Lane,1-279496420,SCL,1 Lichfield Lane,,,Twickenham,,TW2 6LA,Tel: 02088672715,No ratings yet Rate it yourself - /Services/careproviders/LeaveReview/DefaultView.aspx?id=1-279496420,0,0,,
K5K Limited t/a Tezlom,1-18067082393,SCL,Access Self Storage,1 Nestles Avenue,,Hayes,,UB3 4UZ,Tel: 08455481247,No ratings yet Rate it yourself - /Services/careproviders/LeaveReview/DefaultView.aspx?id=1-18067082393,0,0,,
Care Outlook (Twickenham)),1-5892304692,SCL,122 Nelson Road,,,Twickenham,,TW2 7AY,Tel: 02088142875,No ratings yet Rate it yourself - /Services/careproviders/LeaveReview/DefaultView.aspx?id=1-5892304692,0,0,,
Elysium Care Partnerships Limited - 78 Park Road,1-154473298,SCL,78 Park Road,,,Hampton,Middlesex,TW12 1HR,Tel: 02082555166,No ratings yet Rate it yourself - /Services/careproviders/LeaveReview/DefaultView.aspx?id=1-154473298,0,0,,