Organisation Name,NACS Code,Organisation Type,Address1,Address2,Address3,Address4,Address5,PostCode,Telephone Number,NHS.UK users rating,Value  (NHS.UK users rating),Banding Classification  (NHS.UK users rating),Car parking (Is there car parking at this organisation?),Disabled access (Disabled access)
ADSL Limited,1-17898649927,SCL,41 The Broadway,46-50 Station Road,,London,,W5 2NP,,No ratings yet Rate it yourself - /Services/careproviders/LeaveReview/DefaultView.aspx?id=1-17898649927,0,0,,
Ealing,1-17403786735,SCL,52- 53 Saunders House The Mall,,,London,,W5 3TA,Tel: 02070525362,No ratings yet Rate it yourself - /Services/careproviders/LeaveReview/DefaultView.aspx?id=1-17403786735,0,0,,
London Borough of Ealing Reablement Service,1-144189610,SCL,Perceval House,"14-16 Uxbridge Road, Ealing",,London,,W5 2HL,Tel: 02088258248,No ratings yet Rate it yourself - /Services/careproviders/LeaveReview/DefaultView.aspx?id=1-144189610,0,0,,
Beech Haven,1-10490050332,SCL,15-19,Gordon Road,,London,,W5 2AD,Tel: 02089910658,No ratings yet Rate it yourself - /Services/careproviders/LeaveReview/DefaultView.aspx?id=1-10490050332,0,0,,
Supreme Care Services Limited,1-122095346,SCL,34 The Mall,,,London,,W5 3TJ,Tel: 02088406366,No ratings yet Rate it yourself - /Services/careproviders/LeaveReview/DefaultView.aspx?id=1-122095346,0,0,,
Ascend Support (Ealing),1-18175820296,SCL,Aurora House 71-75,Uxbridge Road,,London,,W5 5SL,Tel: 03304706115,No ratings yet Rate it yourself - /Services/careproviders/LeaveReview/DefaultView.aspx?id=1-18175820296,0,0,,
OASIS West London Office,1-5108365775,SCL,"Aurora House, 71-75 Uxbridge Road",Ealing,,London,,W5 5SL,Tel: 02073588936,No ratings yet Rate it yourself - /Services/careproviders/LeaveReview/DefaultView.aspx?id=1-5108365775,0,0,,
Holistic Centred Care Ltd,1-13734332123,SCL,Aurora House,71-75 Uxbridge Road,,London,,W5 5SL,Tel: 02039895436,No ratings yet Rate it yourself - /Services/careproviders/LeaveReview/DefaultView.aspx?id=1-13734332123,0,0,,
Ealing Service,1-17841000025,SCL,71-75 Uxbridge Road,,,London,,W5 5SL,Tel: 07498591420,No ratings yet Rate it yourself - /Services/careproviders/LeaveReview/DefaultView.aspx?id=1-17841000025,0,0,,
Ealing Manor Nursing Home,1-108761961,SCL,5-6 Grange Park,Ealing,,London,,W5 3PL,,No ratings yet Rate it yourself - /Services/careproviders/LeaveReview/DefaultView.aspx?id=1-108761961,0,0,,
Kenilworth Nursing Home,1-117497308,SCL,26-28 Kenilworth Road,Ealing,,London,,W5 3UH,Tel: 02085671414,No ratings yet Rate it yourself - /Services/careproviders/LeaveReview/DefaultView.aspx?id=1-117497308,0,0,,
Delicate Hands Care Limited,1-17192885486,SCL,"Ealing Cross, 85 Uxbridge Road",,,London,,W5 5BW,,No ratings yet Rate it yourself - /Services/careproviders/LeaveReview/DefaultView.aspx?id=1-17192885486,0,0,,
Threen House Nursing Home,1-107276328,SCL,29 Mattock Lane,Ealing,,London,,W5 5BH,Tel: 02088402646,No ratings yet Rate it yourself - /Services/careproviders/LeaveReview/DefaultView.aspx?id=1-107276328,0,0,,
Thames Homecare Service Ltd,1-2163416159,SCL,"3rd Floor, C P House",97-107Uxbridge Road,,London,,W5 5TL,Tel: 02088407471,2 ratings Rate it yourself - /Services/careproviders/LeaveReview/DefaultView.aspx?id=1-2163416159,,,,
Support for Living Domiciliary Care Agency,1-299438034,SCL,8th Floor CP House,97-107 Uxbridge Road,,London,,W5 5TL,Tel: 02087726222,No ratings yet Rate it yourself - /Services/careproviders/LeaveReview/DefaultView.aspx?id=1-299438034,0,0,,
Blakesley House Nursing Home,1-120657640,SCL,7 Blakesley Avenue,Ealing,,London,,W5 2DN,Tel: 02089912364,No ratings yet Rate it yourself - /Services/careproviders/LeaveReview/DefaultView.aspx?id=1-120657640,0,0,,
Mira Social Care,1-15054557159,SCL,45 St. Marys Road,,,London,,W5 5RG,Tel: 02081276840,No ratings yet Rate it yourself - /Services/careproviders/LeaveReview/DefaultView.aspx?id=1-15054557159,0,0,,
Downhurst Residential Home Limited,1-106240471,SCL,76 Castlebar Road,,,London,,W5 2DD,Tel: 02089978421,No ratings yet Rate it yourself - /Services/careproviders/LeaveReview/DefaultView.aspx?id=1-106240471,0,0,,
Addison Care Ltd,1-11810320990,SCL,Suit 3A,"84 Uxbridge Road, Ealing",,London,,W13 8RA,Tel: 02037724200,No ratings yet Rate it yourself - /Services/careproviders/LeaveReview/DefaultView.aspx?id=1-11810320990,0,0,,
Lalis Direct Care Ltd,1-745146002,SCL,84 Uxbridge Road,,,London,,W13 8RA,Tel: 02081547610,No ratings yet Rate it yourself - /Services/careproviders/LeaveReview/DefaultView.aspx?id=1-745146002,0,0,,
Kolbe House,1-108323728,SCL,18 Hanger Lane,Ealing,,London,,W5 3HH,Tel: 02089924978,No ratings yet Rate it yourself - /Services/careproviders/LeaveReview/DefaultView.aspx?id=1-108323728,0,0,,
Georgian House Nursing Home,1-111551658,SCL,20 Lyncroft Gardens,Ealing,,London,,W13 9PU,,No ratings yet Rate it yourself - /Services/careproviders/LeaveReview/DefaultView.aspx?id=1-111551658,0,0,,
GARY CARE LIMITED,1-12332187815,SCL,"Room 10, 8 Fielding Terrace",Uxbridge Road,,London,,W5 3HQ,,No ratings yet Rate it yourself - /Services/careproviders/LeaveReview/DefaultView.aspx?id=1-12332187815,0,0,,
First Necessity Care Ltd,1-18851747005,SCL,Ealing House,33 Hanger Lane,,London,,W5 3HJ,Tel: 07429225722,No ratings yet Rate it yourself - /Services/careproviders/LeaveReview/DefaultView.aspx?id=1-18851747005,0,0,,
Visitation of Our Lady Residential Care Home,1-104456550,SCL,57 Mount Park Road,Ealing,,London,,W5 2RU,Tel: 02089972030,No ratings yet Rate it yourself - /Services/careproviders/LeaveReview/DefaultView.aspx?id=1-104456550,0,0,,
Amadeus House,1-13826947811,SCL,18 Corfton Road,,,London,,W5 2HT,Tel: 02076973300,No ratings yet Rate it yourself - /Services/careproviders/LeaveReview/DefaultView.aspx?id=1-13826947811,0,0,,
St David's Home,1-17191811808,SCL,12 Castlebar Hill,,,London,,W5 1TE,Tel: 02089975121,No ratings yet Rate it yourself - /Services/careproviders/LeaveReview/DefaultView.aspx?id=1-17191811808,0,0,,
Sagecare Fulham,1-4354134215,SCL,"Floor 2, Lancaster House",Leeland Road,,London,,W13 9HH,,No ratings yet Rate it yourself - /Services/careproviders/LeaveReview/DefaultView.aspx?id=1-4354134215,0,0,,
Chestnut Lodge,1-8366560716,SCL,3 Woodfield Road,Ealing,,London,,W5 1SL,Tel: 02039885040,No ratings yet Rate it yourself - /Services/careproviders/LeaveReview/DefaultView.aspx?id=1-8366560716,0,0,,
Robin Home Care,1-1757947032,SCL,Suite 17 Access House,Access House,,West Ealing,Greater London,W13 0AS,Tel: 0203 0112256,7 ratings Rate it yourself - /Services/careproviders/LeaveReview/DefaultView.aspx?id=1-1757947032,,,,
Joshi Home Care Limited t/a Bluebird Care (Ealing),1-134092529,SCL,155-157 Pitshanger Lane,Ealing,,London,,W5 1RG,Tel: 02088104666,1 rating Rate it yourself - /Services/careproviders/LeaveReview/DefaultView.aspx?id=1-134092529,,,,
Kingsley House Residential Care Home,1-120657976,SCL,115 Kingsley Avenue,Ealing,,London,,W13 0EH,Tel: 02089989708,No ratings yet Rate it yourself - /Services/careproviders/LeaveReview/DefaultView.aspx?id=1-120657976,0,0,,
Support for Living Limited - 43 Shirley Gardens,1-126430173,SCL,43 Shirley Gardens,Ealing,,London,,W7 3PT,Tel: 02088100431,No ratings yet Rate it yourself - /Services/careproviders/LeaveReview/DefaultView.aspx?id=1-126430173,0,0,,
Acton Care Centre,1-2828153855,SCL,48 Gunnersbury Lane,Acton,,London,,W3 8EF,Tel: 02088965600,1 rating Rate it yourself - /Services/careproviders/LeaveReview/DefaultView.aspx?id=1-2828153855,,,,
Abbeyfield London Polish Society,1-754663622,SCL,46 Rosemont Road,,,London,,W3 9LY,Tel: 02089932462,No ratings yet Rate it yourself - /Services/careproviders/LeaveReview/DefaultView.aspx?id=1-754663622,0,0,,
Support for Living Limited - 62 Rosemont Road,1-126430271,SCL,62 Rosemont Road,Acton,,London,,W3 9LY,Tel: 02087521165,No ratings yet Rate it yourself - /Services/careproviders/LeaveReview/DefaultView.aspx?id=1-126430271,0,0,,
Torkington House,1-121567326,SCL,Creswick Road,Acton,,London,,W3 9HF,Tel: 02089925187,No ratings yet Rate it yourself - /Services/careproviders/LeaveReview/DefaultView.aspx?id=1-121567326,0,0,,
23 Pierrepoint Road,1-9655004060,SCL,23 Pierrepoint Road,,,London,,W3 9JJ,Tel: 02088962581,No ratings yet Rate it yourself - /Services/careproviders/LeaveReview/DefaultView.aspx?id=1-9655004060,0,0,,
Hanwell House,1-119658982,SCL,191 Boston Road,Hanwell,,London,,W7 2HW,Tel: 02085794798,No ratings yet Rate it yourself - /Services/careproviders/LeaveReview/DefaultView.aspx?id=1-119658982,0,0,,
Sycamore Lodge,1-8367088900,SCL,1 Edgecote Close,Acton,,London,,W3 8PH,Tel: 02039885060,No ratings yet Rate it yourself - /Services/careproviders/LeaveReview/DefaultView.aspx?id=1-8367088900,0,0,,
Safety First Care Ltd,1-11356302778,SCL,Boundary House,Boston Road,,London,,W7 2QE,,No ratings yet Rate it yourself - /Services/careproviders/LeaveReview/DefaultView.aspx?id=1-11356302778,0,0,,
Together at Home Ltd T/A Visiting Angels,1-8573664383,SCL,Suite 205 Boundary House,Boston Road,,London,,W7 2QE,Tel: 02031438878,No ratings yet Rate it yourself - /Services/careproviders/LeaveReview/DefaultView.aspx?id=1-8573664383,0,0,,
"Right at Home (Ealing, Hounslow, Hammersmith and Fulham)",1-4134627298,SCL,"Suite 309, 3rd Floor, Qwest",1110 Great West Road,,Brentford,,TW8 0GP,Tel: 02084329788,No ratings yet Rate it yourself - /Services/careproviders/LeaveReview/DefaultView.aspx?id=1-4134627298,0,0,,
Healthvision - Hounslow,1-5369227910,SCL,Q West,Great West Road,,Brentford,,TW8 0GP,,No ratings yet Rate it yourself - /Services/careproviders/LeaveReview/DefaultView.aspx?id=1-5369227910,0,0,,
ANGELIQUE RECRUITMENT LTD,1-16463913258,SCL,"105a, Greenford Avenue",,,London,,W7 1HA,Tel: 02081065299,No ratings yet Rate it yourself - /Services/careproviders/LeaveReview/DefaultView.aspx?id=1-16463913258,0,0,,
Hanwell Community Centre,1-839911517,SCL,Hanwell Community Centre,Westcott Crescent,,London,,W7 1PD,Tel: 02085756661,No ratings yet Rate it yourself - /Services/careproviders/LeaveReview/DefaultView.aspx?id=1-839911517,0,0,,
Lynton Terrace,1-116949734,SCL,1-3 Lynton Terrace,Acton,,London,,W3 9DU,Tel: 02089923343,No ratings yet Rate it yourself - /Services/careproviders/LeaveReview/DefaultView.aspx?id=1-116949734,0,0,,
Care Compassion Limited,1-2209741858,SCL,"Suite 67, 6th Floor, First Central 200","2 Lakeside Drive, Park Royal",,London,,NW10 7FQ,Tel: 02039499525,4 ratings Rate it yourself - /Services/careproviders/LeaveReview/DefaultView.aspx?id=1-2209741858,,,,
ICare Edge,1-18944310584,SCL,"ICare Edge  6th floor, First Central 200","2 Lakeside Drive, Park Royal",,London,,NW10 7FQ,,No ratings yet Rate it yourself - /Services/careproviders/LeaveReview/DefaultView.aspx?id=1-18944310584,0,0,,
Change Social Care Solutions,1-5175762117,SCL,"2 Lakeside Drive, Park Royal",,,London,,NW10 7FQ,Tel: 02039535023,No ratings yet Rate it yourself - /Services/careproviders/LeaveReview/DefaultView.aspx?id=1-5175762117,0,0,,
Ealing Office,1-126319109,SCL,Eleanor Nursing and Social Care Limited,"157 Uxbridge Road, Hanwell",,London,,W7 3SR,,No ratings yet Rate it yourself - /Services/careproviders/LeaveReview/DefaultView.aspx?id=1-126319109,0,0,,
Lifestyle Care Services Limited t/a Home Instead Senior Care,1-125117908,SCL,130,Uxbridge Road,,London,,W7 3SL,Tel: 02085742008,No ratings yet Rate it yourself - /Services/careproviders/LeaveReview/DefaultView.aspx?id=1-125117908,0,0,,
Chaston House Care Home,1-692233405,SCL,11 Acacia Road,Acton,,London,,W3 6HD,Tel: 02089923208,1 rating Rate it yourself - /Services/careproviders/LeaveReview/DefaultView.aspx?id=1-692233405,,,,
Salus Care LTD,1-2056157810,SCL,"Old Acton Library, 1st Floor",High Street,,London,,W3 6NA,Tel: 02089930807,1 rating Rate it yourself - /Services/careproviders/LeaveReview/DefaultView.aspx?id=1-2056157810,,,,
Housing 21 - Greenrod Place,1-125498386,SCL,Clayponds Lane,,,Brentford,Middlesex,TW8 0BN,Tel: 03701924983,No ratings yet Rate it yourself - /Services/careproviders/LeaveReview/DefaultView.aspx?id=1-125498386,0,0,,
Capital Homecare (UK) Limited,1-10063367233,SCL,"Suite 141, Viglen House Business Centre",120 Alperton Lane,,Wembley,,HA0 1HD,Tel: 02087955959,No ratings yet Rate it yourself - /Services/careproviders/LeaveReview/DefaultView.aspx?id=1-10063367233,0,0,,
Shared Lives Scheme,1-144189625,SCL,Ealing Shared Lives,Acton Town Hall,,Ealing,Middlesex,W3 6NE,Tel: 02088255436,No ratings yet Rate it yourself - /Services/careproviders/LeaveReview/DefaultView.aspx?id=1-144189625,0,0,,
The AICS Group,1-1745295741,SCL,15 Broads Foundry,Trumpers Way,,London,,W7 2QP,Tel: 02088327496,No ratings yet Rate it yourself - /Services/careproviders/LeaveReview/DefaultView.aspx?id=1-1745295741,0,0,,
365 Care Solutions Ltd,1-11210283645,SCL,"Unit 156, Light Box, 111 Power Road",,,London,,W4 5PY,Tel: 02083168994,No ratings yet Rate it yourself - /Services/careproviders/LeaveReview/DefaultView.aspx?id=1-11210283645,0,0,,
Sanctuary Supported Living - Ealing Care Services,1-2369911445,SCL,26 Cumberland Park,,,Acton,London,W3 6SX,Tel: 02089931346,No ratings yet Rate it yourself - /Services/careproviders/LeaveReview/DefaultView.aspx?id=1-2369911445,0,0,,
1st Healthcare Ltd,1-2871345800,SCL,1000 Great West Road,,,Brentford,,TW8 9DW,Tel: 02086595576,No ratings yet Rate it yourself - /Services/careproviders/LeaveReview/DefaultView.aspx?id=1-2871345800,0,0,,
Ashbright Agency Ltd,1-9785169569,SCL,1000 Great West Road,,,Brentford,,TW8 9DW,Tel: 07828063547,No ratings yet Rate it yourself - /Services/careproviders/LeaveReview/DefaultView.aspx?id=1-9785169569,0,0,,
EBM Professional Services Limited,1-18610933325,SCL,1000 Great West Road,,,Brentford,,TW8 9DW,Tel: 02084399086,No ratings yet Rate it yourself - /Services/careproviders/LeaveReview/DefaultView.aspx?id=1-18610933325,0,0,,
Short Break Service,1-144178594,SCL,62 Green Lane,,,Ealing,Middlesex,W7 2PB,Tel: 02085799558,No ratings yet Rate it yourself - /Services/careproviders/LeaveReview/DefaultView.aspx?id=1-144178594,0,0,,
Haven Care - Hounslow Branch,1-2440252064,SCL,G W 1 Great West House,Great West Road,,Brentford,Middlesex,TW8 9DF,Tel: 02087589841,No ratings yet Rate it yourself - /Services/careproviders/LeaveReview/DefaultView.aspx?id=1-2440252064,0,0,,
Night and Day Care,1-450025813,SCL,Ground Floor,24 Chuchfield Road,,London,,W3 6EG,Tel: 02036019299,No ratings yet Rate it yourself - /Services/careproviders/LeaveReview/DefaultView.aspx?id=1-450025813,0,0,,
Trusted Homecare (NW) Limited,1-13766871988,SCL,"Bizspace Business Centre, Unit 101","4-6 Wadsworth Road, Perivale",,Greenford,,UB6 7JJ,Tel: 07983886002,No ratings yet Rate it yourself - /Services/careproviders/LeaveReview/DefaultView.aspx?id=1-13766871988,0,0,,
Harrison Associates,1-13395396905,SCL,14-16,"Wadsworth Road, Perivale",,Greenford,,UB6 7JD,Tel: 02089982992,No ratings yet Rate it yourself - /Services/careproviders/LeaveReview/DefaultView.aspx?id=1-13395396905,0,0,,
Sabichi House,1-17715215236,SCL,Sabichi House,"5 Wadsworth Road, Perivale",,Greenford,,UB6 7JD,Tel: 07482370005,No ratings yet Rate it yourself - /Services/careproviders/LeaveReview/DefaultView.aspx?id=1-17715215236,0,0,,
Care Spectrum,1-9218637491,SCL,Sabichi House,"5 Wadsworth Road, Perivale",,Greenford,,UB6 7JD,Tel: 07889203638,No ratings yet Rate it yourself - /Services/careproviders/LeaveReview/DefaultView.aspx?id=1-9218637491,0,0,,
Care At Home Services Limited,1-6547737388,SCL,Sabichi House,"5 Wadsworth Road, Perivale",,Greenford,,UB6 7JD,Tel: 02087997416,No ratings yet Rate it yourself - /Services/careproviders/LeaveReview/DefaultView.aspx?id=1-6547737388,0,0,,
The London Homecare Services Ltd,1-7505806811,SCL,Sabichi House,"5 Wadsworth Road, Perivale",,Greenford,,UB6 7JD,Tel: 07834280383,No ratings yet Rate it yourself - /Services/careproviders/LeaveReview/DefaultView.aspx?id=1-7505806811,0,0,,
Frontline Homecare Services Ltd,1-6576285436,SCL,Sabichi House,"5 Wadsworth Road, Perivale",,Greenford,,UB6 7JD,Tel: 07984899327,No ratings yet Rate it yourself - /Services/careproviders/LeaveReview/DefaultView.aspx?id=1-6576285436,0,0,,
MNA Home Care Services LTD,1-3015552445,SCL,"Sabichi House, 5 Wadsworth Road",Perivale,,Greenford,Middlesex,UB6 7JD,Tel: 02085373256,No ratings yet Rate it yourself - /Services/careproviders/LeaveReview/DefaultView.aspx?id=1-3015552445,0,0,,
Prestige Homecare Services,1-4094619273,SCL,"Sabichi House, 5 Wadsworth Road",Perivale,,Greenford,Middlesex,UB6 7JD,Tel: 02087997507,No ratings yet Rate it yourself - /Services/careproviders/LeaveReview/DefaultView.aspx?id=1-4094619273,0,0,,
SD Care Agency London,1-13081704498,SCL,Chiswick Gate 598-608,Chiswick High Road,,London,,W4 5RT,Tel: 02081466195,No ratings yet Rate it yourself - /Services/careproviders/LeaveReview/DefaultView.aspx?id=1-13081704498,0,0,,
Conquest Care and Support Agency LTD,1-2004979302,SCL,Rays House,North Circular Road,,London,,NW10 7XP,Tel: 02087952055,No ratings yet Rate it yourself - /Services/careproviders/LeaveReview/DefaultView.aspx?id=1-2004979302,0,0,,
DCL-PRO Services Ltd,1-6693412158,SCL,"Unit 9&10, A M C House",12 Cumberland Avenue,,London,,NW10 7QL,Tel: 02033719582,No ratings yet Rate it yourself - /Services/careproviders/LeaveReview/DefaultView.aspx?id=1-6693412158,0,0,,
AOK Care Ltd,1-5897548018,SCL,"Suite 5,  AMC Business Centre",12 Cumberland Avenue,,London,,NW10 7QL,Tel: 07487522552,No ratings yet Rate it yourself - /Services/careproviders/LeaveReview/DefaultView.aspx?id=1-5897548018,0,0,,
23 Perryn Road,1-9655004021,SCL,23 Perryn Road,Acton,,London,,W3 7LS,Tel: 02087498273,No ratings yet Rate it yourself - /Services/careproviders/LeaveReview/DefaultView.aspx?id=1-9655004021,0,0,,
FabCare at Home,1-18574474586,SCL,Suite 13,"Space Business Park, Abbey Road",,London,,NW10 7SU,Tel: 02039886796,No ratings yet Rate it yourself - /Services/careproviders/LeaveReview/DefaultView.aspx?id=1-18574474586,0,0,,
Restore180 Healthcare Staffing Ltd,1-17715815552,SCL,17 Wyresdale Crescent,Perivale,,Greenford,,UB6 8TQ,Tel: 07412211165,No ratings yet Rate it yourself - /Services/careproviders/LeaveReview/DefaultView.aspx?id=1-17715815552,0,0,,
Support for Living Limited - 26 Stockdove Way,1-126430243,SCL,26 Stockdove Way,,,Perivale,Middlesex,UB6 8TJ,Tel: 02088106622,No ratings yet Rate it yourself - /Services/careproviders/LeaveReview/DefaultView.aspx?id=1-126430243,0,0,,
Maryville Care Home,1-160392045,SCL,12-14 The Butts,,,Brentford,Middlesex,TW8 8BQ,Tel: 02085607124,No ratings yet Rate it yourself - /Services/careproviders/LeaveReview/DefaultView.aspx?id=1-160392045,0,0,,
St Raphael's,1-141696376,SCL,6-8 The Butts,,,Brentford,Middlesex,TW8 8BQ,Tel: 02085603745,1 rating Rate it yourself - /Services/careproviders/LeaveReview/DefaultView.aspx?id=1-141696376,,,,
H & M Care Agency Ltd,1-4703818940,SCL,Unit G5,47-49 Park Royal Road,,London,,NW10 7LQ,Tel: 02080900548,No ratings yet Rate it yourself - /Services/careproviders/LeaveReview/DefaultView.aspx?id=1-4703818940,0,0,,
Areys Care,1-15969558982,SCL,"Unit 3.3, Bank Studios",21 Park Royal Road,,London,,NW10 7LQ,Tel: 02071013985,No ratings yet Rate it yourself - /Services/careproviders/LeaveReview/DefaultView.aspx?id=1-15969558982,0,0,,
Moonlight Homecare Ltd,1-12905067941,SCL,Premier Business Centre,47-49 Park Royal Road,,London,,NW10 7LQ,Tel: 07427620795,2 ratings Rate it yourself - /Services/careproviders/LeaveReview/DefaultView.aspx?id=1-12905067941,,,,
Vivid Community Care Ltd,1-12730975744,SCL,37 Half Acre,,,Brentford,,TW8 8BH,Tel: 02081245000,No ratings yet Rate it yourself - /Services/careproviders/LeaveReview/DefaultView.aspx?id=1-12730975744,0,0,,
Gateway Care Group Ltd,1-12811789439,SCL,Continental House,497 Sunleigh Road,,Wembley,Middlesex,HA0 4LY,,No ratings yet Rate it yourself - /Services/careproviders/LeaveReview/DefaultView.aspx?id=1-12811789439,0,0,,
Impulse Support Limited,1-14346615296,SCL,Continental House,497 Sunleigh Road,,Wembley,Middlesex,HA0 4LY,Tel: 07904036355,No ratings yet Rate it yourself - /Services/careproviders/LeaveReview/DefaultView.aspx?id=1-14346615296,0,0,,
Nisacraftcare,1-6386783869,SCL,27 - 28 Continental House,497 Sunleigh Road,,Wembley,,HA0 4LY,Tel: 02087338227,No ratings yet Rate it yourself - /Services/careproviders/LeaveReview/DefaultView.aspx?id=1-6386783869,0,0,,
Caremark Brent,1-14718238428,SCL,"Caremark Brent, 41b Unimix House","Abbey Road, Park Royal",,London,,NW10 7TR,Tel: 02039875527,No ratings yet Rate it yourself - /Services/careproviders/LeaveReview/DefaultView.aspx?id=1-14718238428,0,0,,
International Healthcare,1-6854113122,SCL,24A Unimix House,Abbey Road,,London,,NW10 7TR,Tel: 02087315219,No ratings yet Rate it yourself - /Services/careproviders/LeaveReview/DefaultView.aspx?id=1-6854113122,0,0,,
Resilience Healthcare LTD,1-12062993395,SCL,"Suite M26a, 1st Floor, Unimix House",Abbey Road,,London,,NW10 7TR,Tel: 02034880643,No ratings yet Rate it yourself - /Services/careproviders/LeaveReview/DefaultView.aspx?id=1-12062993395,0,0,,
Support for Living Limited - 19 Haymill Close Shortbreak Service,1-126430351,SCL,19 Haymill Close,,,Greenford,Middlesex,UB6 8HL,Tel: 02089987220,1 rating Rate it yourself - /Services/careproviders/LeaveReview/DefaultView.aspx?id=1-126430351,,,,
Support for Living Limited - 25/27 Haymill Close,1-126430313,SCL,25-27 Haymill Close,,,Greenford,Middlesex,UB6 8HL,Tel: 02089978785,No ratings yet Rate it yourself - /Services/careproviders/LeaveReview/DefaultView.aspx?id=1-126430313,0,0,,
We Care Agency Ltd,1-3953622395,SCL,"Crown House, Suite 201c",North Circular Road,,London,,NW10 7PN,Tel: 02031293139,1 rating Rate it yourself - /Services/careproviders/LeaveReview/DefaultView.aspx?id=1-3953622395,,,,
Graceful Care,1-1368045908,SCL,"Crown House, Suite 209",North Circular Road,,London,,NW10 7PN,Tel: 02089618599,No ratings yet Rate it yourself - /Services/careproviders/LeaveReview/DefaultView.aspx?id=1-1368045908,0,0,,
Allura Care Ltd,1-6919840141,SCL,Crown House,North Circular Road,,London,,NW10 7PN,Tel: 02036204327,No ratings yet Rate it yourself - /Services/careproviders/LeaveReview/DefaultView.aspx?id=1-6919840141,0,0,,
Paramount Options Ltd,1-435400889,SCL,Suite 615 Crown House,"North Circular Road, Park Royal",,London,,NW10 7PN,,No ratings yet Rate it yourself - /Services/careproviders/LeaveReview/DefaultView.aspx?id=1-435400889,0,0,,
Exodus Homecare Agency Limited,1-489127798,SCL,Crown House Business Centre,North Circular,,London,,NW10 7PN,Tel: 020 8838 5494,No ratings yet Rate it yourself - /Services/careproviders/LeaveReview/DefaultView.aspx?id=1-489127798,0,0,,
Nearbycare Ltd,1-14389119360,SCL,716 Crown House,North Circular Road,,London,,NW10 7PN,Tel: 02033725418,No ratings yet Rate it yourself - /Services/careproviders/LeaveReview/DefaultView.aspx?id=1-14389119360,0,0,,
Immediate Quality Care (IQC) LTD,1-7244949698,SCL,Suite 516 Crown House,North Circular Road,,London,,NW10 7PN,,No ratings yet Rate it yourself - /Services/careproviders/LeaveReview/DefaultView.aspx?id=1-7244949698,0,0,,
Prime Healthcare Avenue Ltd,1-10616494808,SCL,Suite 715 Crown House,North Circular Road,,London,,NW10 7PN,Tel: 02031916219,No ratings yet Rate it yourself - /Services/careproviders/LeaveReview/DefaultView.aspx?id=1-10616494808,0,0,,
Narrow Path JC Healthcare - Main Office,1-12606017797,SCL,Crown House,"North Circular Road, Park Royal",,London,,NW10 7PN,Tel: 02089631578,No ratings yet Rate it yourself - /Services/careproviders/LeaveReview/DefaultView.aspx?id=1-12606017797,0,0,,
LA Care Ltd,1-12655602343,SCL,"Suite 701, Crown House","North Circular Road, Park Royal",,London,,NW10 7PN,Tel: 02089654101,No ratings yet Rate it yourself - /Services/careproviders/LeaveReview/DefaultView.aspx?id=1-12655602343,0,0,,
The Roof Support Services UK Ltd,1-2237666627,SCL,509 Crown House,North Circular Road,,London,,NW10 7PN,Tel: 02034410422,No ratings yet Rate it yourself - /Services/careproviders/LeaveReview/DefaultView.aspx?id=1-2237666627,0,0,,