Organisation Name,NACS Code,Organisation Type,Address1,Address2,Address3,Address4,Address5,PostCode,Telephone Number,NHS.UK users rating,Value  (NHS.UK users rating),Banding Classification  (NHS.UK users rating),Car parking (Is there car parking at this organisation?),Disabled access (Disabled access)
Asota Services Limited,1-17429747727,SCL,76 Dyke Drive,,,Orpington,,BR5 4LZ,Tel: 07931684113,No ratings yet Rate it yourself - /Services/careproviders/LeaveReview/DefaultView.aspx?id=1-17429747727,0,0,,
Creative Support - Apsley Court,1-4126233283,SCL,100 Wellington Road,,,Orpington,Kent,BR5 4AQ,,No ratings yet Rate it yourself - /Services/careproviders/LeaveReview/DefaultView.aspx?id=1-4126233283,0,0,,
Caremark (Bromley),1-253641853,SCL,International House,Cray Avenue,,Orpington,Kent,BR5 3RS,Tel: 01689825305,3 ratings Rate it yourself - /Services/careproviders/LeaveReview/DefaultView.aspx?id=1-253641853,,,,
Anjel Direct (Recruitment) Solutions Ltd,1-10728971317,SCL,T M S House,Cray Avenue,,Orpington,,BR5 3QB,Tel: 02088521622,No ratings yet Rate it yourself - /Services/careproviders/LeaveReview/DefaultView.aspx?id=1-10728971317,0,0,,
Alina Homecare Bromley,1-6317810733,SCL,"Office 1, First Floor, Access House",Cray Avenue,,Orpington,,BR5 3QB,Tel: 01689283222,No ratings yet Rate it yourself - /Services/careproviders/LeaveReview/DefaultView.aspx?id=1-6317810733,0,0,,
"Radfield Home Care Bromley, Orpington & Beckenham",1-14144735535,SCL,"Unit 15, TMS House",Cray Avenue,,Orpington,,BR5 3QB,Tel: 020 8064 2324,No ratings yet Rate it yourself - /Services/careproviders/LeaveReview/DefaultView.aspx?id=1-14144735535,0,0,,
Always Inclusive Outreach,1-12642181724,SCL,T M S House,Cray Avenue,,Orpington,,BR5 3QB,Tel: 01689885040,No ratings yet Rate it yourself - /Services/careproviders/LeaveReview/DefaultView.aspx?id=1-12642181724,0,0,,
Angels Place Health & Social Care,1-3906886217,SCL,Mentmore House,Cray Avenue,,Orpington,Kent,BR5 3QF,Tel: 02039500466,No ratings yet Rate it yourself - /Services/careproviders/LeaveReview/DefaultView.aspx?id=1-3906886217,0,0,,
Aviela Care Ltd,1-17583561497,SCL,Mentmore House,Cray Avenue,,Orpington,Kent,BR5 3QF,,No ratings yet Rate it yourself - /Services/careproviders/LeaveReview/DefaultView.aspx?id=1-17583561497,0,0,,
Compassion Home Care Limited,1-883936252,SCL,"1st Floor, East Wing, Priory Buildings","The Priory, Church Hill",,Orpington,,BR6 0HH,Tel: 01689825155,No ratings yet Rate it yourself - /Services/careproviders/LeaveReview/DefaultView.aspx?id=1-883936252,0,0,,
Highlands Care Ltd,1-10153383469,SCL,23 Footbury Hill Road,,,Orpington,Kent,BR6 0HP,Tel: 07931325755,No ratings yet Rate it yourself - /Services/careproviders/LeaveReview/DefaultView.aspx?id=1-10153383469,0,0,,
Enamoured Care Ltd,1-18977050914,SCL,109 Star Lane,,,Orpington,,BR5 3LN,,No ratings yet Rate it yourself - /Services/careproviders/LeaveReview/DefaultView.aspx?id=1-18977050914,0,0,,
Cecile Healthcare UK,1-13196984603,SCL,1 Meadow View,,,Orpington,,BR5 3EJ,Tel: 07533476912,No ratings yet Rate it yourself - /Services/careproviders/LeaveReview/DefaultView.aspx?id=1-13196984603,0,0,,
Day to Day Care Limited,1-2890688735,SCL,First Floor Offices,350 High Street,,Orpington,Kent,BR6 0NQ,Tel: 01689897774,2 ratings Rate it yourself - /Services/careproviders/LeaveReview/DefaultView.aspx?id=1-2890688735,,,,
Optimum Home Care Services Ltd,1-9550166889,SCL,"Suite 12, Kennedy House",Murray Road,,Orpington,,BR5 3QY,Tel: 07737509890,No ratings yet Rate it yourself - /Services/careproviders/LeaveReview/DefaultView.aspx?id=1-9550166889,0,0,,
MF Care and Housing,1-13056911845,SCL,Suite 12A Kennedy House,Murray Road,,Orpington,,BR5 3QY,Tel: 07828189646,No ratings yet Rate it yourself - /Services/careproviders/LeaveReview/DefaultView.aspx?id=1-13056911845,0,0,,
73 Repton Road,1-3040078634,SCL,73 Repton Road,,,Orpington,Kent,BR6 9HT,Tel: 01689836661,No ratings yet Rate it yourself - /Services/careproviders/LeaveReview/DefaultView.aspx?id=1-3040078634,0,0,,
Cabrini House 2 (Diagrama Healthcare),1-2315394292,SCL,2 Healy Drive,,,Orpington,Kent,BR6 9LB,Tel: 01689891401,No ratings yet Rate it yourself - /Services/careproviders/LeaveReview/DefaultView.aspx?id=1-2315394292,0,0,,
Cabrini House 1 (Diagrama Healthcare),1-1875164088,SCL,1 Healy Drive,,,Orpington,Kent,BR6 9LB,Tel: 01689891401,No ratings yet Rate it yourself - /Services/careproviders/LeaveReview/DefaultView.aspx?id=1-1875164088,0,0,,
Cabrini House 3 (Diagrama Healthcare),1-1875185341,SCL,3 Healy Drive,,,Orpington,Kent,BR6 9LB,Tel: 01689891401,No ratings yet Rate it yourself - /Services/careproviders/LeaveReview/DefaultView.aspx?id=1-1875185341,0,0,,
Diagrama Supported Living,1-10631728583,SCL,3A Healy Drive,,,Orpington,Kent,BR6 9LB,Tel: 01689891401,No ratings yet Rate it yourself - /Services/careproviders/LeaveReview/DefaultView.aspx?id=1-10631728583,0,0,,
Baycroft Grays Farm Road,1-17708769692,SCL,Grays Farm Road,,,Orpington,,BR5 3AD,Tel: 01733571951,No ratings yet Rate it yourself - /Services/careproviders/LeaveReview/DefaultView.aspx?id=1-17708769692,0,0,,
Sunnyside Domicilliary Support Services Limited,1-210091055,SCL,7 Dunstonian Court,28a Station Square,,Orpington,,BR5 1NA,Tel: 01689638236,No ratings yet Rate it yourself - /Services/careproviders/LeaveReview/DefaultView.aspx?id=1-210091055,0,0,,
Smithfield Health & Social Care Limited t/a Verilife,1-303534961,SCL,363 Southborough Lane,,,Bromley,Kent,BR2 8BQ,Tel: 02031419290,No ratings yet Rate it yourself - /Services/careproviders/LeaveReview/DefaultView.aspx?id=1-303534961,0,0,,
Avenues London (South),1-132159145,SCL,1 River House,Maidstone Road,,Sidcup,Kent,DA14 5TA,,No ratings yet Rate it yourself - /Services/careproviders/LeaveReview/DefaultView.aspx?id=1-132159145,0,0,,
First Option Support Ltd,1-18378799289,SCL,4 Calvert Close,,,Sidcup,,DA14 5JL,,No ratings yet Rate it yourself - /Services/careproviders/LeaveReview/DefaultView.aspx?id=1-18378799289,0,0,,
Antokol,1-110197479,SCL,45 Holbrook Lane,,,Chislehurst,Kent,BR7 6PE,Tel: 02084678102,2 ratings Rate it yourself - /Services/careproviders/LeaveReview/DefaultView.aspx?id=1-110197479,,,,
Yourlife (Chislehurst),1-6468086698,SCL,Shepheards House,Manor Park Road,,Chislehurst,Kent,BR7 5FT,Tel: 02082951251,No ratings yet Rate it yourself - /Services/careproviders/LeaveReview/DefaultView.aspx?id=1-6468086698,0,0,,
Parisse Care Consulting Limited,1-11718784147,SCL,54 Court Crescent,,,Swanley,,BR8 8NR,Tel: 07877579670,No ratings yet Rate it yourself - /Services/careproviders/LeaveReview/DefaultView.aspx?id=1-11718784147,0,0,,
Chislehurst Homecare Partnership,1-145353745,SCL,The Mews 3 Church Road,Farnborough Village,,Orpington,,BR6 7DB,Tel: 07484734525,No ratings yet Rate it yourself - /Services/careproviders/LeaveReview/DefaultView.aspx?id=1-145353745,0,0,,
Frognal House Care Home,1-3876084699,SCL,Frognal House,Frognal Avenue,,Sidcup,Kent,DA14 6LF,Tel: 02083026200,2 ratings Rate it yourself - /Services/careproviders/LeaveReview/DefaultView.aspx?id=1-3876084699,,,,
Smyth Lodge,1-6024238392,SCL,2 Frognal Avenue,,,Sidcup,,DA14 6LF,Tel: 02080519190,No ratings yet Rate it yourself - /Services/careproviders/LeaveReview/DefaultView.aspx?id=1-6024238392,0,0,,
Frognal House Care Home,1-15519796391,SCL,Frognal House,Frognal Avenue,,Sidcup,Kent,DA14 6LF,Tel: 02083026200,No ratings yet Rate it yourself - /Services/careproviders/LeaveReview/DefaultView.aspx?id=1-15519796391,0,0,,
Abacus Homecare (Bromley) Ltd,1-1195626726,SCL,40 Larch Way,,,Bromley,Kent,BR2 8DU,Tel: 07442503520,No ratings yet Rate it yourself - /Services/careproviders/LeaveReview/DefaultView.aspx?id=1-1195626726,0,0,,
Baugh House Care Centre,1-3618662661,SCL,19 Baugh Road,,,Sidcup,Kent,DA14 5ED,Tel: 02086201007,No ratings yet Rate it yourself - /Services/careproviders/LeaveReview/DefaultView.aspx?id=1-3618662661,0,0,,
Birchwood Heights Care Home,1-13137147535,SCL,Hilda May Avenue,,,Swanley,,BR8 7BT,Tel: 01322947055,No ratings yet Rate it yourself - /Services/careproviders/LeaveReview/DefaultView.aspx?id=1-13137147535,0,0,,
Prince George Duke of Kent Court,1-2600586559,SCL,Shepherds Green,,,Chislehurst,Kent,BR7 6PA,Tel: 02084670081,No ratings yet Rate it yourself - /Services/careproviders/LeaveReview/DefaultView.aspx?id=1-2600586559,0,0,,
Foxbridge House,1-651388922,SCL,Sevenoaks Road,Pratts Bottom,,Orpington,Kent,BR6 7FB,Tel: 03333210926,No ratings yet Rate it yourself - /Services/careproviders/LeaveReview/DefaultView.aspx?id=1-651388922,0,0,,
Melburay Ltd,1-8788300774,SCL,"Unit 2.5, Donna Alexandra Mews",Royal Parade,,Chislehurst,,BR7 6NR,Tel: 02037311088,No ratings yet Rate it yourself - /Services/careproviders/LeaveReview/DefaultView.aspx?id=1-8788300774,0,0,,
Fairlight,1-9405286125,SCL,Bromley Lane,,,Chislehurst,,BR7 6LL,Tel: 02039171523,No ratings yet Rate it yourself - /Services/careproviders/LeaveReview/DefaultView.aspx?id=1-9405286125,0,0,,
Gracious Care,1-9775304484,SCL,Willow Walk Business Centre,8 - 10 Willow Walk,,Orpington,,BR6 7AA,,No ratings yet Rate it yourself - /Services/careproviders/LeaveReview/DefaultView.aspx?id=1-9775304484,0,0,,
Fallowfield,1-119778726,SCL,Ashfield Lane,,,Chislehurst,Kent,BR7 6LQ,Tel: 02084672781,No ratings yet Rate it yourself - /Services/careproviders/LeaveReview/DefaultView.aspx?id=1-119778726,0,0,,
Esteem Supported Living Limited - Main Office,1-15982016374,SCL,1 Leechcroft Avenue,,,Swanley,,BR8 8AP,Tel: 02039621360,No ratings yet Rate it yourself - /Services/careproviders/LeaveReview/DefaultView.aspx?id=1-15982016374,0,0,,
Gravity Care Services Ltd,1-12292063139,SCL,11 Leechcroft Avenue,,,Swanley,,BR8 8AP,,No ratings yet Rate it yourself - /Services/careproviders/LeaveReview/DefaultView.aspx?id=1-12292063139,0,0,,
The Drive,1-114664194,SCL,17 The Drive,,,Sidcup,Kent,DA14 4ER,Tel: 02083090440,No ratings yet Rate it yourself - /Services/careproviders/LeaveReview/DefaultView.aspx?id=1-114664194,0,0,,
Willett House,1-128976488,SCL,10 Kemnal Road,,,Chislehurst,Kent,BR7 6LT,Tel: 02084028224,No ratings yet Rate it yourself - /Services/careproviders/LeaveReview/DefaultView.aspx?id=1-128976488,0,0,,
Reliable Community Care Services Ltd,1-12771442086,SCL,Unit 20,"The Beechwood Centre, 40 Lower Gravel Road",,Bromley,,BR2 8GP,Tel: 07983860248,No ratings yet Rate it yourself - /Services/careproviders/LeaveReview/DefaultView.aspx?id=1-12771442086,0,0,,
Solving Homes Limited,1-12331943788,SCL,The Beechwood Centre,40 Lower Gravel Road,,Bromley,,BR2 8GP,Tel: 02037709382,No ratings yet Rate it yourself - /Services/careproviders/LeaveReview/DefaultView.aspx?id=1-12331943788,0,0,,
Caremax Ltd,1-6388358420,SCL,"Suite 21, The Beechwood Centre",40 Lower Gravel Road,,Bromley,,BR2 8GP,Tel: 03301330577,No ratings yet Rate it yourself - /Services/careproviders/LeaveReview/DefaultView.aspx?id=1-6388358420,0,0,,
KYN Bickley,1-14863445898,SCL,Bickley Park Road,,,Bromley,Kent,BR1 2AZ,Tel: 0205309700,No ratings yet Rate it yourself - /Services/careproviders/LeaveReview/DefaultView.aspx?id=1-14863445898,0,0,,
Bromley,1-3915276101,SCL,27 Ruskin Walk,,,Bromley,Kent,BR2 8EP,,No ratings yet Rate it yourself - /Services/careproviders/LeaveReview/DefaultView.aspx?id=1-3915276101,0,0,,
Hatherley Lodge,1-13258995162,SCL,19 Hatherley Road,,,Sidcup,,DA14 4BH,Tel: 02083097905,No ratings yet Rate it yourself - /Services/careproviders/LeaveReview/DefaultView.aspx?id=1-13258995162,0,0,,
The Sidcup Care Home,1-127818934,SCL,2-8 Hatherley Road,,,Sidcup,Kent,DA14 4BG,Tel: 02083007711,No ratings yet Rate it yourself - /Services/careproviders/LeaveReview/DefaultView.aspx?id=1-127818934,0,0,,
Ashglade,1-127080331,SCL,178 Southborough Lane,,,Bromley,Kent,BR2 8AL,Tel: 02084670640,No ratings yet Rate it yourself - /Services/careproviders/LeaveReview/DefaultView.aspx?id=1-127080331,0,0,,
Chislehurst Healthcare Ltd,1-11188426198,SCL,39 High Street,,,Chislehurst,,BR7 5AE,Tel: 08006894171,No ratings yet Rate it yourself - /Services/careproviders/LeaveReview/DefaultView.aspx?id=1-11188426198,0,0,,
Right at Home (Bromley),1-3917553912,SCL,Bromley Business Centre,27 Hastings Road,,London,,BR2 8NA,Tel: 020 8150 6272,1 rating Rate it yourself - /Services/careproviders/LeaveReview/DefaultView.aspx?id=1-3917553912,,,,
Elmwood Lodge,1-118948069,SCL,11 Victoria Road,,,Sidcup,Kent,DA15 7HD,Tel: 02083097905,No ratings yet Rate it yourself - /Services/careproviders/LeaveReview/DefaultView.aspx?id=1-118948069,0,0,,
Elmwood,1-128976502,SCL,42 Southborough Road,Bickley,,Bromley,Kent,BR1 2EN,Tel: 02082491904,No ratings yet Rate it yourself - /Services/careproviders/LeaveReview/DefaultView.aspx?id=1-128976502,0,0,,
Queen Elizabeth House,1-121567230,SCL,38 Southborough Road,Bickley,,Bromley,Kent,BR1 2EE,Tel: 02084673994,No ratings yet Rate it yourself - /Services/careproviders/LeaveReview/DefaultView.aspx?id=1-121567230,0,0,,
Homefield,1-128976515,SCL,1 Lime Close,,,Bromley,,BR1 2EF,Tel: 02082897932,No ratings yet Rate it yourself - /Services/careproviders/LeaveReview/DefaultView.aspx?id=1-128976515,0,0,,
YourLife (Sidcup),1-4211223750,SCL,Sydney Court,7-13 Lansdown Road,,Sidcup,Kent,DA14 4EF,Tel: 01202362303,No ratings yet Rate it yourself - /Services/careproviders/LeaveReview/DefaultView.aspx?id=1-4211223750,0,0,,
St Aubyns Nursing Home,1-2027978636,SCL,35 Priestlands Park Road,,,Sidcup,Kent,DA15 7HJ,Tel: 02083004285,No ratings yet Rate it yourself - /Services/careproviders/LeaveReview/DefaultView.aspx?id=1-2027978636,0,0,,
56 High Street,1-3229442435,SCL,56 High Street,,,Chislehurst,Kent,BR7 5AQ,Tel: 02084687016,No ratings yet Rate it yourself - /Services/careproviders/LeaveReview/DefaultView.aspx?id=1-3229442435,0,0,,
Beechmore Court,1-108969188,SCL,267 Southlands Road,,,Bromley,Kent,BR1 2EG,Tel: 02084687778,No ratings yet Rate it yourself - /Services/careproviders/LeaveReview/DefaultView.aspx?id=1-108969188,0,0,,
Mears Care - Bromley,1-8026511168,SCL,Crown Meadow Court,23 Brosse Way,,Bromley,Kent,BR2 8FE,Tel: 02084621006,No ratings yet Rate it yourself - /Services/careproviders/LeaveReview/DefaultView.aspx?id=1-8026511168,0,0,,
Emerson Grange,1-5600613464,SCL,Emerson Park,"Rowhill Road, Hextable",,Swanley,Kent,BR8 7FP,Tel: 01233224040,1 rating Rate it yourself - /Services/careproviders/LeaveReview/DefaultView.aspx?id=1-5600613464,,,,
Diversity Healthcare,1-4361682261,SCL,9 Archery Lane,,,Bromley,,BR2 9FQ,Tel: 02084986800,No ratings yet Rate it yourself - /Services/careproviders/LeaveReview/DefaultView.aspx?id=1-4361682261,0,0,,
Loring Hall,1-126032248,SCL,Loring Hall,8 Water Lane,,Sidcup,Kent,DA14 5ES,Tel: 020 8302 9302,1 rating Rate it yourself - /Services/careproviders/LeaveReview/DefaultView.aspx?id=1-126032248,,,,
Nesbit House Care Home,1-7312323608,SCL,Orpington By Pass,Badgers Mount,,Sevenoaks,,TN14 7AG,Tel: 01959581350,No ratings yet Rate it yourself - /Services/careproviders/LeaveReview/DefaultView.aspx?id=1-7312323608,0,0,,
SureCare Bromley Limited,1-4465650560,SCL,Bencewell Business Centre,Oakley Road,,Bromley,Kent,BR2 8HG,Tel: 02034091626,No ratings yet Rate it yourself - /Services/careproviders/LeaveReview/DefaultView.aspx?id=1-4465650560,0,0,,
Mackley Homecare Limited,1-117070190,SCL,Bencewell Business Centre,Oakley Road,,Bromley,Kent,BR2 8HG,Tel: 02038928700,No ratings yet Rate it yourself - /Services/careproviders/LeaveReview/DefaultView.aspx?id=1-117070190,0,0,,
St Margaret's Residential Home,1-377969601,SCL,5 Priestlands Park Road,,,London,,DA15 7HR,Tel: 020 8300 2745,2 ratings Rate it yourself - /Services/careproviders/LeaveReview/DefaultView.aspx?id=1-377969601,,,,
Creative Support - Regency Court,1-4116308774,SCL,14 Mackintosh Street,,,Bromley,Kent,BR2 9GL,Tel: 02084603142,No ratings yet Rate it yourself - /Services/careproviders/LeaveReview/DefaultView.aspx?id=1-4116308774,0,0,,
Parkhill Support Services Main Road,1-8495598391,SCL,263 Main Road,,,Sidcup,Kent,DA14 6QL,Tel: 02083025848,No ratings yet Rate it yourself - /Services/careproviders/LeaveReview/DefaultView.aspx?id=1-8495598391,0,0,,
Bluebird Care Bromley,1-2246993108,SCL,,50c Chatterton Road,,Bromley,Kent,BR2 9QE,Tel: 02083150236,64 ratings Rate it yourself - /Services/careproviders/LeaveReview/DefaultView.aspx?id=1-2246993108,,,,
Responsive-Care,1-12142424006,SCL,6 Gossington Close,,,Chislehurst,,BR7 6TG,Tel: 07905888194,No ratings yet Rate it yourself - /Services/careproviders/LeaveReview/DefaultView.aspx?id=1-12142424006,0,0,,
Queens Court,1-14390315792,SCL,21 Bickley Road,,,Bromley,Kent,BR1 2ND,Tel: 02084687440,No ratings yet Rate it yourself - /Services/careproviders/LeaveReview/DefaultView.aspx?id=1-14390315792,0,0,,
Parkhill Support Services Ltd,1-8495597646,SCL,32 Greenwood Close,,,Sidcup,Kent,DA15 9AD,Tel: 02083025848,No ratings yet Rate it yourself - /Services/careproviders/LeaveReview/DefaultView.aspx?id=1-8495597646,0,0,,
St Mary's Nursing Home,1-122288559,SCL,327 Main Road,,,Sidcup,Kent,DA14 6QG,Tel: 02083027289,No ratings yet Rate it yourself - /Services/careproviders/LeaveReview/DefaultView.aspx?id=1-122288559,0,0,,
Northbourne Court,1-128278735,SCL,Harland Avenue,,,Sidcup,Kent,DA15 7NU,Tel: 02082699840,2 ratings Rate it yourself - /Services/careproviders/LeaveReview/DefaultView.aspx?id=1-128278735,,,,
Howard Goble House,1-15199356067,SCL,Harland Avenue,,,Sidcup,Kent,DA15 7NU,Tel: 02083083560,No ratings yet Rate it yourself - /Services/careproviders/LeaveReview/DefaultView.aspx?id=1-15199356067,0,0,,
Abbotsleigh Mews Care Home,1-127515214,SCL,Old Farm Road East,,,Sidcup,Kent,DA15 8AY,Tel: 02083089590,No ratings yet Rate it yourself - /Services/careproviders/LeaveReview/DefaultView.aspx?id=1-127515214,0,0,,
Home Care & Support Limited,1-865267331,SCL,"First Floor Suite, St Luke's Hall",Raglan Road,,Bromley,,BR2 9NN,Tel: 02045417116,No ratings yet Rate it yourself - /Services/careproviders/LeaveReview/DefaultView.aspx?id=1-865267331,0,0,,
Helping Hands Bromley,1-2647984594,SCL,3 Walden Parade,Walden Road,,Chislehurst,Kent,BR7 5DW,Tel: 02081507514,No ratings yet Rate it yourself - /Services/careproviders/LeaveReview/DefaultView.aspx?id=1-2647984594,0,0,,
The Oaks,1-11212018349,SCL,904 Sidcup Road,New Eltham,,London,,SE9 3PW,Tel: 02088579980,No ratings yet Rate it yourself - /Services/careproviders/LeaveReview/DefaultView.aspx?id=1-11212018349,0,0,,
St Cecilia's - Care Home with Nursing Physical Disabilities,1-120088056,SCL,32 Sundridge Avenue,,,Bromley,Kent,BR1 2PZ,Tel: 02084608377,No ratings yet Rate it yourself - /Services/careproviders/LeaveReview/DefaultView.aspx?id=1-120088056,0,0,,
Montbelle Road,1-145904148,SCL,88 Montbelle Road,New Eltham,,London,,SE9 3NY,Tel: 02088515999,No ratings yet Rate it yourself - /Services/careproviders/LeaveReview/DefaultView.aspx?id=1-145904148,0,0,,
Voug Care,1-14808116929,SCL,40,Homesdale Road,,Bromley,,BR2 9LD,Tel: 02084607468,No ratings yet Rate it yourself - /Services/careproviders/LeaveReview/DefaultView.aspx?id=1-14808116929,0,0,,
Homesdale Supported Living,1-11296003795,SCL,30 Homesdale Road,,,Bromley,,BR2 9LD,Tel: 02082492902,No ratings yet Rate it yourself - /Services/careproviders/LeaveReview/DefaultView.aspx?id=1-11296003795,0,0,,
Toptee Healthcare Services Limited,1-18711632713,SCL,28 Bromley Common,,,Bromley,,BR2 9PD,Tel: 07939343813,No ratings yet Rate it yourself - /Services/careproviders/LeaveReview/DefaultView.aspx?id=1-18711632713,0,0,,
Nettlestead Care Home,1-111375413,SCL,19 Sundridge Avenue,,,Bromley,Kent,BR1 2PU,Tel: 02084602279,No ratings yet Rate it yourself - /Services/careproviders/LeaveReview/DefaultView.aspx?id=1-111375413,0,0,,
Nightingale Home Care,1-111375442,SCL,The Coach House,19 Sundridge Avenue,,Bromley,Kent,BR1 2PU,Tel: 02084669664,No ratings yet Rate it yourself - /Services/careproviders/LeaveReview/DefaultView.aspx?id=1-111375442,0,0,,
Elmstead Care Home,1-130120365,SCL,104 Elmstead Lane,,,Chislehurst,Kent,BR7 5EL,Tel: 02034680974,No ratings yet Rate it yourself - /Services/careproviders/LeaveReview/DefaultView.aspx?id=1-130120365,0,0,,
TUcare,1-5537977391,SCL,167a Widmore Road,,,London,,BR1 3AX,Tel: 020 8325 2285,No ratings yet Rate it yourself - /Services/careproviders/LeaveReview/DefaultView.aspx?id=1-5537977391,0,0,,
Clairleigh Nursing Home,1-106338834,SCL,104 Plaistow Lane,,,Bromley,Kent,BR1 3AS,Tel: 02084601527,No ratings yet Rate it yourself - /Services/careproviders/LeaveReview/DefaultView.aspx?id=1-106338834,0,0,,
Chasfab Options Limited,1-13748947981,SCL,775 Sidcup Road,,,London,,SE9 3SB,,No ratings yet Rate it yourself - /Services/careproviders/LeaveReview/DefaultView.aspx?id=1-13748947981,0,0,,
National Care Holdings Limited,1-6875309146,SCL,10 The Mound,,,London,,SE9 3AZ,Tel: 07572333293,No ratings yet Rate it yourself - /Services/careproviders/LeaveReview/DefaultView.aspx?id=1-6875309146,0,0,,
Bluebird Care (Greenwich),1-2406770581,SCL,10 The Mound,,,London,,SE9 3AZ,Tel: 02088515551,No ratings yet Rate it yourself - /Services/careproviders/LeaveReview/DefaultView.aspx?id=1-2406770581,0,0,,
Independent Home Care Team,1-2126438698,SCL,405A Footscray Road,New Eltham,,London,,SE9 3UL,Tel: 02037748870,No ratings yet Rate it yourself - /Services/careproviders/LeaveReview/DefaultView.aspx?id=1-2126438698,0,0,,
118 Widmore Road,1-10858801772,SCL,118 Widmore Road,,,Bromley,Kent,BR1 3BE,Tel: 02084643920,No ratings yet Rate it yourself - /Services/careproviders/LeaveReview/DefaultView.aspx?id=1-10858801772,0,0,,
Eden Ivy Care Ltd,1-8573486494,SCL,48 Bexley High Street,,,Bexley,,DA5 1AH,Tel: 01322949494,No ratings yet Rate it yourself - /Services/careproviders/LeaveReview/DefaultView.aspx?id=1-8573486494,0,0,,
ETHAR LIMITED,1-18393302971,SCL,4 Spekehill,,,London,,SE9 3BN,Tel: 07809547071,No ratings yet Rate it yourself - /Services/careproviders/LeaveReview/DefaultView.aspx?id=1-18393302971,0,0,,
Enspíra Ltd,1-12673575419,SCL,68 Pinewood Place,,,Dartford,,DA2 7WQ,Tel: 07815602803,No ratings yet Rate it yourself - /Services/careproviders/LeaveReview/DefaultView.aspx?id=1-12673575419,0,0,,
Abbey M Services,1-7741908874,SCL,Unit 16,"Old Bexley Business Park, Bourne Road",,Bexley,,DA5 1LR,Tel: 02074743434,No ratings yet Rate it yourself - /Services/careproviders/LeaveReview/DefaultView.aspx?id=1-7741908874,0,0,,
Home Instead Senior Care,1-3882103168,SCL,Polhill Business Centre,Halstead,,Sevenoaks,Kent,TN14 7AA,Tel: 01959546228,No ratings yet Rate it yourself - /Services/careproviders/LeaveReview/DefaultView.aspx?id=1-3882103168,0,0,,
Home Care,1-176333932,SCL,North Block,Stockwell Close,,Bromley,Kent,BR1 3UH,Tel: 02083134072,No ratings yet Rate it yourself - /Services/careproviders/LeaveReview/DefaultView.aspx?id=1-176333932,0,0,,
Springfield - Care Home Physical Disabilities,1-120087412,SCL,69 Freelands Road,,,Bromley,Kent,BR1 3HZ,Tel: 02084668158,No ratings yet Rate it yourself - /Services/careproviders/LeaveReview/DefaultView.aspx?id=1-120087412,0,0,,
4 Sandford Road,1-3040229752,SCL,4 Sandford Road,,,Bromley,Kent,BR2 9AW,Tel: 02083131017,No ratings yet Rate it yourself - /Services/careproviders/LeaveReview/DefaultView.aspx?id=1-3040229752,0,0,,
Always Caring Bromley Limited,1-266779859,SCL,14 Letchworth Drive,,,Bromley,Kent,BR2 9BE,Tel: 02084666133,No ratings yet Rate it yourself - /Services/careproviders/LeaveReview/DefaultView.aspx?id=1-266779859,0,0,,
London & South East Domiciliary Care Branch (Mental Health),1-3040078062,SCL,"Office No. 29, Kingfisher House Business Centre",21-23 Elmfield Road,,Bromley,,BR1 1LT,Tel: 02083139725,No ratings yet Rate it yourself - /Services/careproviders/LeaveReview/DefaultView.aspx?id=1-3040078062,0,0,,
London and South East Domiciliary Care Branch (Learning Disability),1-1839972206,SCL,"Office No. 29, Kingfisher House Business Centre",21-23 Elmfield Road,,Bromley,,BR1 1LT,Tel: 02085023933,No ratings yet Rate it yourself - /Services/careproviders/LeaveReview/DefaultView.aspx?id=1-1839972206,0,0,,