Organisation Name,NACS Code,Organisation Type,Address1,Address2,Address3,Address4,Address5,PostCode,Telephone Number,NHS.UK users rating,Value  (NHS.UK users rating),Banding Classification  (NHS.UK users rating),Car parking (Is there car parking at this organisation?),Disabled access (Disabled access)
The Willows,1-107340693,SCL,Corders Farm,"Bury Road, Lawshall",,Bury St Edmunds,Suffolk,IP29 4PJ,Tel: 01284830665,No ratings yet Rate it yourself - /Services/careproviders/LeaveReview/DefaultView.aspx?id=1-107340693,0,0,,
Glastonbury Court,1-2397838058,SCL,Glastonbury Road,,,Bury St Edmunds,Suffolk,IP33 2EX,Tel: 03333211989,No ratings yet Rate it yourself - /Services/careproviders/LeaveReview/DefaultView.aspx?id=1-2397838058,0,0,,
The Grange Residential Home,1-106351203,SCL,The Grange,30 Vinery Road,,Bury St Edmunds,Suffolk,IP33 2JT,Tel: 01284769887,No ratings yet Rate it yourself - /Services/careproviders/LeaveReview/DefaultView.aspx?id=1-106351203,0,0,,
Berkeley Home Health - East of England,1-4349166701,SCL,"The Lilly Suite, Nowton Court Village",Nowton Road,,Bury St. Edmunds,,IP29 5LU,Tel: 01284756516,No ratings yet Rate it yourself - /Services/careproviders/LeaveReview/DefaultView.aspx?id=1-4349166701,0,0,,
Royal Mencap Society - Drummond Court,1-310333551,SCL,Mill Road South,,,Bury St Edmunds,Suffolk,IP33 3NN,Tel: 01284767445,No ratings yet Rate it yourself - /Services/careproviders/LeaveReview/DefaultView.aspx?id=1-310333551,0,0,,
Risby Park Nursing Home,1-121065992,SCL,Hall Lane,Risby,,Bury St Edmunds,Suffolk,IP28 6RS,,No ratings yet Rate it yourself - /Services/careproviders/LeaveReview/DefaultView.aspx?id=1-121065992,0,0,,
Cornwallis Court,1-2508473270,SCL,Hospital Road,,,Bury St Edmunds,Suffolk,IP33 3NH,Tel: 01284768028,No ratings yet Rate it yourself - /Services/careproviders/LeaveReview/DefaultView.aspx?id=1-2508473270,0,0,,
Risby Hall Nursing Home,1-121065975,SCL,Hall Lane,Risby,,Bury St Edmunds,Suffolk,IP28 6RS,,No ratings yet Rate it yourself - /Services/careproviders/LeaveReview/DefaultView.aspx?id=1-121065975,0,0,,
St Peter's House,1-9976760806,SCL,29 Out Risbygate,,,Bury St. Edmunds,,IP33 3RJ,Tel: 01284706603,No ratings yet Rate it yourself - /Services/careproviders/LeaveReview/DefaultView.aspx?id=1-9976760806,0,0,,
Radis Community Care (Cullum Road),1-5764989165,SCL,11 Cullum Road,,,Bury St. Edmunds,,IP33 3PB,Tel: 01284750990,No ratings yet Rate it yourself - /Services/careproviders/LeaveReview/DefaultView.aspx?id=1-5764989165,0,0,,
Fonjock's Social Work Practice Limited,1-2110782795,SCL,Orchard House,1 Old Convent Orchard,,Bury St Edmunds,Suffolk,IP33 3PQ,Tel: 01284764411,No ratings yet Rate it yourself - /Services/careproviders/LeaveReview/DefaultView.aspx?id=1-2110782795,0,0,,
Bury Home Care,1-145680661,SCL,West Suffolk House,Western Way,,Bury St Edmunds,Suffolk,IP33 3YU,Tel: 01284758561,No ratings yet Rate it yourself - /Services/careproviders/LeaveReview/DefaultView.aspx?id=1-145680661,0,0,,
Home Instead Bury St Edmunds,1-12958090508,SCL,Unit 3,"Old Wool Warehouse, St. Andrews Street South",,Bury St. Edmunds,,IP33 3PH,Tel: 01284658100,No ratings yet Rate it yourself - /Services/careproviders/LeaveReview/DefaultView.aspx?id=1-12958090508,0,0,,
SylvianCare Bury St Edmunds,1-15659339552,SCL,"Active Business Centre, St. Andrews Castle",33 St. Andrews Street South,,Bury St. Edmunds,,IP33 3PH,Tel: 01284365588,No ratings yet Rate it yourself - /Services/careproviders/LeaveReview/DefaultView.aspx?id=1-15659339552,0,0,,
Multi-Care Community Services Suffolk Ltd,1-18536358161,SCL,8b Old Bakery,St. Andrews Street South,,Bury St. Edmunds,,IP33 3PH,Tel: 01284247042,No ratings yet Rate it yourself - /Services/careproviders/LeaveReview/DefaultView.aspx?id=1-18536358161,0,0,,
Helping Hands Bury St Edmunds,1-9005783097,SCL,4 Kings Mews,Kings Road,,Bury St. Edmunds,,IP33 3DE,Tel: 01284334049,1 rating Rate it yourself - /Services/careproviders/LeaveReview/DefaultView.aspx?id=1-9005783097,,,,
PnS Domiciliary Services,1-5446781338,SCL,9 Guildhall Street,,,Bury St. Edmunds,,IP33 1PR,Tel: 01284724223,No ratings yet Rate it yourself - /Services/careproviders/LeaveReview/DefaultView.aspx?id=1-5446781338,0,0,,
Assured Optimal Care - Main Office,1-17428509005,SCL,"Office B, 2nd Floor",9 Guildhall Street,,Bury St. Edmunds,,IP33 1PR,Tel: 07507986286,No ratings yet Rate it yourself - /Services/careproviders/LeaveReview/DefaultView.aspx?id=1-17428509005,0,0,,
Availl (Bury St Edmunds),1-6782894325,SCL,85A Guildhall Street,,,Bury St. Edmunds,,IP33 1PR,Tel: 01284630575,1 rating Rate it yourself - /Services/careproviders/LeaveReview/DefaultView.aspx?id=1-6782894325,,,,
Yourlife (Bury),1-2679793374,SCL,Cross Penny Court,Cotton Lane,,Bury St Edmunds,Suffolk,IP33 1XY,Tel: 01284760489,No ratings yet Rate it yourself - /Services/careproviders/LeaveReview/DefaultView.aspx?id=1-2679793374,0,0,,
Manson House,1-13319120539,SCL,Northgate Street,,,Bury St. Edmunds,,IP33 1HP,Tel: 01284753106,No ratings yet Rate it yourself - /Services/careproviders/LeaveReview/DefaultView.aspx?id=1-13319120539,0,0,,
The Martins,1-117977429,SCL,Vinefields,,,Bury St Edmunds,Suffolk,IP33 1YA,Tel: 01284753467,No ratings yet Rate it yourself - /Services/careproviders/LeaveReview/DefaultView.aspx?id=1-117977429,0,0,,
North Court Care Home,1-18296156434,SCL,108 Northgate Street,,,Bury St. Edmunds,,IP33 1HS,Tel: 01284763621,No ratings yet Rate it yourself - /Services/careproviders/LeaveReview/DefaultView.aspx?id=1-18296156434,0,0,,
Cathedral View,1-385482818,SCL,The Vinefields,,,Bury St Edmunds,Suffolk,IP33 1YU,Tel: 01284765046,No ratings yet Rate it yourself - /Services/careproviders/LeaveReview/DefaultView.aspx?id=1-385482818,0,0,,
Marham House Care Home,1-13694078242,SCL,Simcoe Road,,,Bury St. Edmunds,,IP32 6FD,Tel: 01284335964,No ratings yet Rate it yourself - /Services/careproviders/LeaveReview/DefaultView.aspx?id=1-13694078242,0,0,,
The Briars Residential Care Home,1-877271524,SCL,23 Hunts Hill,Glemsford,,Sudbury,Suffolk,CO10 7RP,Tel: 01787282249,No ratings yet Rate it yourself - /Services/careproviders/LeaveReview/DefaultView.aspx?id=1-877271524,0,0,,
PentaCare (Bury St Edmunds),1-15183517217,SCL,"Unit GF2, Eagle House",Great Whelnetham,,Bury St. Edmunds,,IP30 0UN,Tel: 01284336136,No ratings yet Rate it yourself - /Services/careproviders/LeaveReview/DefaultView.aspx?id=1-15183517217,0,0,,
St Edmunds Care,1-6193818659,SCL,"Risbygate Suite, Ask House",2 Northgate Avenue,,Bury St. Edmunds,,IP32 6BB,Tel: 01284336222,No ratings yet Rate it yourself - /Services/careproviders/LeaveReview/DefaultView.aspx?id=1-6193818659,0,0,,
Davers Court,1-1586577058,SCL,Shaker's Lane,,,Bury St Edmunds,Suffolk,IP32 7BN,Tel: 03333211982,No ratings yet Rate it yourself - /Services/careproviders/LeaveReview/DefaultView.aspx?id=1-1586577058,0,0,,
Devonshire House,1-3306736227,SCL,High Street,Cavendish,,Sudbury,Suffolk,CO10 8AS,Tel: 01787283240,No ratings yet Rate it yourself - /Services/careproviders/LeaveReview/DefaultView.aspx?id=1-3306736227,0,0,,
SuffolkHomeCare,1-151257173,SCL,11 Brunel Business Court,Eastern Way,,Bury St Edmunds,Suffolk,IP32 7AB,Tel: 01284702002,No ratings yet Rate it yourself - /Services/careproviders/LeaveReview/DefaultView.aspx?id=1-151257173,0,0,,
FitzRoy Supported Living Suffolk,1-2679829948,SCL,"Unit 18, The Vision Centre",Eastern Way,,Bury St. Edmunds,,IP32 7AB,Tel: 07896891174,No ratings yet Rate it yourself - /Services/careproviders/LeaveReview/DefaultView.aspx?id=1-2679829948,0,0,,
Support to Live at Home West,1-385503428,SCL,Bury Resource Centre,Hollow Road,,Bury St Edmunds,Suffolk,IP32 7AY,Tel: 01284718741,No ratings yet Rate it yourself - /Services/careproviders/LeaveReview/DefaultView.aspx?id=1-385503428,0,0,,
Lots of Care Ltd,1-14484721645,SCL,15 Sebert Road,,,Bury St. Edmunds,,IP32 7EB,,No ratings yet Rate it yourself - /Services/careproviders/LeaveReview/DefaultView.aspx?id=1-14484721645,0,0,,
Hilltop House (Domiciliary Care),1-1492095485,SCL,2 Heldhaw Road,,,Bury St Edmunds,Suffolk,IP32 7ER,Tel: 01284724979,No ratings yet Rate it yourself - /Services/careproviders/LeaveReview/DefaultView.aspx?id=1-1492095485,0,0,,
Hartewell Homecare,1-18028335658,SCL,11 Manners Road,Fornham St. Martin,,Bury St. Edmunds,,IP31 1TE,Tel: 01284636681,No ratings yet Rate it yourself - /Services/careproviders/LeaveReview/DefaultView.aspx?id=1-18028335658,0,0,,
Mencap - West Suffolk Domiciliary Care Agency,1-3617655390,SCL,West Suffolk Disability Resource Centre,4 Bunting Road,,Bury St Edmunds,Suffolk,IP32 7BX,Tel: 01284748874,No ratings yet Rate it yourself - /Services/careproviders/LeaveReview/DefaultView.aspx?id=1-3617655390,0,0,,
Kentford Manor,1-5315177207,SCL,Jeddah Way,Kennett,,Newmarket,Suffolk,CB8 8JY,Tel: 01638555090,No ratings yet Rate it yourself - /Services/careproviders/LeaveReview/DefaultView.aspx?id=1-5315177207,0,0,,
Kentford Manor,1-11457259392,SCL,Jeddah Way,Kennett,,Newmarket,Suffolk,CB8 8JY,Tel: 01638555090,No ratings yet Rate it yourself - /Services/careproviders/LeaveReview/DefaultView.aspx?id=1-11457259392,0,0,,
Fornham House Residential Home,1-121919754,SCL,Fornham St Martin,,,Bury St Edmunds,Suffolk,IP31 1SR,Tel: 01284768327,1 rating Rate it yourself - /Services/careproviders/LeaveReview/DefaultView.aspx?id=1-121919754,,,,
Harmony Homecare Suffolk,1-9856693805,SCL,"Office 4c, Rosemary House","Lanwades Business Park, Kennett",,Newmarket,,CB8 7PN,Tel: 01284663006,No ratings yet Rate it yourself - /Services/careproviders/LeaveReview/DefaultView.aspx?id=1-9856693805,0,0,,
Visionshealthcare Ltd,1-4616674851,SCL,4E Rosemary House,"Lanwades Business Park, Kennett",,Newmarket,,CB8 7PN,Tel: 01223426011,No ratings yet Rate it yourself - /Services/careproviders/LeaveReview/DefaultView.aspx?id=1-4616674851,0,0,,
The Pines,1-306059636,SCL,Culford Road,,,Fornham St Mary,Suffolk,IP28 6TN,Tel: 01284705062,No ratings yet Rate it yourself - /Services/careproviders/LeaveReview/DefaultView.aspx?id=1-306059636,0,0,,
Oxlip House,1-261437952,SCL,Airfield Road,,,Bury St Edmunds,Suffolk,IP32 7RH,Tel: 01284764864,No ratings yet Rate it yourself - /Services/careproviders/LeaveReview/DefaultView.aspx?id=1-261437952,0,0,,
Care Consult ID,1-14143552383,SCL,15 Meadow Lane,,,Newmarket,,CB8 8FZ,,No ratings yet Rate it yourself - /Services/careproviders/LeaveReview/DefaultView.aspx?id=1-14143552383,0,0,,
Cedar Lodge,1-4922344749,SCL,Culford,,,Bury St. Edmunds,,IP28 6DX,Tel: 01284728744,No ratings yet Rate it yourself - /Services/careproviders/LeaveReview/DefaultView.aspx?id=1-4922344749,0,0,,
Harmonize Care,1-3087260524,SCL,The Old Pharmacy,"Hall Street, Long Melford",,Sudbury,,CO10 9JQ,Tel: 07539348263,2 ratings Rate it yourself - /Services/careproviders/LeaveReview/DefaultView.aspx?id=1-3087260524,,,,
Melford Court Care Home,1-4335876242,SCL,Hall Street,Long Melford,,Sudbury,Suffolk,CO10 9JA,Tel: 01787880545,No ratings yet Rate it yourself - /Services/careproviders/LeaveReview/DefaultView.aspx?id=1-4335876242,0,0,,
Eastcotts Care Home with Nursing,1-108940729,SCL,Eastcotts Farm Cottage,"Calford Green, Kedington",,Haverhill,Suffolk,CB9 7UN,Tel: 01440703178,No ratings yet Rate it yourself - /Services/careproviders/LeaveReview/DefaultView.aspx?id=1-108940729,0,0,,
Montana Care Home Grace and Compassion Benedictines,1-118089078,SCL,East Barton Road,Great Barton,,Bury St Edmunds,Suffolk,IP31 2RF,Tel: 01284 787321,1 rating Rate it yourself - /Services/careproviders/LeaveReview/DefaultView.aspx?id=1-118089078,,,,
6A Clock Tower Mews,1-2158395145,SCL,6A Clock Tower Mews,Exeter Road,,Newmarket,Suffolk,CB8 8LL,Tel: 01638676547,No ratings yet Rate it yourself - /Services/careproviders/LeaveReview/DefaultView.aspx?id=1-2158395145,0,0,,
Warren Homecare Ltd,1-12446560904,SCL,26 Marigold Drive,Red Lodge,,Bury St. Edmunds,,IP28 8TL,,No ratings yet Rate it yourself - /Services/careproviders/LeaveReview/DefaultView.aspx?id=1-12446560904,0,0,,
"Office 3, The Stable",1-14723565600,SCL,65 High Street,,,Newmarket,,CB8 8NA,Tel: 07411255594,No ratings yet Rate it yourself - /Services/careproviders/LeaveReview/DefaultView.aspx?id=1-14723565600,0,0,,
1 Oak Home Care,1-3857492640,SCL,Unit 1 & 2 Woodview,"Bull Lane Industrial Estate, Bull Lane, Acton",,Sudbury,,CO10 0FD,Tel: 01787326555,No ratings yet Rate it yourself - /Services/careproviders/LeaveReview/DefaultView.aspx?id=1-3857492640,0,0,,
Briarcare Recruitment Agency,1-4624516852,SCL,Unit 3,"Woodview, Bull Lane Industrial Estate, Bull Lane, Acton",,Sudbury,Suffolk,CO10 0FD,Tel: 01787881185,No ratings yet Rate it yourself - /Services/careproviders/LeaveReview/DefaultView.aspx?id=1-4624516852,0,0,,
Radis Community Care (Childwick House),1-5764989478,SCL,Childwick House,Howard De Walden Way,,Newmarket,,CB8 0QZ,Tel: 01638660967,No ratings yet Rate it yourself - /Services/careproviders/LeaveReview/DefaultView.aspx?id=1-5764989478,0,0,,
Haverhill Health Care Agency - Head Office,1-18338478124,SCL,29 Feltwell Place,,,Haverhill,,CB9 0AN,Tel: 07574478782,No ratings yet Rate it yourself - /Services/careproviders/LeaveReview/DefaultView.aspx?id=1-18338478124,0,0,,
Brampton Manor,1-10936037140,SCL,Brampton Manor,Fordham Road,,Newmarket,,CB8 7AQ,,No ratings yet Rate it yourself - /Services/careproviders/LeaveReview/DefaultView.aspx?id=1-10936037140,0,0,,
Lifetree Homecare Ltd,1-11939209142,SCL,"Unit 9, Woodside Business Park","Thetford Road, Ingham",,Bury St. Edmunds,,IP31 1NR,Tel: 01284330379,No ratings yet Rate it yourself - /Services/careproviders/LeaveReview/DefaultView.aspx?id=1-11939209142,0,0,,
Cleves Place,1-1954893701,SCL,"Cleves Place, Millfields Way",,,Haverhill,Suffolk,CB9 0JB,Tel: 01440715840,No ratings yet Rate it yourself - /Services/careproviders/LeaveReview/DefaultView.aspx?id=1-1954893701,0,0,,
Vange Place,1-441153798,SCL,4a Vange Place,,,Haverhill,Suffolk,CB9 0HT,Tel: 07817975307,No ratings yet Rate it yourself - /Services/careproviders/LeaveReview/DefaultView.aspx?id=1-441153798,0,0,,
Dimensions Essex and Suffolk Domiciliary Care Office,1-2496224797,SCL,2 River House,Chalkstone Way,,Haverhill,,CB9 0BF,Tel: 03003039004,No ratings yet Rate it yourself - /Services/careproviders/LeaveReview/DefaultView.aspx?id=1-2496224797,0,0,,
Barleycombe,1-2989956028,SCL,Sudbury Road,Long Melford,,Sudbury,Suffolk,CO10 9HE,Tel: 01787880203,No ratings yet Rate it yourself - /Services/careproviders/LeaveReview/DefaultView.aspx?id=1-2989956028,0,0,,
Kingfisher House Care Home,1-125339909,SCL,St Fabians Close,,,Newmarket,Suffolk,CB8 0EJ,Tel: 01638669919,No ratings yet Rate it yourself - /Services/careproviders/LeaveReview/DefaultView.aspx?id=1-125339909,0,0,,
Haverhill Community Care,1-4464749287,SCL,Weavers Mill,Chauntry Mills,,Haverhill,,CB9 8DD,Tel: 07379007008,1 rating Rate it yourself - /Services/careproviders/LeaveReview/DefaultView.aspx?id=1-4464749287,,,,
Cambridge House,1-123743865,SCL,11 Bryony Close,,,Haverhill,Suffolk,CB9 9DJ,Tel: 01440704719,No ratings yet Rate it yourself - /Services/careproviders/LeaveReview/DefaultView.aspx?id=1-123743865,0,0,,
Housing 21 - Shearman Court,1-125497925,SCL,Mill Hill,,,Haverhill,Suffolk,CB9 8DE,Tel: 03701924015,No ratings yet Rate it yourself - /Services/careproviders/LeaveReview/DefaultView.aspx?id=1-125497925,0,0,,
Time2Care (BSE) Ltd,1-1537123881,SCL,The Old Depot,Depot Road,,Newmarket,Suffolk,CB8 0AL,Tel: 03331212126,No ratings yet Rate it yourself - /Services/careproviders/LeaveReview/DefaultView.aspx?id=1-1537123881,0,0,,
Link Medical Staffing Solutions Ltd Haverhill Branch,1-4313733230,SCL,4A Hollands Road,,,Haverhill,Suffolk,CB9 8PP,Tel: 02038661182,No ratings yet Rate it yourself - /Services/careproviders/LeaveReview/DefaultView.aspx?id=1-4313733230,0,0,,
Cambridge Care Company,1-6467897211,SCL,4 Kings Court,Willie Snaith Road,,Newmarket,,CB8 7SG,Tel: 01638561100,No ratings yet Rate it yourself - /Services/careproviders/LeaveReview/DefaultView.aspx?id=1-6467897211,0,0,,
Care Circle Ltd,1-18391343512,SCL,4 Kings Court,Willie Snaith Road,,Newmarket,,CB8 7SG,Tel: 03330062393,No ratings yet Rate it yourself - /Services/careproviders/LeaveReview/DefaultView.aspx?id=1-18391343512,0,0,,
Inspire Social Care,1-8775590353,SCL,Newmarket Business Centre,341 Exning Road,,Newmarket,,CB8 0AT,Tel: 07780562943,No ratings yet Rate it yourself - /Services/careproviders/LeaveReview/DefaultView.aspx?id=1-8775590353,0,0,,
Care at Home Providers - Main Office,1-14588423471,SCL,"341, Suite 18a, Newmarket Business Centre",Exning Road,,Newmarket,,CB8 0AT,Tel: 03333391191,No ratings yet Rate it yourself - /Services/careproviders/LeaveReview/DefaultView.aspx?id=1-14588423471,0,0,,
Lav Care Services- East of Anglia,1-18390711425,SCL,"Suite 17, Newmarket Business Centre",341 Exning Road,,Newmarket,,CB8 0AT,Tel: 01223398500,No ratings yet Rate it yourself - /Services/careproviders/LeaveReview/DefaultView.aspx?id=1-18390711425,0,0,,
The Hay Wain,1-4385917637,SCL,Brybank Road,Hanchett Village,,Haverhill,Suffolk,CB9 7WD,Tel: 01440712498,No ratings yet Rate it yourself - /Services/careproviders/LeaveReview/DefaultView.aspx?id=1-4385917637,0,0,,
Fritton Court,1-15183291801,SCL,15 Fritton Court,,,Haverhill,,CB9 8LX,Tel: 07960261522,No ratings yet Rate it yourself - /Services/careproviders/LeaveReview/DefaultView.aspx?id=1-15183291801,0,0,,
The Meadows Care Home,1-4726313044,SCL,Brybank Road,Hanchett Village,,Haverhill,Suffolk,CB9 7YL,Tel: 01440712498,No ratings yet Rate it yourself - /Services/careproviders/LeaveReview/DefaultView.aspx?id=1-4726313044,0,0,,
The Swallows Residential Care Home,1-738691362,SCL,Helions Bumpstead Road,,,Haverhill,Suffolk,CB9 7AA,Tel: 01440714745,No ratings yet Rate it yourself - /Services/careproviders/LeaveReview/DefaultView.aspx?id=1-738691362,0,0,,
ROYALE HOMECARE,1-6794046146,SCL,22 Waterloo Close,,,Newmarket,,CB8 7RP,Tel: 07888937229,No ratings yet Rate it yourself - /Services/careproviders/LeaveReview/DefaultView.aspx?id=1-6794046146,0,0,,
Highworth Care Ltd,1-9402551977,SCL,"Unit 203, The Epicentre, Haverhill Research Park","Enterprise Way, Withersfield",,Haverhill,,CB9 7LR,Tel: 07932333360,No ratings yet Rate it yourself - /Services/careproviders/LeaveReview/DefaultView.aspx?id=1-9402551977,0,0,,
P & B Shadwell Ltd,1-8248432835,SCL,The Epicentre,"Enterprise Way, Withersfield",,Haverhill,,CB9 7LR,Tel: 07392170730,No ratings yet Rate it yourself - /Services/careproviders/LeaveReview/DefaultView.aspx?id=1-8248432835,0,0,,
Angels Home Care Suffolk,1-18689361325,SCL,The Epicentre,"Enterprise Way, Withersfield",,Haverhill,,CB9 7LR,,No ratings yet Rate it yourself - /Services/careproviders/LeaveReview/DefaultView.aspx?id=1-18689361325,0,0,,
Girling Street,1-136882841,SCL,34 Girling Street,,,Sudbury,Suffolk,CO10 1PG,Tel: 01787882082,No ratings yet Rate it yourself - /Services/careproviders/LeaveReview/DefaultView.aspx?id=1-136882841,0,0,,
St Faith's Villa,1-490382352,SCL,90 Queens Road,,,Sudbury,Suffolk,CO10 1PG,Tel: 01787370036,No ratings yet Rate it yourself - /Services/careproviders/LeaveReview/DefaultView.aspx?id=1-490382352,0,0,,
St Josephs,1-3306736467,SCL,The Croft,,,Sudbury,Suffolk,CO10 1HR,Tel: 01787888460,No ratings yet Rate it yourself - /Services/careproviders/LeaveReview/DefaultView.aspx?id=1-3306736467,0,0,,
Hazell Court,1-121065927,SCL,Acton Lane,,,Sudbury,Suffolk,CO10 1QN,,2 ratings Rate it yourself - /Services/careproviders/LeaveReview/DefaultView.aspx?id=1-121065927,,,,
Catchpole Court,1-17709036421,SCL,Walnut Tree Lane,,,Sudbury,Suffolk,CO10 1BD,Tel: 01787882023,No ratings yet Rate it yourself - /Services/careproviders/LeaveReview/DefaultView.aspx?id=1-17709036421,0,0,,
Anglia Case Management Limited,1-114103976,SCL,Ticehurst Yard,Beyton Road Tostock,,Bury St Edmunds,Suffolk,IP30 9PH,Tel: 01359271900,No ratings yet Rate it yourself - /Services/careproviders/LeaveReview/DefaultView.aspx?id=1-114103976,0,0,,
William Wood House,1-220311555,SCL,School Street,,,Sudbury,Suffolk,CO10 2AW,,No ratings yet Rate it yourself - /Services/careproviders/LeaveReview/DefaultView.aspx?id=1-220311555,0,0,,
Yew Tree Cottage,1-2622165866,SCL,15-17 Padlock Road,West Wratting,,Cambridge,Cambridgeshire,CB21 5LS,Tel: 01223290600,No ratings yet Rate it yourself - /Services/careproviders/LeaveReview/DefaultView.aspx?id=1-2622165866,0,0,,
NAS Community Services (East Anglia),1-2669733472,SCL,Willow House,40 St Andrews Street,,Mildenhall,Suffolk,IP28 7HB,Tel: 01638717661,No ratings yet Rate it yourself - /Services/careproviders/LeaveReview/DefaultView.aspx?id=1-2669733472,0,0,,
Mabbs Hall Care Home,1-119138865,SCL,45 High Street,,,Mildenhall,Suffolk,IP28 7EA,Tel: 01638712222,3 ratings Rate it yourself - /Services/careproviders/LeaveReview/DefaultView.aspx?id=1-119138865,,,,
The Red House Welfare & Housing Society,1-110186419,SCL,Meadow Lane,,,Sudbury,Suffolk,CO10 2TD,Tel: 01787372948,No ratings yet Rate it yourself - /Services/careproviders/LeaveReview/DefaultView.aspx?id=1-110186419,0,0,,
Laxfield House,1-1145700829,SCL,Cundys Lane,Brent Eleigh,,Sudbury,Suffolk,CO10 9PL,Tel: 01787247340,No ratings yet Rate it yourself - /Services/careproviders/LeaveReview/DefaultView.aspx?id=1-1145700829,0,0,,
Chilton Croft Nursing Home,1-138373825,SCL,Newton Road,,,Sudbury,Suffolk,CO10 2RN,Tel: 01787374146,No ratings yet Rate it yourself - /Services/careproviders/LeaveReview/DefaultView.aspx?id=1-138373825,0,0,,
Supporting An Independent Life,1-19025823882,SCL,Unit 14,"South Suffolk Business Centre, Alexandra Road",,Sudbury,,CO10 2ZX,Tel: 07961329802,No ratings yet Rate it yourself - /Services/careproviders/LeaveReview/DefaultView.aspx?id=1-19025823882,0,0,,
Trust Homecare Solution South Suffolk Limited,1-14526433151,SCL,Unit 13,"South Suffolk Business Centre, Alexandra Road",,Sudbury,,CO10 2ZX,Tel: 07846858595,No ratings yet Rate it yourself - /Services/careproviders/LeaveReview/DefaultView.aspx?id=1-14526433151,0,0,,
Forest Homecare Suffolk,1-1006660964,SCL,Unit 22 South Suffolk Business Centre,Alexandra Road,,Sudbury,Suffolk,CO10 2XH,Tel: 01787463222,No ratings yet Rate it yourself - /Services/careproviders/LeaveReview/DefaultView.aspx?id=1-1006660964,0,0,,
Crossways,1-134620976,SCL,North Terrace,,,Mildenhall,Suffolk,IP28 7AE,Tel: 01638515556,No ratings yet Rate it yourself - /Services/careproviders/LeaveReview/DefaultView.aspx?id=1-134620976,0,0,,
Mildenhall Lodge,1-1465022022,SCL,St Johns Close,,,Mildenhall,Suffolk,IP28 7NX,Tel: 01638582510,No ratings yet Rate it yourself - /Services/careproviders/LeaveReview/DefaultView.aspx?id=1-1465022022,0,0,,
Hillside Care Home,1-127865590,SCL,20 Kings Hill,Great Cornard,,Sudbury,Suffolk,CO10 0EH,Tel: 080 8223 5511,No ratings yet Rate it yourself - /Services/careproviders/LeaveReview/DefaultView.aspx?id=1-127865590,0,0,,
Mellish House Residential Home,1-127865573,SCL,20a Kings Hill,Great Cornard,,Sudbury,Suffolk,CO10 0EH,Tel: 080 8223 5523,No ratings yet Rate it yourself - /Services/careproviders/LeaveReview/DefaultView.aspx?id=1-127865573,0,0,,
Fara Healthcare Ltd,1-15152271663,SCL,"39 Bohemia Place, Bassingbourn Fields",Fordham,,Ely,,CB7 5XJ,Tel: 07481819648,No ratings yet Rate it yourself - /Services/careproviders/LeaveReview/DefaultView.aspx?id=1-15152271663,0,0,,
Calm 365 Healthcare Ltd,1-15061985374,SCL,80 Folly Road,Mildenhall,,Bury St. Edmunds,,IP28 7BX,,No ratings yet Rate it yourself - /Services/careproviders/LeaveReview/DefaultView.aspx?id=1-15061985374,0,0,,
Voyage (DCA) Cambridge City,1-2964480039,SCL,2 Fordham House Court,"Newmarket Road, Fordham",,Ely,,CB7 5LL,Tel: 01638721723,No ratings yet Rate it yourself - /Services/careproviders/LeaveReview/DefaultView.aspx?id=1-2964480039,0,0,,
ivolve Suffolk Supported Living,1-15521798386,SCL,"Peter Dodd Mews, Shawlands Avenue",Great Cornard,,Sudbury,,CO10 0FY,Tel: 07495398447,No ratings yet Rate it yourself - /Services/careproviders/LeaveReview/DefaultView.aspx?id=1-15521798386,0,0,,