Organisation Name,NACS Code,Organisation Type,Address1,Address2,Address3,Address4,Address5,PostCode,Telephone Number,NHS.UK users rating,Value  (NHS.UK users rating),Banding Classification  (NHS.UK users rating),Car parking (Is there car parking at this organisation?),Disabled access (Disabled access)
Oxlip House,1-261437952,SCL,Airfield Road,,,Bury St Edmunds,Suffolk,IP32 7RH,Tel: 01284764864,No ratings yet Rate it yourself - /Services/careproviders/LeaveReview/DefaultView.aspx?id=1-261437952,0,0,,
Hilltop House (Domiciliary Care),1-1492095485,SCL,2 Heldhaw Road,,,Bury St Edmunds,Suffolk,IP32 7ER,Tel: 01284724979,No ratings yet Rate it yourself - /Services/careproviders/LeaveReview/DefaultView.aspx?id=1-1492095485,0,0,,
Mencap - West Suffolk Domiciliary Care Agency,1-3617655390,SCL,West Suffolk Disability Resource Centre,4 Bunting Road,,Bury St Edmunds,Suffolk,IP32 7BX,Tel: 01284748874,No ratings yet Rate it yourself - /Services/careproviders/LeaveReview/DefaultView.aspx?id=1-3617655390,0,0,,
Lots of Care Ltd,1-14484721645,SCL,15 Sebert Road,,,Bury St. Edmunds,,IP32 7EB,,No ratings yet Rate it yourself - /Services/careproviders/LeaveReview/DefaultView.aspx?id=1-14484721645,0,0,,
Montana Care Home Grace and Compassion Benedictines,1-118089078,SCL,East Barton Road,Great Barton,,Bury St Edmunds,Suffolk,IP31 2RF,Tel: 01284 787321,1 rating Rate it yourself - /Services/careproviders/LeaveReview/DefaultView.aspx?id=1-118089078,,,,
Support to Live at Home West,1-385503428,SCL,Bury Resource Centre,Hollow Road,,Bury St Edmunds,Suffolk,IP32 7AY,Tel: 01284718741,No ratings yet Rate it yourself - /Services/careproviders/LeaveReview/DefaultView.aspx?id=1-385503428,0,0,,
SuffolkHomeCare,1-151257173,SCL,11 Brunel Business Court,Eastern Way,,Bury St Edmunds,Suffolk,IP32 7AB,Tel: 01284702002,No ratings yet Rate it yourself - /Services/careproviders/LeaveReview/DefaultView.aspx?id=1-151257173,0,0,,
FitzRoy Supported Living Suffolk,1-2679829948,SCL,"Unit 18, The Vision Centre",Eastern Way,,Bury St. Edmunds,,IP32 7AB,Tel: 07896891174,No ratings yet Rate it yourself - /Services/careproviders/LeaveReview/DefaultView.aspx?id=1-2679829948,0,0,,
Davers Court,1-1586577058,SCL,Shaker's Lane,,,Bury St Edmunds,Suffolk,IP32 7BN,Tel: 03333211982,No ratings yet Rate it yourself - /Services/careproviders/LeaveReview/DefaultView.aspx?id=1-1586577058,0,0,,
Cathedral View,1-385482818,SCL,The Vinefields,,,Bury St Edmunds,Suffolk,IP33 1YU,Tel: 01284765046,No ratings yet Rate it yourself - /Services/careproviders/LeaveReview/DefaultView.aspx?id=1-385482818,0,0,,
The Martins,1-117977429,SCL,Vinefields,,,Bury St Edmunds,Suffolk,IP33 1YA,Tel: 01284753467,No ratings yet Rate it yourself - /Services/careproviders/LeaveReview/DefaultView.aspx?id=1-117977429,0,0,,
Yourlife (Bury),1-2679793374,SCL,Cross Penny Court,Cotton Lane,,Bury St Edmunds,Suffolk,IP33 1XY,Tel: 01284760489,No ratings yet Rate it yourself - /Services/careproviders/LeaveReview/DefaultView.aspx?id=1-2679793374,0,0,,
North Court Care Home,1-18296156434,SCL,108 Northgate Street,,,Bury St. Edmunds,,IP33 1HS,Tel: 01284763621,No ratings yet Rate it yourself - /Services/careproviders/LeaveReview/DefaultView.aspx?id=1-18296156434,0,0,,
Manson House,1-13319120539,SCL,Northgate Street,,,Bury St. Edmunds,,IP33 1HP,Tel: 01284753106,No ratings yet Rate it yourself - /Services/careproviders/LeaveReview/DefaultView.aspx?id=1-13319120539,0,0,,
Hartewell Homecare,1-18028335658,SCL,11 Manners Road,Fornham St. Martin,,Bury St. Edmunds,,IP31 1TE,Tel: 01284636681,No ratings yet Rate it yourself - /Services/careproviders/LeaveReview/DefaultView.aspx?id=1-18028335658,0,0,,
PnS Domiciliary Services,1-5446781338,SCL,9 Guildhall Street,,,Bury St. Edmunds,,IP33 1PR,Tel: 01284724223,No ratings yet Rate it yourself - /Services/careproviders/LeaveReview/DefaultView.aspx?id=1-5446781338,0,0,,
Assured Optimal Care - Main Office,1-17428509005,SCL,"Office B, 2nd Floor",9 Guildhall Street,,Bury St. Edmunds,,IP33 1PR,Tel: 07507986286,No ratings yet Rate it yourself - /Services/careproviders/LeaveReview/DefaultView.aspx?id=1-17428509005,0,0,,
Availl (Bury St Edmunds),1-6782894325,SCL,85A Guildhall Street,,,Bury St. Edmunds,,IP33 1PR,Tel: 01284630575,1 rating Rate it yourself - /Services/careproviders/LeaveReview/DefaultView.aspx?id=1-6782894325,,,,
St Edmunds Care,1-6193818659,SCL,"Risbygate Suite, Ask House",2 Northgate Avenue,,Bury St. Edmunds,,IP32 6BB,Tel: 01284336222,No ratings yet Rate it yourself - /Services/careproviders/LeaveReview/DefaultView.aspx?id=1-6193818659,0,0,,
SylvianCare Bury St Edmunds,1-15659339552,SCL,"Active Business Centre, St. Andrews Castle",33 St. Andrews Street South,,Bury St. Edmunds,,IP33 3PH,Tel: 01284365588,No ratings yet Rate it yourself - /Services/careproviders/LeaveReview/DefaultView.aspx?id=1-15659339552,0,0,,
Home Instead Bury St Edmunds,1-12958090508,SCL,Unit 3,"Old Wool Warehouse, St. Andrews Street South",,Bury St. Edmunds,,IP33 3PH,Tel: 01284658100,No ratings yet Rate it yourself - /Services/careproviders/LeaveReview/DefaultView.aspx?id=1-12958090508,0,0,,
Multi-Care Community Services Suffolk Ltd,1-18536358161,SCL,8b Old Bakery,St. Andrews Street South,,Bury St. Edmunds,,IP33 3PH,Tel: 01284247042,No ratings yet Rate it yourself - /Services/careproviders/LeaveReview/DefaultView.aspx?id=1-18536358161,0,0,,
Helping Hands Bury St Edmunds,1-9005783097,SCL,4 Kings Mews,Kings Road,,Bury St. Edmunds,,IP33 3DE,Tel: 01284334049,1 rating Rate it yourself - /Services/careproviders/LeaveReview/DefaultView.aspx?id=1-9005783097,,,,
Radis Community Care (Cullum Road),1-5764989165,SCL,11 Cullum Road,,,Bury St. Edmunds,,IP33 3PB,Tel: 01284750990,No ratings yet Rate it yourself - /Services/careproviders/LeaveReview/DefaultView.aspx?id=1-5764989165,0,0,,
Fonjock's Social Work Practice Limited,1-2110782795,SCL,Orchard House,1 Old Convent Orchard,,Bury St Edmunds,Suffolk,IP33 3PQ,Tel: 01284764411,No ratings yet Rate it yourself - /Services/careproviders/LeaveReview/DefaultView.aspx?id=1-2110782795,0,0,,
Fornham House Residential Home,1-121919754,SCL,Fornham St Martin,,,Bury St Edmunds,Suffolk,IP31 1SR,Tel: 01284768327,1 rating Rate it yourself - /Services/careproviders/LeaveReview/DefaultView.aspx?id=1-121919754,,,,
Cornwallis Court,1-2508473270,SCL,Hospital Road,,,Bury St Edmunds,Suffolk,IP33 3NH,Tel: 01284768028,No ratings yet Rate it yourself - /Services/careproviders/LeaveReview/DefaultView.aspx?id=1-2508473270,0,0,,
Royal Mencap Society - Drummond Court,1-310333551,SCL,Mill Road South,,,Bury St Edmunds,Suffolk,IP33 3NN,Tel: 01284767445,No ratings yet Rate it yourself - /Services/careproviders/LeaveReview/DefaultView.aspx?id=1-310333551,0,0,,
St Peter's House,1-9976760806,SCL,29 Out Risbygate,,,Bury St. Edmunds,,IP33 3RJ,Tel: 01284706603,No ratings yet Rate it yourself - /Services/careproviders/LeaveReview/DefaultView.aspx?id=1-9976760806,0,0,,
The Pines,1-306059636,SCL,Culford Road,,,Fornham St Mary,Suffolk,IP28 6TN,Tel: 01284705062,No ratings yet Rate it yourself - /Services/careproviders/LeaveReview/DefaultView.aspx?id=1-306059636,0,0,,
Berkeley Home Health - East of England,1-4349166701,SCL,"The Lilly Suite, Nowton Court Village",Nowton Road,,Bury St. Edmunds,,IP29 5LU,Tel: 01284756516,No ratings yet Rate it yourself - /Services/careproviders/LeaveReview/DefaultView.aspx?id=1-4349166701,0,0,,
The Grange Residential Home,1-106351203,SCL,The Grange,30 Vinery Road,,Bury St Edmunds,Suffolk,IP33 2JT,Tel: 01284769887,No ratings yet Rate it yourself - /Services/careproviders/LeaveReview/DefaultView.aspx?id=1-106351203,0,0,,
Bury Home Care,1-145680661,SCL,West Suffolk House,Western Way,,Bury St Edmunds,Suffolk,IP33 3YU,Tel: 01284758561,No ratings yet Rate it yourself - /Services/careproviders/LeaveReview/DefaultView.aspx?id=1-145680661,0,0,,
Marham House Care Home,1-13694078242,SCL,Simcoe Road,,,Bury St. Edmunds,,IP32 6FD,Tel: 01284335964,No ratings yet Rate it yourself - /Services/careproviders/LeaveReview/DefaultView.aspx?id=1-13694078242,0,0,,
PentaCare (Bury St Edmunds),1-15183517217,SCL,"Unit GF2, Eagle House",Great Whelnetham,,Bury St. Edmunds,,IP30 0UN,Tel: 01284336136,No ratings yet Rate it yourself - /Services/careproviders/LeaveReview/DefaultView.aspx?id=1-15183517217,0,0,,
Glastonbury Court,1-2397838058,SCL,Glastonbury Road,,,Bury St Edmunds,Suffolk,IP33 2EX,Tel: 03333211989,No ratings yet Rate it yourself - /Services/careproviders/LeaveReview/DefaultView.aspx?id=1-2397838058,0,0,,
Cedar Lodge,1-4922344749,SCL,Culford,,,Bury St. Edmunds,,IP28 6DX,Tel: 01284728744,No ratings yet Rate it yourself - /Services/careproviders/LeaveReview/DefaultView.aspx?id=1-4922344749,0,0,,
Lifetree Homecare Ltd,1-11939209142,SCL,"Unit 9, Woodside Business Park","Thetford Road, Ingham",,Bury St. Edmunds,,IP31 1NR,Tel: 01284330379,No ratings yet Rate it yourself - /Services/careproviders/LeaveReview/DefaultView.aspx?id=1-11939209142,0,0,,
The Beeches Residential Home,1-125108366,SCL,39-43 High Street,Ixworth,,Bury St Edmunds,Suffolk,IP31 2HJ,Tel: 01359230773,No ratings yet Rate it yourself - /Services/careproviders/LeaveReview/DefaultView.aspx?id=1-125108366,0,0,,
Anglia Case Management Limited,1-114103976,SCL,Ticehurst Yard,Beyton Road Tostock,,Bury St Edmunds,Suffolk,IP30 9PH,Tel: 01359271900,No ratings yet Rate it yourself - /Services/careproviders/LeaveReview/DefaultView.aspx?id=1-114103976,0,0,,
Blackbourne View,1-220311536,SCL,Thetford Road,Ixworth,,Bury St Edmunds,Suffolk,IP31 2HD,,No ratings yet Rate it yourself - /Services/careproviders/LeaveReview/DefaultView.aspx?id=1-220311536,0,0,,
Stowlangtoft Hall Nursing Home,1-4335875876,SCL,Kiln Lane,Stowlangtoft,,Bury St Edmunds,Suffolk,IP31 3JY,Tel: 01359230216,No ratings yet Rate it yourself - /Services/careproviders/LeaveReview/DefaultView.aspx?id=1-4335875876,0,0,,
Risby Hall Nursing Home,1-121065975,SCL,Hall Lane,Risby,,Bury St Edmunds,Suffolk,IP28 6RS,,No ratings yet Rate it yourself - /Services/careproviders/LeaveReview/DefaultView.aspx?id=1-121065975,0,0,,
Risby Park Nursing Home,1-121065992,SCL,Hall Lane,Risby,,Bury St Edmunds,Suffolk,IP28 6RS,,No ratings yet Rate it yourself - /Services/careproviders/LeaveReview/DefaultView.aspx?id=1-121065992,0,0,,
Kirsten's Care Ltd,1-7268875105,SCL,"Unit 1, Brickfields Business Park","Old Stowmarket Road, Woolpit",,Bury St. Edmunds,,IP30 9QS,Tel: 07769201895,No ratings yet Rate it yourself - /Services/careproviders/LeaveReview/DefaultView.aspx?id=1-7268875105,0,0,,
The Willows,1-107340693,SCL,Corders Farm,"Bury Road, Lawshall",,Bury St Edmunds,Suffolk,IP29 4PJ,Tel: 01284830665,No ratings yet Rate it yourself - /Services/careproviders/LeaveReview/DefaultView.aspx?id=1-107340693,0,0,,
Ashmore Nursing Home,1-106383494,SCL,Barningham Road,Stanton,,Bury St Edmunds,Suffolk,IP31 2AD,Tel: 01359251681,No ratings yet Rate it yourself - /Services/careproviders/LeaveReview/DefaultView.aspx?id=1-106383494,0,0,,
Housing 21 - Mere View,1-125498357,SCL,Thompson Close,Haughley,,Stowmarket,Suffolk,IP14 3GQ,Tel: 03701924081,No ratings yet Rate it yourself - /Services/careproviders/LeaveReview/DefaultView.aspx?id=1-125498357,0,0,,
Finborough Court,1-3160660523,SCL,Pilgrims Way,Great Finborough,,Stowmarket,Suffolk,IP14 3AY,Tel: 03003031450,No ratings yet Rate it yourself - /Services/careproviders/LeaveReview/DefaultView.aspx?id=1-3160660523,0,0,,
WEAREFAMILY CARE LTD,1-14764402535,SCL,70 Fuller Way,,,Stowmarket,,IP14 1XJ,Tel: 07730229036,No ratings yet Rate it yourself - /Services/careproviders/LeaveReview/DefaultView.aspx?id=1-14764402535,0,0,,
Chilton Meadows Care Home,1-127503468,SCL,Union Road,Onehouse,,Stowmarket,Suffolk,IP14 1HL,Tel: 01449770321,2 ratings Rate it yourself - /Services/careproviders/LeaveReview/DefaultView.aspx?id=1-127503468,,,,
Chilton Court,1-129786645,SCL,Gainsborough Road,,,Stowmarket,,IP14 1LL,Tel: 01449675320,No ratings yet Rate it yourself - /Services/careproviders/LeaveReview/DefaultView.aspx?id=1-129786645,0,0,,
Laburnum Grove Housing with Care Scheme,1-285231364,SCL,Managers Office,Laburnum Grove,,Thetford,,IP24 3HS,Tel: 01842753185,No ratings yet Rate it yourself - /Services/careproviders/LeaveReview/DefaultView.aspx?id=1-285231364,0,0,,
Royal Mencap Society - Woodlands Residential Home,1-310333652,SCL,51a Elm Road,,,Thetford,,IP24 3HL,Tel: 01842762086,No ratings yet Rate it yourself - /Services/careproviders/LeaveReview/DefaultView.aspx?id=1-310333652,0,0,,
Westhorpe Hall,1-459324998,SCL,The Street,Westhorpe,,Stowmarket,Suffolk,IP14 4SS,Tel: 01449781691,No ratings yet Rate it yourself - /Services/careproviders/LeaveReview/DefaultView.aspx?id=1-459324998,0,0,,
Short Break Respite Unit,1-385482724,SCL,7A Finborough Road,,,Stowmarket,Suffolk,IP14 1PN,,No ratings yet Rate it yourself - /Services/careproviders/LeaveReview/DefaultView.aspx?id=1-385482724,0,0,,
Hillcroft House,1-121919792,SCL,Finborough Road,,,Stowmarket,Suffolk,IP14 1PW,Tel: 01449774633,No ratings yet Rate it yourself - /Services/careproviders/LeaveReview/DefaultView.aspx?id=1-121919792,0,0,,
Support to Live at Home Central,1-385503493,SCL,Stowmarket Community Hub,Crown Street,,Stowmarket,Suffolk,IP14 1HY,Tel: 01449745970,No ratings yet Rate it yourself - /Services/careproviders/LeaveReview/DefaultView.aspx?id=1-385503493,0,0,,
Ford Place Nursing Home,1-4335875944,SCL,Ford Street,,,Thetford,Norfolk,IP24 2EP,Tel: 01842755002,No ratings yet Rate it yourself - /Services/careproviders/LeaveReview/DefaultView.aspx?id=1-4335875944,0,0,,
Walfinch West Suffolk,1-10476285035,SCL,"Suite 1, Capitol House",18 Bury Street,,Stowmarket,,IP14 1HH,Tel: 01284834483,No ratings yet Rate it yourself - /Services/careproviders/LeaveReview/DefaultView.aspx?id=1-10476285035,0,0,,
Our Family Home Care,1-9591214668,SCL,"Suite G2, Stevens House",17 Station Road West,,Stowmarket,,IP14 1EF,Tel: 01449541724,No ratings yet Rate it yourself - /Services/careproviders/LeaveReview/DefaultView.aspx?id=1-9591214668,0,0,,
Quality Care Homegivers Limited,1-837299761,SCL,2A Station Road West,,,Stowmarket,Suffolk,IP14 1EF,Tel: 01449780480,No ratings yet Rate it yourself - /Services/careproviders/LeaveReview/DefaultView.aspx?id=1-837299761,0,0,,
Alexander Court,1-307272706,SCL,Raymond Street,,,Thetford,Norfolk,IP24 2EA,Tel: 01842753466,No ratings yet Rate it yourself - /Services/careproviders/LeaveReview/DefaultView.aspx?id=1-307272706,0,0,,
Woodfield Court,1-129786661,SCL,21 Temple Road,,,Stowmarket,Suffolk,IP14 1AT,Tel: 01449675426,No ratings yet Rate it yourself - /Services/careproviders/LeaveReview/DefaultView.aspx?id=1-129786661,0,0,,
Langham Manor,1-16435928949,SCL,Langham Care Home,Prentice Road,,Stowmarket,,IP14 1RD,Tel: 01449357087,No ratings yet Rate it yourself - /Services/careproviders/LeaveReview/DefaultView.aspx?id=1-16435928949,0,0,,
Ocala Healthcare,1-5295524666,SCL,"Unit 9, Wharfside House",Prentice Road,,Stowmarket,,IP14 1RD,Tel: 01473378100,No ratings yet Rate it yourself - /Services/careproviders/LeaveReview/DefaultView.aspx?id=1-5295524666,0,0,,
Combs Court,1-350380723,SCL,Edgecomb Road,,,Stowmarket,Suffolk,IP14 2DN,Tel: 01449673006,No ratings yet Rate it yourself - /Services/careproviders/LeaveReview/DefaultView.aspx?id=1-350380723,0,0,,
Royal Mencap Society - Norfolk Domiciliary Care Agency,1-9671656845,SCL,53 Castle Street,,,Thetford,Norfolk,IP24 2DL,Tel: 01842766444,No ratings yet Rate it yourself - /Services/careproviders/LeaveReview/DefaultView.aspx?id=1-9671656845,0,0,,
Royal Mencap Society - North Suffolk and Coastal Domiciliary Care Agency,1-9671657163,SCL,53A Castle Street,,,Thetford,,IP24 2DL,Tel: 01842766444,No ratings yet Rate it yourself - /Services/careproviders/LeaveReview/DefaultView.aspx?id=1-9671657163,0,0,,
Royal Mencap Society - 22 Lamberts (Daisy),1-9965724874,SCL,22 Lamberts,,,Thetford,,IP24 2EE,Tel: 01842755885,No ratings yet Rate it yourself - /Services/careproviders/LeaveReview/DefaultView.aspx?id=1-9965724874,0,0,,
Royal Mencap Society - 6 Lamberts (Foxglove),1-9965724805,SCL,6 Lamberts,,,Thetford,,IP24 2EE,Tel: 01842766156,No ratings yet Rate it yourself - /Services/careproviders/LeaveReview/DefaultView.aspx?id=1-9965724805,0,0,,
Redgate House Residential Home,1-3863281367,SCL,Green Lane,,,Thetford,Norfolk,IP24 2EZ,Tel: 01842800400,No ratings yet Rate it yourself - /Services/careproviders/LeaveReview/DefaultView.aspx?id=1-3863281367,0,0,,
My Care at Home Limited,1-2084317263,SCL,117 Ipswich Street,,,Stowmarket,Suffolk,IP14 1BB,Tel: 01449763086,No ratings yet Rate it yourself - /Services/careproviders/LeaveReview/DefaultView.aspx?id=1-2084317263,0,0,,
The Larches,1-10170537209,SCL,Woodfield Drive,,,Stowmarket,,IP14 1BJ,Tel: 01449535003,No ratings yet Rate it yourself - /Services/careproviders/LeaveReview/DefaultView.aspx?id=1-10170537209,0,0,,
Laxfield House,1-1145700829,SCL,Cundys Lane,Brent Eleigh,,Sudbury,Suffolk,CO10 9PL,Tel: 01787247340,No ratings yet Rate it yourself - /Services/careproviders/LeaveReview/DefaultView.aspx?id=1-1145700829,0,0,,
The Briars Residential Care Home,1-877271524,SCL,23 Hunts Hill,Glemsford,,Sudbury,Suffolk,CO10 7RP,Tel: 01787282249,No ratings yet Rate it yourself - /Services/careproviders/LeaveReview/DefaultView.aspx?id=1-877271524,0,0,,
Harmony Homecare Suffolk,1-9856693805,SCL,"Office 4c, Rosemary House","Lanwades Business Park, Kennett",,Newmarket,,CB8 7PN,Tel: 01284663006,No ratings yet Rate it yourself - /Services/careproviders/LeaveReview/DefaultView.aspx?id=1-9856693805,0,0,,
Visionshealthcare Ltd,1-4616674851,SCL,4E Rosemary House,"Lanwades Business Park, Kennett",,Newmarket,,CB8 7PN,Tel: 01223426011,No ratings yet Rate it yourself - /Services/careproviders/LeaveReview/DefaultView.aspx?id=1-4616674851,0,0,,
Kentford Manor,1-11457259392,SCL,Jeddah Way,Kennett,,Newmarket,Suffolk,CB8 8JY,Tel: 01638555090,No ratings yet Rate it yourself - /Services/careproviders/LeaveReview/DefaultView.aspx?id=1-11457259392,0,0,,
Kentford Manor,1-5315177207,SCL,Jeddah Way,Kennett,,Newmarket,Suffolk,CB8 8JY,Tel: 01638555090,No ratings yet Rate it yourself - /Services/careproviders/LeaveReview/DefaultView.aspx?id=1-5315177207,0,0,,
Utopia Care Limited,1-14422006973,SCL,Keystone Innovation Centre,Croxton Road,,Thetford,Norfolk,IP24 1JD,Tel: 01603319430,No ratings yet Rate it yourself - /Services/careproviders/LeaveReview/DefaultView.aspx?id=1-14422006973,0,0,,
Premier Homecare,1-125571979,SCL,Keystone Innovation Centre,Croxton Road,,Thetford,Norfolk,IP24 1JD,Tel: 01842824415,No ratings yet Rate it yourself - /Services/careproviders/LeaveReview/DefaultView.aspx?id=1-125571979,0,0,,
Cedrus House,1-1966400806,SCL,Creeting Road East,,,Stowmarket,Suffolk,IP14 5GD,Tel: 03333211987,No ratings yet Rate it yourself - /Services/careproviders/LeaveReview/DefaultView.aspx?id=1-1966400806,0,0,,
Steeple View,1-220311591,SCL,Reeds Way,Stowupland,,Stowmarket,Suffolk,IP14 4BW,,No ratings yet Rate it yourself - /Services/careproviders/LeaveReview/DefaultView.aspx?id=1-220311591,0,0,,
Red House Residential Home,1-1964540001,SCL,Norwich Road,Kilverstone,,Thetford,Norfolk,IP24 2RF,Tel: 01842753122,No ratings yet Rate it yourself - /Services/careproviders/LeaveReview/DefaultView.aspx?id=1-1964540001,0,0,,
Warren Homecare Ltd,1-12446560904,SCL,26 Marigold Drive,Red Lodge,,Bury St. Edmunds,,IP28 8TL,,No ratings yet Rate it yourself - /Services/careproviders/LeaveReview/DefaultView.aspx?id=1-12446560904,0,0,,
Briarcare Recruitment Agency,1-4624516852,SCL,Unit 3,"Woodview, Bull Lane Industrial Estate, Bull Lane, Acton",,Sudbury,Suffolk,CO10 0FD,Tel: 01787881185,No ratings yet Rate it yourself - /Services/careproviders/LeaveReview/DefaultView.aspx?id=1-4624516852,0,0,,
1 Oak Home Care,1-3857492640,SCL,Unit 1 & 2 Woodview,"Bull Lane Industrial Estate, Bull Lane, Acton",,Sudbury,,CO10 0FD,Tel: 01787326555,No ratings yet Rate it yourself - /Services/careproviders/LeaveReview/DefaultView.aspx?id=1-3857492640,0,0,,
Harmonize Care,1-3087260524,SCL,The Old Pharmacy,"Hall Street, Long Melford",,Sudbury,,CO10 9JQ,Tel: 07539348263,2 ratings Rate it yourself - /Services/careproviders/LeaveReview/DefaultView.aspx?id=1-3087260524,,,,
NAS Community Services (East Anglia),1-2669733472,SCL,Willow House,40 St Andrews Street,,Mildenhall,Suffolk,IP28 7HB,Tel: 01638717661,No ratings yet Rate it yourself - /Services/careproviders/LeaveReview/DefaultView.aspx?id=1-2669733472,0,0,,
Mildenhall Lodge,1-1465022022,SCL,St Johns Close,,,Mildenhall,Suffolk,IP28 7NX,Tel: 01638582510,No ratings yet Rate it yourself - /Services/careproviders/LeaveReview/DefaultView.aspx?id=1-1465022022,0,0,,
Mabbs Hall Care Home,1-119138865,SCL,45 High Street,,,Mildenhall,Suffolk,IP28 7EA,Tel: 01638712222,3 ratings Rate it yourself - /Services/careproviders/LeaveReview/DefaultView.aspx?id=1-119138865,,,,
Melford Court Care Home,1-4335876242,SCL,Hall Street,Long Melford,,Sudbury,Suffolk,CO10 9JA,Tel: 01787880545,No ratings yet Rate it yourself - /Services/careproviders/LeaveReview/DefaultView.aspx?id=1-4335876242,0,0,,
Crossways,1-134620976,SCL,North Terrace,,,Mildenhall,Suffolk,IP28 7AE,Tel: 01638515556,No ratings yet Rate it yourself - /Services/careproviders/LeaveReview/DefaultView.aspx?id=1-134620976,0,0,,
Devonshire House,1-3306736227,SCL,High Street,Cavendish,,Sudbury,Suffolk,CO10 8AS,Tel: 01787283240,No ratings yet Rate it yourself - /Services/careproviders/LeaveReview/DefaultView.aspx?id=1-3306736227,0,0,,
Calm 365 Healthcare Ltd,1-15061985374,SCL,80 Folly Road,Mildenhall,,Bury St. Edmunds,,IP28 7BX,,No ratings yet Rate it yourself - /Services/careproviders/LeaveReview/DefaultView.aspx?id=1-15061985374,0,0,,
"Bluebird Care, Newmarket and Fenland",1-1041108285,SCL,Technologies House,26 Hampstead Avenue,,Mildenhall,Suffolk,IP28 7AS,Tel: 01638718855,12 ratings Rate it yourself - /Services/careproviders/LeaveReview/DefaultView.aspx?id=1-1041108285,,,,
Arukah Health Ltd,1-18785682091,SCL,"Unit 82a, James Carter Road",Mildenhall,,Bury St. Edmunds,,IP28 7DE,Tel: 07956004078,No ratings yet Rate it yourself - /Services/careproviders/LeaveReview/DefaultView.aspx?id=1-18785682091,0,0,,
Barleycombe,1-2989956028,SCL,Sudbury Road,Long Melford,,Sudbury,Suffolk,CO10 9HE,Tel: 01787880203,No ratings yet Rate it yourself - /Services/careproviders/LeaveReview/DefaultView.aspx?id=1-2989956028,0,0,,
Brandon Park Residential and Nursing Home,1-4335876213,SCL,Brandon Country Park,,,Brandon,Suffolk,IP27 0SU,Tel: 01842812400,1 rating Rate it yourself - /Services/careproviders/LeaveReview/DefaultView.aspx?id=1-4335876213,,,,
Barking Hall Nursing Home,1-121919678,SCL,Barking,,,Needham Market,Suffolk,IP6 8HJ,Tel: 01449720793,No ratings yet Rate it yourself - /Services/careproviders/LeaveReview/DefaultView.aspx?id=1-121919678,0,0,,
Care Consult ID,1-14143552383,SCL,15 Meadow Lane,,,Newmarket,,CB8 8FZ,,No ratings yet Rate it yourself - /Services/careproviders/LeaveReview/DefaultView.aspx?id=1-14143552383,0,0,,
Uvedale Hall Residential Home,1-121919939,SCL,Coddenham Road,Needham Market,,Ipswich,Suffolk,IP6 8AX,Tel: 01449722250,1 rating Rate it yourself - /Services/careproviders/LeaveReview/DefaultView.aspx?id=1-121919939,,,,
The Limes Retirement Home,1-450269840,SCL,Earlsford Road,Mellis,,Eye,Suffolk,IP23 8DY,Tel: 01379788114,No ratings yet Rate it yourself - /Services/careproviders/LeaveReview/DefaultView.aspx?id=1-450269840,0,0,,
Radis Community Care (Heathcote House),1-5764989535,SCL,Warren Close,,,Brandon,,IP27 0EE,Tel: 01842815889,No ratings yet Rate it yourself - /Services/careproviders/LeaveReview/DefaultView.aspx?id=1-5764989535,0,0,,
Girling Street,1-136882841,SCL,34 Girling Street,,,Sudbury,Suffolk,CO10 1PG,Tel: 01787882082,No ratings yet Rate it yourself - /Services/careproviders/LeaveReview/DefaultView.aspx?id=1-136882841,0,0,,
St Faith's Villa,1-490382352,SCL,90 Queens Road,,,Sudbury,Suffolk,CO10 1PG,Tel: 01787370036,No ratings yet Rate it yourself - /Services/careproviders/LeaveReview/DefaultView.aspx?id=1-490382352,0,0,,