Organisation Name,NACS Code,Organisation Type,Address1,Address2,Address3,Address4,Address5,PostCode,Telephone Number,NHS.UK users rating,Value  (NHS.UK users rating),Banding Classification  (NHS.UK users rating),Car parking (Is there car parking at this organisation?),Disabled access (Disabled access)
Creative Support - Dove Lane,1-6804740821,SCL,7 Dove Lane,Harrold,,Bedford,,MK43 7DF,Tel: 01612360829,No ratings yet Rate it yourself - /Services/careproviders/LeaveReview/DefaultView.aspx?id=1-6804740821,0,0,,
The Office,1-5764458707,SCL,6 Horsefair Lane,Odell,,Bedford,,MK43 7AU,Tel: 01234720098,No ratings yet Rate it yourself - /Services/careproviders/LeaveReview/DefaultView.aspx?id=1-5764458707,0,0,,
Sharnbrook House,1-121567262,SCL,High Street,,,Sharnbrook,Bedfordshire,MK44 1PB,Tel: 01234781294,No ratings yet Rate it yourself - /Services/careproviders/LeaveReview/DefaultView.aspx?id=1-121567262,0,0,,
Creative Support - The Glade,1-6803582072,SCL,3 The Glade,Bromham,,Bedford,,MK43 8HJ,Tel: 01612360829,No ratings yet Rate it yourself - /Services/careproviders/LeaveReview/DefaultView.aspx?id=1-6803582072,0,0,,
Creative Support - High Street,1-6803582170,SCL,4 High Street,Oakley,,Bedford,,MK43 7RG,Tel: 01612360829,No ratings yet Rate it yourself - /Services/careproviders/LeaveReview/DefaultView.aspx?id=1-6803582170,0,0,,
Partridge Support Services,1-14621206222,SCL,7 Fullwell Road,Bozeat,,Wellingborough,,NN29 7LX,Tel: 07557682252,No ratings yet Rate it yourself - /Services/careproviders/LeaveReview/DefaultView.aspx?id=1-14621206222,0,0,,
Liloom Home Care Limited,1-16937997915,SCL,Howbrook Farm,"Wick End, Stagsden",,Bedford,,MK43 8TS,,No ratings yet Rate it yourself - /Services/careproviders/LeaveReview/DefaultView.aspx?id=1-16937997915,0,0,,
Milton Ernest Hall Care Home,1-129421645,SCL,Milton Ernest,,,Bedford,Bedfordshire,MK44 1RJ,Tel: 01234825305,No ratings yet Rate it yourself - /Services/careproviders/LeaveReview/DefaultView.aspx?id=1-129421645,0,0,,
The Leys,1-523519025,SCL,Park Lane,Sharnbrook,,Bedford,Bedfordshire,MK44 1LX,Tel: 01234781982,No ratings yet Rate it yourself - /Services/careproviders/LeaveReview/DefaultView.aspx?id=1-523519025,0,0,,
Bromham House,1-10023785774,SCL,58 Stagsden Road,Bromham,,Bedford,,MK43 8PT,Tel: 01525873265,No ratings yet Rate it yourself - /Services/careproviders/LeaveReview/DefaultView.aspx?id=1-10023785774,0,0,,
Oakfield (Easton Maudit) Limited,1-121881478,SCL,Easton Maudit,,,Wellingborough,Northamptonshire,NN29 7NR,Tel: 01933664222,No ratings yet Rate it yourself - /Services/careproviders/LeaveReview/DefaultView.aspx?id=1-121881478,0,0,,
Yourlife (Olney),1-18862953686,SCL,Penny House,1 Teedon Lane,,Olney,,MK46 4FS,Tel: 02030388576,No ratings yet Rate it yourself - /Services/careproviders/LeaveReview/DefaultView.aspx?id=1-18862953686,0,0,,
Albert House,1-124681892,SCL,167 High Street,Clapham,,Bedford,Bedfordshire,MK41 6AH,Tel: 01234346689,No ratings yet Rate it yourself - /Services/careproviders/LeaveReview/DefaultView.aspx?id=1-124681892,0,0,,
Broomfield Residential Care,1-384067147,SCL,,Broomfield Residential Care,,Olney,Buckinghamshire,MK46 5DX,Tel: 01234 711 619,No ratings yet Rate it yourself - /Services/careproviders/LeaveReview/DefaultView.aspx?id=1-384067147,0,0,,
Muir Care Ltd,1-18443682395,SCL,"Room 7, The Business Centre",Berrells Court,,Olney,,MK46 4AR,Tel: 07513017148,No ratings yet Rate it yourself - /Services/careproviders/LeaveReview/DefaultView.aspx?id=1-18443682395,0,0,,
Olney Care Services Limited,1-1556225340,SCL,23A Market Place,,,Olney,Buckinghamshire,MK46 4BA,Tel: 01234241655,No ratings yet Rate it yourself - /Services/careproviders/LeaveReview/DefaultView.aspx?id=1-1556225340,0,0,,
Gemini Exclusive Care,1-6193620360,SCL,7 Strixton Manor Business Centre,Strixton,,Wellingborough,,NN29 7PA,Tel: 01933234938,No ratings yet Rate it yourself - /Services/careproviders/LeaveReview/DefaultView.aspx?id=1-6193620360,0,0,,
Alderwood L.L.A. Limited - The Chestnuts,1-2320790510,SCL,296 Bedford Road,,,Rushden,Northamptonshire,NN10 0SE,Tel: 01933353244,No ratings yet Rate it yourself - /Services/careproviders/LeaveReview/DefaultView.aspx?id=1-2320790510,0,0,,
Bay House,1-108509622,SCL,31 Weston Road,,,Olney,Buckinghamshire,MK46 5BD,Tel: 01234711356,No ratings yet Rate it yourself - /Services/careproviders/LeaveReview/DefaultView.aspx?id=1-108509622,0,0,,
Bionicare (Domiciliary Care Agency),1-165412362,SCL,Woodlands Park,"Bedford Road, Clapham",,Bedford,,MK41 6EJ,Tel: 01234413600,No ratings yet Rate it yourself - /Services/careproviders/LeaveReview/DefaultView.aspx?id=1-165412362,0,0,,
Harlestone Home Care Ltd,1-2293624156,SCL,67 Main Road,Grendon,,Northampton,,NN7 1JW,Tel: 01604419600,No ratings yet Rate it yourself - /Services/careproviders/LeaveReview/DefaultView.aspx?id=1-2293624156,0,0,,
Oakfield at Yardley Hastings,1-2679264556,SCL,Castle Ashby Road,Yardley Hastings,,Northampton,Northamptonshire,NN7 1EL,Tel: 01933664222,1 rating Rate it yourself - /Services/careproviders/LeaveReview/DefaultView.aspx?id=1-2679264556,,,,
Avenue House Nursing and Care Home,1-122309790,SCL,173-175 Avenue Road,,,Rushden,Northamptonshire,NN10 0SN,,No ratings yet Rate it yourself - /Services/careproviders/LeaveReview/DefaultView.aspx?id=1-122309790,0,0,,
Manton Heights Care Centre,1-376081091,SCL,"Woodlands, off Manton Lane",,,Bedford,Bedfordshire,MK41 7LW,Tel: 01234267556,No ratings yet Rate it yourself - /Services/careproviders/LeaveReview/DefaultView.aspx?id=1-376081091,0,0,,
182 Bromham Road,1-523519169,SCL,182 Bromham Road,,,Bedford,Bedfordshire,MK40 4BP,Tel: 01234357238,No ratings yet Rate it yourself - /Services/careproviders/LeaveReview/DefaultView.aspx?id=1-523519169,0,0,,
Mahonia Care Limited,1-4423361131,SCL,344 Newton Road,,,Rushden,Northamptonshire,NN10 0SY,Tel: 07971305316,No ratings yet Rate it yourself - /Services/careproviders/LeaveReview/DefaultView.aspx?id=1-4423361131,0,0,,
Mulberry House,1-14183499647,SCL,20 Martham Close,,,Bedford,,MK40 4ND,Tel: 01525873313,No ratings yet Rate it yourself - /Services/careproviders/LeaveReview/DefaultView.aspx?id=1-14183499647,0,0,,
Milton House,1-719213394,SCL,39-41 Spenser Road,,,Bedford,Bedfordshire,MK40 2BE,Tel: 01234602741,No ratings yet Rate it yourself - /Services/careproviders/LeaveReview/DefaultView.aspx?id=1-719213394,0,0,,
Mentaur Support Services Division,1-15980798825,SCL,"Office 403, Bedford Heights",Brickhill Drive,,Bedford,,MK41 7PH,Tel: 01604717249,No ratings yet Rate it yourself - /Services/careproviders/LeaveReview/DefaultView.aspx?id=1-15980798825,0,0,,
Starsafe Care Limited,1-15765311261,SCL,Bedford Heights,Brickhill Drive,,Bedford,,MK41 7PH,Tel: 07507107218,No ratings yet Rate it yourself - /Services/careproviders/LeaveReview/DefaultView.aspx?id=1-15765311261,0,0,,
Maia Specialist Injury Rehabilitation Services,1-7232486977,SCL,Bedford Heights,Brickhill Drive,,Bedford,,MK41 7PH,Tel: 01234262863,1 rating Rate it yourself - /Services/careproviders/LeaveReview/DefaultView.aspx?id=1-7232486977,,,,
Eureka Integrated Care Limited,1-15154397183,SCL,Bedford Heights,Brickhill Drive,,Bedford,,MK41 7PH,Tel: 07490708059,No ratings yet Rate it yourself - /Services/careproviders/LeaveReview/DefaultView.aspx?id=1-15154397183,0,0,,
L & F Care Services,1-10935582009,SCL,Bedford Heights,Brickhill Drive,,Bedford,,MK41 7PH,Tel: 07869151400,No ratings yet Rate it yourself - /Services/careproviders/LeaveReview/DefaultView.aspx?id=1-10935582009,0,0,,
KYAH Social Care Services Ltd,1-12479491557,SCL,Bedford Heights,Brickhill Drive,,Bedford,,MK41 7PH,Tel: 01234954244,No ratings yet Rate it yourself - /Services/careproviders/LeaveReview/DefaultView.aspx?id=1-12479491557,0,0,,
People's Choice UK,1-2183945275,SCL,"Level 3, Unit 301, Bedford Heights Business Centre","Bedford Heights, Manton Lane",,Bedford,,MK41 7PH,Tel: 08448549445,2 ratings Rate it yourself - /Services/careproviders/LeaveReview/DefaultView.aspx?id=1-2183945275,,,,
Superior Healthcare Ltd,1-17977250017,SCL,Bedford Heights,Brickhill Drive,,Bedford,,MK41 7PH,Tel: 01234604212,No ratings yet Rate it yourself - /Services/careproviders/LeaveReview/DefaultView.aspx?id=1-17977250017,0,0,,
Gracefilled Care Service,1-6910972252,SCL,Bedford Heights,Brickhill Drive,,Bedford,,MK41 7PH,Tel: 07715550171,1 rating Rate it yourself - /Services/careproviders/LeaveReview/DefaultView.aspx?id=1-6910972252,,,,
Kingdom Healthcare Services Ltd,1-13560095659,SCL,Bedford Heights,Brickhill Drive,,Bedford,,MK41 7PH,Tel: 01234325948,No ratings yet Rate it yourself - /Services/careproviders/LeaveReview/DefaultView.aspx?id=1-13560095659,0,0,,
Careville Limited,1-5579596853,SCL,UNIT 328 Bedford Heights,Brickhill Drive,,Bedford,,MK41 7PH,Tel: 03335773351,No ratings yet Rate it yourself - /Services/careproviders/LeaveReview/DefaultView.aspx?id=1-5579596853,0,0,,
Destiny Intergrated Care Limited,1-2624913873,SCL,"Unit 224, Bedford Heights",Brickhill Drive,,Bedford,Bedfordshire,MK41 7PH,Tel: 01234331238,2 ratings Rate it yourself - /Services/careproviders/LeaveReview/DefaultView.aspx?id=1-2624913873,,,,
Social Care Solutions Ltd (Bedfordshire),1-4202089220,SCL,"Unit 303, Bedford Heights",Manton Lane,,Bedford,Bedfordshire,MK41 7PH,Tel: 01234262650,No ratings yet Rate it yourself - /Services/careproviders/LeaveReview/DefaultView.aspx?id=1-4202089220,0,0,,
Wilaade Care Services Limited,1-7933905384,SCL,Unit 429 Bedford Heights,Brickhill Drive,,Bedford,,MK41 7PH,Tel: 01234631541,No ratings yet Rate it yourself - /Services/careproviders/LeaveReview/DefaultView.aspx?id=1-7933905384,0,0,,
Ladyslaude Court,1-495331491,SCL,Bramley Way,,,Bedford,Bedfordshire,MK41 7GD,Tel: 01234214528,No ratings yet Rate it yourself - /Services/careproviders/LeaveReview/DefaultView.aspx?id=1-495331491,0,0,,
Anjulita Court,1-117977059,SCL,Bramley Way,,,Bedford,Bedfordshire,MK41 7GD,Tel: 01234273642,No ratings yet Rate it yourself - /Services/careproviders/LeaveReview/DefaultView.aspx?id=1-117977059,0,0,,
CareTech Community Services Limited - 82 Chaucer Road,1-133435656,SCL,82 Chaucer Road,,,Bedford,Bedfordshire,MK40 2AP,Tel: 01234216319,No ratings yet Rate it yourself - /Services/careproviders/LeaveReview/DefaultView.aspx?id=1-133435656,0,0,,
Warwick Manor,1-9018323988,SCL,101 Warwick Avenue,,,Bedford,,MK40 2DH,Tel: 01234630052,No ratings yet Rate it yourself - /Services/careproviders/LeaveReview/DefaultView.aspx?id=1-9018323988,0,0,,
Byron Court,1-133435618,SCL,55 Chaucer Road,,,Bedford,Bedfordshire,MK40 2AL,Tel: 01234216551,No ratings yet Rate it yourself - /Services/careproviders/LeaveReview/DefaultView.aspx?id=1-133435618,0,0,,
Florence House,1-18068297472,SCL,Little Park Farm,Hawk Drive,,Bedford,,MK41 7JF,Tel: 01234638737,No ratings yet Rate it yourself - /Services/careproviders/LeaveReview/DefaultView.aspx?id=1-18068297472,0,0,,
Azalea House,1-127549140,SCL,69-71 Winifred Road,,,Bedford,,MK40 4EP,Tel: 01234342215,No ratings yet Rate it yourself - /Services/careproviders/LeaveReview/DefaultView.aspx?id=1-127549140,0,0,,
74 Old Ford End,1-129459930,SCL,Queens Park,,,Bedford,Bedfordshire,MK40 4LY,Tel: 01234364022,No ratings yet Rate it yourself - /Services/careproviders/LeaveReview/DefaultView.aspx?id=1-129459930,0,0,,
Oasis House,1-118901623,SCL,20 Linden Road,,,Bedford,Bedfordshire,MK40 2DA,Tel: 01234346269,No ratings yet Rate it yourself - /Services/careproviders/LeaveReview/DefaultView.aspx?id=1-118901623,0,0,,
Beacon House,1-120082675,SCL,12 Linden Road,,,Bedford,Bedfordshire,MK40 2DA,,No ratings yet Rate it yourself - /Services/careproviders/LeaveReview/DefaultView.aspx?id=1-120082675,0,0,,
Annandale Lodge,1-120099700,SCL,8 Linden Road,,,Bedford,Bedfordshire,MK40 2DA,,No ratings yet Rate it yourself - /Services/careproviders/LeaveReview/DefaultView.aspx?id=1-120099700,0,0,,
Alderwood L.L.A. Limited - Irchester,1-123630928,SCL,170 Station Road,Irchester,,Wellingborough,Northamptonshire,NN29 7EW,Tel: 01604811838,No ratings yet Rate it yourself - /Services/careproviders/LeaveReview/DefaultView.aspx?id=1-123630928,0,0,,
Alderwood L.L.A. Limited - Irchester 2,1-1972590905,SCL,168 Station Road,Irchester,,Wellingborough,Northamptonshire,NN29 7EW,Tel: 01604811838,No ratings yet Rate it yourself - /Services/careproviders/LeaveReview/DefaultView.aspx?id=1-1972590905,0,0,,
Dial House Nursing and Residential Home,1-111148237,SCL,9 Dynevor Road,,,Bedford,Bedfordshire,MK40 2DB,Tel: 01234356555,No ratings yet Rate it yourself - /Services/careproviders/LeaveReview/DefaultView.aspx?id=1-111148237,0,0,,
Henrietta House,1-120099684,SCL,3 Dynevor Road,,,Bedford,Bedfordshire,MK40 2DB,,No ratings yet Rate it yourself - /Services/careproviders/LeaveReview/DefaultView.aspx?id=1-120099684,0,0,,
The Mallards,1-120099668,SCL,5 Dynevor Road,,,Bedford,Bedfordshire,MK40 2DB,,No ratings yet Rate it yourself - /Services/careproviders/LeaveReview/DefaultView.aspx?id=1-120099668,0,0,,
Caremark Bedford,1-18947626601,SCL,West One 63-67,Bromham Road,,Bedford,,MK40 2FG,Tel: 01234355437,No ratings yet Rate it yourself - /Services/careproviders/LeaveReview/DefaultView.aspx?id=1-18947626601,0,0,,
1 Lansdowne Road,1-523403409,SCL,1 Lansdowne Road,,,Bedford,Bedfordshire,MK40 2BY,Tel: 01234357339,No ratings yet Rate it yourself - /Services/careproviders/LeaveReview/DefaultView.aspx?id=1-523403409,0,0,,
Lansglade House,1-120099652,SCL,14 Lansdowne Road,,,Bedford,Bedfordshire,MK40 2BU,,No ratings yet Rate it yourself - /Services/careproviders/LeaveReview/DefaultView.aspx?id=1-120099652,0,0,,
Lotus House,1-115249983,SCL,34 Lansdowne Road,,,Bedford,Bedfordshire,MK40 2BU,Tel: 01604717249,No ratings yet Rate it yourself - /Services/careproviders/LeaveReview/DefaultView.aspx?id=1-115249983,0,0,,
Cordial Support Limited,1-12636378378,SCL,"Alperton House, 18 Hartwell Drive",Kempston,,Bedford,,MK42 8UY,Tel: 07400440865,No ratings yet Rate it yourself - /Services/careproviders/LeaveReview/DefaultView.aspx?id=1-12636378378,0,0,,
Avon's House,1-3955910547,SCL,10 Bure Close,,,Bedford,Bedfordshire,MK41 7TX,Tel: 01525873265,No ratings yet Rate it yourself - /Services/careproviders/LeaveReview/DefaultView.aspx?id=1-3955910547,0,0,,
Highfield,1-1332875228,SCL,Avon Drive,Brickhill,,Bedford,Bedfordshire,MK41 7AH,Tel: 01234346482,No ratings yet Rate it yourself - /Services/careproviders/LeaveReview/DefaultView.aspx?id=1-1332875228,0,0,,
Hamblin Care Support Service Limited,1-9895789475,SCL,20 Bradshaw Way,Irchester,,Wellingborough,,NN29 7DP,Tel: 01933710100,No ratings yet Rate it yourself - /Services/careproviders/LeaveReview/DefaultView.aspx?id=1-9895789475,0,0,,
49 Bromham Road,1-18128768583,SCL,49 Bromham Road,,,Bedford,,MK40 2AA,Tel: 07863823549,No ratings yet Rate it yourself - /Services/careproviders/LeaveReview/DefaultView.aspx?id=1-18128768583,0,0,,
Tavistock Court,1-129995323,SCL,Off Queens Street,,,Bedford,Bedfordshire,MK40 2UD,Tel: 01234718285,1 rating Rate it yourself - /Services/careproviders/LeaveReview/DefaultView.aspx?id=1-129995323,,,,
Crescent Nursing Home,1-112872374,SCL,12 The Crescent,,,Bedford,Bedfordshire,MK40 2RU,Tel: 01234266933,No ratings yet Rate it yourself - /Services/careproviders/LeaveReview/DefaultView.aspx?id=1-112872374,0,0,,
Peter's Place,1-347389985,SCL,8 The Crescent,,,Bedford,Bedfordshire,MK40 2RU,Tel: 01234266933,No ratings yet Rate it yourself - /Services/careproviders/LeaveReview/DefaultView.aspx?id=1-347389985,0,0,,
Avonfield Neurological Centre,1-12076639177,SCL,290 Station Road,Knuston,,Wellingborough,Northamptonshire,NN29 7EY,Tel: 01933413646,No ratings yet Rate it yourself - /Services/careproviders/LeaveReview/DefaultView.aspx?id=1-12076639177,0,0,,
Francis House,1-377092450,SCL,10 Gibbons Road,,,Bedford,Bedfordshire,MK40 1DQ,Tel: 01234344729,No ratings yet Rate it yourself - /Services/careproviders/LeaveReview/DefaultView.aspx?id=1-377092450,0,0,,
Kingly Terrace,1-2913026529,SCL,2 Essex Road,,,Rushden,Northamptonshire,NN10 0LG,Tel: 01933423680,No ratings yet Rate it yourself - /Services/careproviders/LeaveReview/DefaultView.aspx?id=1-2913026529,0,0,,
Samorem Health Care,1-5383517503,SCL,52a Bromham Road,,,Bedford,,MK40 2QG,Tel: 01234266444,No ratings yet Rate it yourself - /Services/careproviders/LeaveReview/DefaultView.aspx?id=1-5383517503,0,0,,
Symbiosis House,1-9116350495,SCL,"Unit 3, Trinity Gardens",9-11 Bromham Road,,Bedford,,MK40 2BP,Tel: 03330144066,No ratings yet Rate it yourself - /Services/careproviders/LeaveReview/DefaultView.aspx?id=1-9116350495,0,0,,
Rachen Healthcare LTD,1-15069951343,SCL,19 Hillary Road,,,Rushden,,NN10 9NZ,Tel: 07961851687,No ratings yet Rate it yourself - /Services/careproviders/LeaveReview/DefaultView.aspx?id=1-15069951343,0,0,,
Meadow View Care Home,1-9580783869,SCL,80 High Street,Irchester,,Wellingborough,Northamptonshire,NN29 7AB,Tel: 01933355111,No ratings yet Rate it yourself - /Services/careproviders/LeaveReview/DefaultView.aspx?id=1-9580783869,0,0,,
Telopea MSL,1-1629461074,SCL,Victoria House,70a Tavistock Street,,Bedford,Bedfordshire,MK40 2RP,Tel: 01234248969,1 rating Rate it yourself - /Services/careproviders/LeaveReview/DefaultView.aspx?id=1-1629461074,,,,
Redclyffe Residential Care Home,1-118664158,SCL,1 Pightles Terrace,,,Rushden,Northamptonshire,NN10 0LN,Tel: 01933314645,No ratings yet Rate it yourself - /Services/careproviders/LeaveReview/DefaultView.aspx?id=1-118664158,0,0,,
Rutland Road Care Home,1-618476117,SCL,37 Rutland Road,,,Bedford,Bedfordshire,MK40 1DG,Tel: 01234344729,No ratings yet Rate it yourself - /Services/careproviders/LeaveReview/DefaultView.aspx?id=1-618476117,0,0,,
K4 Care Bedford Limited,1-2672885078,SCL,131 Midland Road,,,Bedford,,MK40 1DN,,No ratings yet Rate it yourself - /Services/careproviders/LeaveReview/DefaultView.aspx?id=1-2672885078,0,0,,
Lillibet Court,1-7048849778,SCL,50 De Parys Avenue,,,Bedford,Bedfordshire,MK40 2TP,Tel: 01234212282,No ratings yet Rate it yourself - /Services/careproviders/LeaveReview/DefaultView.aspx?id=1-7048849778,0,0,,
Lillibet House,1-115483663,SCL,65 De Parys Avenue,,,Bedford,Bedfordshire,MK40 2TR,Tel: 01234272206,1 rating Rate it yourself - /Services/careproviders/LeaveReview/DefaultView.aspx?id=1-115483663,,,,
Elcombe House,1-119207152,SCL,61 De Parys Avenue,,,Bedford,Bedfordshire,MK40 2TR,Tel: 01234 266010,No ratings yet Rate it yourself - /Services/careproviders/LeaveReview/DefaultView.aspx?id=1-119207152,0,0,,
First 2 Care Service Ltd,1-2163833339,SCL,66-68 St Loyes Street,,,Bedford,Bedfordshire,MK40 1EZ,Tel: 01234930024,No ratings yet Rate it yourself - /Services/careproviders/LeaveReview/DefaultView.aspx?id=1-2163833339,0,0,,
Harmonylane Care Limited Main Office,1-17574939971,SCL,22b Foster Hill Road,,,Bedford,,MK40 2EN,,No ratings yet Rate it yourself - /Services/careproviders/LeaveReview/DefaultView.aspx?id=1-17574939971,0,0,,
22 De Parys Avenue,1-313657728,SCL,22 De Parys Avenue,,,Bedford,Bedfordshire,MK40 2TW,Tel: 01234355133,No ratings yet Rate it yourself - /Services/careproviders/LeaveReview/DefaultView.aspx?id=1-313657728,0,0,,
4 Futures,1-2731684789,SCL,49 Purvis Road,,,Rushden,Northamptonshire,NN10 9QA,Tel: 07809631802,No ratings yet Rate it yourself - /Services/careproviders/LeaveReview/DefaultView.aspx?id=1-2731684789,0,0,,
Bluebird Care Bedford,1-15349534357,SCL,"Unit 2 & 3 , Dombey Court","The Pilgrim Centre, Brickhill Drive",,Bedford,,MK41 7PZ,Tel: 01234975666,No ratings yet Rate it yourself - /Services/careproviders/LeaveReview/DefaultView.aspx?id=1-15349534357,0,0,,
Nurtured Prime Health Ltd,1-18324154405,SCL,44 Harpur Street,,,Bedford,Bedfordshire,MK40 2QT,Tel: 07481264758,No ratings yet Rate it yourself - /Services/careproviders/LeaveReview/DefaultView.aspx?id=1-18324154405,0,0,,
Orchid Homecare Ltd,1-2698597674,SCL,52 Harpur Street,,,Bedford,,MK40 2QT,Tel: 01234482483,No ratings yet Rate it yourself - /Services/careproviders/LeaveReview/DefaultView.aspx?id=1-2698597674,0,0,,
Merit Support Solutions - Main Office,1-13910917399,SCL,44 Harpur Street,,,Bedford,Bedfordshire,MK40 2QT,,No ratings yet Rate it yourself - /Services/careproviders/LeaveReview/DefaultView.aspx?id=1-13910917399,0,0,,
Rivermead,1-1332716355,SCL,Halsey Road,Kempston,,Bedford,Bedfordshire,MK42 8AU,Tel: 01234841812,No ratings yet Rate it yourself - /Services/careproviders/LeaveReview/DefaultView.aspx?id=1-1332716355,0,0,,
Brook House Residential Home,1-108658057,SCL,72 High Street,Riseley,,Bedford,Bedfordshire,MK44 1DT,Tel: 01234708077,No ratings yet Rate it yourself - /Services/careproviders/LeaveReview/DefaultView.aspx?id=1-108658057,0,0,,
Lavanda Villa,1-115250031,SCL,41 Halsey Road,Kempston,,Bedford,Bedfordshire,MK42 8AT,Tel: 01234867536,No ratings yet Rate it yourself - /Services/careproviders/LeaveReview/DefaultView.aspx?id=1-115250031,0,0,,
Brookside,1-1331903486,SCL,99 High Street,Kempston,,Bedford,Bedfordshire,MK42 7BS,Tel: 01234852324,No ratings yet Rate it yourself - /Services/careproviders/LeaveReview/DefaultView.aspx?id=1-1331903486,0,0,,
Line Of Sight Care Limited,1-5412411727,SCL,Ground Floor,57 Harpur Street,,Bedford,,MK40 2SR,Tel: 01234 910030,2 ratings Rate it yourself - /Services/careproviders/LeaveReview/DefaultView.aspx?id=1-5412411727,,,,
Victoria Cottage,1-1720213779,SCL,37 St Andrews Road,,,Bedford,Bedfordshire,MK40 2LW,Tel: 01234272757,No ratings yet Rate it yourself - /Services/careproviders/LeaveReview/DefaultView.aspx?id=1-1720213779,0,0,,
Park House,1-324565603,SCL,28 St Andrews Road,,,Bedford,Bedfordshire,MK40 2LW,Tel: 01234261993,No ratings yet Rate it yourself - /Services/careproviders/LeaveReview/DefaultView.aspx?id=1-324565603,0,0,,
Right at Home Bedford,1-12006424525,SCL,Ground Floor A 281-285,"Bedford Road, Kempston",,Bedford,,MK42 8QB,Tel: 01234481360,No ratings yet Rate it yourself - /Services/careproviders/LeaveReview/DefaultView.aspx?id=1-12006424525,0,0,,
Francis House Home Care,1-9623343003,SCL,231 Bedford Road,Kempston,,Bedford,,MK42 8DA,,No ratings yet Rate it yourself - /Services/careproviders/LeaveReview/DefaultView.aspx?id=1-9623343003,0,0,,
LightBulb Bespoke Care,1-6786668958,SCL,"Broadway House, First Floor B",4-6 The Broadway,,Bedford,,MK40 2TE,Tel: 07837870921,No ratings yet Rate it yourself - /Services/careproviders/LeaveReview/DefaultView.aspx?id=1-6786668958,0,0,,
Heart to Heart,1-7464046031,SCL,Third Floor,4-6 The Broadway,,Bedford,,MK40 2TE,Tel: 07494574446,No ratings yet Rate it yourself - /Services/careproviders/LeaveReview/DefaultView.aspx?id=1-7464046031,0,0,,
St Georges House,1-11219224730,SCL,16 St. Georges Road,,,Bedford,,MK40 2LS,Tel: 01525873265,No ratings yet Rate it yourself - /Services/careproviders/LeaveReview/DefaultView.aspx?id=1-11219224730,0,0,,
Hepworth House,1-4180678068,SCL,1 St Georges Road,,,Bedford,Bedfordshire,MK40 2LS,Tel: 01234262139,No ratings yet Rate it yourself - /Services/careproviders/LeaveReview/DefaultView.aspx?id=1-4180678068,0,0,,
Rushwell House,1-115249998,SCL,116 Wellingborough Road,,,Rushden,Northamptonshire,NN10 9TD,Tel: 01933830490,No ratings yet Rate it yourself - /Services/careproviders/LeaveReview/DefaultView.aspx?id=1-115249998,0,0,,
Lomack Healthcare,1-108814630,SCL,162 Bedford Road,Kempston,,Bedford,Bedfordshire,MK42 8BH,Tel: 01234844034,No ratings yet Rate it yourself - /Services/careproviders/LeaveReview/DefaultView.aspx?id=1-108814630,0,0,,
Autism Care UK (Bedford),1-1876623496,SCL,16 St Andrews Road,,,Bedford,Bedfordshire,MK40 2LJ,Tel: 01234349798,No ratings yet Rate it yourself - /Services/careproviders/LeaveReview/DefaultView.aspx?id=1-1876623496,0,0,,
Rushden Park,1-117965748,SCL,Melloway Road,,,Rushden,Northamptonshire,NN10 6XZ,Tel: 01933418777,No ratings yet Rate it yourself - /Services/careproviders/LeaveReview/DefaultView.aspx?id=1-117965748,0,0,,